meteorologia
type: Concept
preferred label: weather @en-gb
preferred label: Météo @fr
preferred label: Wetter @de
preferred label: Meteo @it
preferred label: 気象 @ja-jp
preferred label: meteorología @es
definition: Estudo, relatório e previsão de fenómenos meteorológicos.
definition: Etude et prévision des phénomènes météo @fr
definition: Studio, previsione e bollettini riguardanti i fenomeni meteorologici @it
definition: The study, reporting and prediction of meteorological phenomena. @en-gb
definition: Studien, Berichte und Vorhersagen meteorologischer Phänomene. @de
definition: El estudio, informe y predicción de fenómenos meteorológicos. @es
definition: 気象現象の研究、リポートおよび予測 @ja-jp
definition: Estudo, relatório e previsão de fenômenos meteorológicos.
note: nessuno @it
in scheme: subjectcode
created: 2000-10-30T12:00:00+00:00
modified: 2010-12-15T17:01:09+00:00
narrower: http://cv.iptc.org/newscodes/subjectcode/17001000
narrower: http://cv.iptc.org/newscodes/subjectcode/17002000
narrower: http://cv.iptc.org/newscodes/subjectcode/17003000
narrower: http://cv.iptc.org/newscodes/subjectcode/17004000
narrower: http://cv.iptc.org/newscodes/subjectcode/17005000