informação meteorológica
type: Concept
preferred label: weather news @en-gb
preferred label: Wetternachrichten @de
preferred label: Notizie meteo @it
preferred label: Informations météorologiques @fr
preferred label: 気象情報 @ja-jp
preferred label: informações meteorológicas
preferred label: información general sobre el eventos climatológicos @es
definition: Informação geral sobre fenômenos meteorológicos.
definition: Generelle Informationen über Ereignisse das Wetter betreffend. @de
definition: Información general acerca eventos climatologicos. @es
definition: relevé des données climatiques @fr
definition: Informação geral sobre fenómenos meteorológicos.
definition: 気象に関する一般的な情報 @ja-jp
definition: Informazioni generali sugli eventi meteo @it
definition: General information about weather events @en-gb
note: nessuno @it
in scheme: subjectcode
created: 2004-04-22T12:00:00+00:00
modified: 2012-07-10T12:00:00+00:00
broader: http://cv.iptc.org/newscodes/subjectcode/17003000
broad match: http://cv.iptc.org/newscodes/mediatopic/17000000