estatísticas (Meteo)
type: Concept
preferred label: Statistiques @fr
preferred label: 気象統計 @ja-jp
preferred label: statistic @en-gb
preferred label: Statistiche @it
preferred label: Wetterdaten @de
preferred label: estadísticas @es
definition: Numerical facts about the weather such as temperature, barometric pressure, river levels, humidity, high and low tides and the like @en-gb
definition: Información numerica acerca datos climatologicos tales como temperaturas, presión barométrica, nivel de los rios, humedad, mareas altas o bajas u otros similares. @es
definition: 温度、気圧、川の水位、湿度、干満潮のような気象に関する数値的事実 @ja-jp
definition: Fatos numéricos sobre o tempo, como temperatura, pressão atmosférica, níveis dos rios, umidade, marés altas e marés baixas, etc.
definition: Factos numéricos sobre o tempo, como temperatura, pressão atmosférica, níveis dos rios, humidade, marés altas e marés baixas, etc.
definition: Daten über das Wetter, wie Temperatur, Luftdruck, Flusspegel, Luftfeuchtigkeit, Ebbe und Flut und Ähnliches. @de
definition: Statistiche con dati meteorologici come temperatura, pressione barometrica, livello dei fiumi, alta e bassa marea, ecc. @it
definition: Informations chiffrées sur la température, la pression barométrique, le niveau des rivières, de l'hydrométrie, des marées @fr
note: nessuno @it
in scheme: subjectcode
created: 2000-10-30T12:00:00+00:00
modified: 2010-12-15T17:01:09+00:00
broader: http://cv.iptc.org/newscodes/subjectcode/17000000