Subject Code
type: ConceptScheme
pref scheme alias: subj
authority: http://www.iptc.org
rights holder: IPTC, International Press Telecommunications Council - https://iptc.org
licence link: http://creativecommons.org/licenses/by/4.0/
date released: 2022-06-14T12:00:00+00:00
definition: Indicates a subject of an item. @en-gb
note: The Subject Codes is IPTC's original subject taxonomy, with a focus on text. It consists of about 1400 terms organized into 3 levels. Note that Subject Code is now deprecated. IPTC recommends that users instead use the Media Topic vocabulary, which is regularly reviewed and updated. @en-gb
has top concept: Arte, cultura, intrattenimento
has top concept: Giustizia, Criminalità
has top concept: Disastri, Incidenti
has top concept: Economia, affari e finanza
has top concept: Istruzione
has top concept: Ambiente
has top concept: Salute
has top concept: Storie, Curiosità
has top concept: Lavoro
has top concept: Tempo libero
has top concept: Politica
has top concept: Religioni, Fedi
has top concept: Scienza, Tecnologia
has top concept: Sociale
has top concept: Sport
has top concept: Agitazioni,Conflitti, Guerre
has top concept: Meteo

Arte, cultura, intrattenimento
type: Concept
preferred label: artes, cultura e entretenimento @pt-pt
preferred label: Arts, culture, et spectacles @fr
preferred label: Kultur, Kunst, Unterhaltung @de
preferred label: 文化 @ja-jp
preferred label: arts, culture and entertainment @en-gb
preferred label: arte, cultura y espectáculos @es
definition: Tout ce qui est relatif à la création d'œuvres, au développement des facultés intellectuelles, et à leur représentation publique @fr
definition: Assuntos relativos ao progresso e ao aperfeiçoamento da mente humana, de interesses, conhecimentos, gostos e emoções. @pt-br
definition: Matters pertaining to the advancement and refinement of the human mind, of interests, skills, tastes and emotions @en-gb
definition: Asuntos pertinentes al avance y refinamiento de la mente humana, intereses, habilidades, gustos y emociones. @es
definition: 人間の精神や興味、技能、嗜好、感情の進歩や洗練に関係する事柄 @ja-jp
definition: Sachverhalte, die die Veränderung und Weiterentwicklung des menschlichen Geistes, der Interessen, des Geschmacks, der Fähigkeiten und der Gefühle betreffen. @de
definition: Creazione e rappresentazione dell'opera d'arte, gli interessi intellettuali, il gusto e le emozioni umane
note: nessuno
in scheme: Subject Code
created: 2000-10-30T12:00:00+00:00
modified: 2010-12-15T17:01:09+00:00
narrower: Archeologia
narrower: Architettura
narrower: Corrida
narrower: Feste, Carnevale
narrower: Cinema
narrower: Ballo
narrower: Moda
narrower: Linguaggio
narrower: Biblioteche, musei
narrower: Letteratura
narrower: Musica
narrower: Pittura
narrower: Fotografia
narrower: Radio
narrower: Scultura
narrower: Televisione
narrower: Teatro
narrower: Monumenti, Siti storici
narrower: Tradizioni
narrower: Arti (generico)
narrower: Intrattenimento (generico)
narrower: Cultura (generico)
narrower: Locali notturni
narrower: Fumetti
narrower: Animazione
narrower: Mass Media
narrower: Internet
narrower: Storia

Archeologia
type: Concept
preferred label: Archéologie @fr
preferred label: arqueologia @pt-pt
preferred label: 考古学 @ja-jp
preferred label: arqueología @es
preferred label: Archäologie @de
preferred label: archaeology @en-gb
definition: Probing the past through ruins and artefacts @en-gb
definition: 遺跡や人工遺物を通して過去を探ること @ja-jp
definition: Comprovar o passado mediante ruínas e artefatos. @pt-br
definition: Studio delle civiltà e delle culture del passato attraverso la raccolta e documentazione delle tracce e vestigia lasciate
definition: Cmprobar elpasado mediante ruinas y artefactos @es
definition: Erforschen der Vergangenheit anhand von Ruinen und alten Gebrauchsgegenständen. @de
definition: Disciplina científica que estuda o modo de vida do passado através de vestígios materiais. @pt-pt
definition: Science étudiant les vestiges matériels des civilisations du passé @fr
note: nessuno
in scheme: Subject Code
created: 2000-10-30T12:00:00+00:00
modified: 2010-12-15T17:01:09+00:00
broader: Arte, cultura, intrattenimento

Architettura
type: Concept
preferred label: arquitetura @pt-br
preferred label: architecture @en-gb
preferred label: Architecture @fr
preferred label: arquitectura @es
preferred label: 建築 @ja-jp
preferred label: Architektur @de
definition: Conception des immeubles, des monuments et des espaces qui les entourent @fr
definition: Construção de edifícios, monumentos e espaços envolventes. @pt-br
definition: Arte de projetar e construir edifícios, monumentos e espaços envolventes. @pt-pt
definition: 建物、記念碑とその周辺のスペースを設計すること @ja-jp
definition: Designing of buildings, monuments and the spaces around them @en-gb
definition: Ideazione e progettazione di edifici, monumenti e degli spazi loro circostanti
definition: Diseño de edificios, monumentos y espáciosalrededor de ellos @es
definition: Entwurf von Gebäuden, Denkmälern und deren Umgebung. @de
note: nessuno
in scheme: Subject Code
created: 2000-10-30T12:00:00+00:00
modified: 2010-12-15T17:01:09+00:00
broader: Arte, cultura, intrattenimento

Corrida
type: Concept
preferred label: tourada @pt-br
preferred label: toros @es
preferred label: bullfighting @en-gb
preferred label: Tauromachie @fr
preferred label: Stierkampf @de
preferred label: 闘牛 @ja-jp
definition: Tauromachie, combat entre un homme et un taureau @fr
definition: Clasico enfrentamiento entre Toro y Hombre. @es
definition: Klassischer Wettkampf Mann gegen Stier. @de
definition: Classical contest pitting man against the bull @en-gb
definition: Tradizionale combattimento fra uomo e toro
definition: Espetáculo tradicional de Portugal, Espanha e França, também popular em alguns países da América do Sul, que consiste na lide de touros bravos. @pt-pt
definition: 人間を雄牛と戦わせる伝統的な競技 @ja-jp
definition: Combate clássico entre homem e touro. @pt-br
note: nessuno
in scheme: Subject Code
created: 2000-10-30T12:00:00+00:00
modified: 2010-12-15T17:01:09+00:00
broader: Arte, cultura, intrattenimento

Feste, Carnevale
type: Concept
preferred label: carnaval @es
preferred label: festividades - inclui Carnaval @pt-br
preferred label: festive event (including carnival) @en-gb
preferred label: 祭り・イベント @ja-jp
preferred label: Feste, Karneval @de
preferred label: Festivals et carnavals @fr
definition: Parate, feste, celebrazioni ed eventi simili non necessariamente legati ad occasioni o date fisse
definition: Paradas, festas, celebrações e eventos afins não necessariamente relacionados com uma ocasião ou data em particular. @pt-pt
definition: Fêtes, carnavals, défilés, et autres célébrations festives pas forcément liés à une date récurente @fr
definition: Paradas, festas, celebrações e eventos afins não necessariamente relacionados a uma ocasião ou data em particular. @pt-br
definition: Paradas, fiestas, celebraciones y eventos no necesariamente relacionados a una ocasión o fecha en particular @es
definition: Parades, parties, celebrations and the like not necessarily tied to a fixed occasion or date @en-gb
definition: Paraden, Parties, Feiern und Ähnliches nicht notwendigerweise an ein Ereignis oder Datum gekoppelt. @de
definition: 決まった機会や日付に必ずしも結び付けられないパレード、パーティー、祝賀およびそれらに類したもの @ja-jp
note: nessuno
in scheme: Subject Code
created: 2000-10-30T12:00:00+00:00
modified: 2010-12-15T17:01:09+00:00
broader: Arte, cultura, intrattenimento

Cinema
type: Concept
preferred label: cinema @pt-pt
preferred label: 映画 @ja-jp
preferred label: cine @es
preferred label: Film @de
preferred label: Cinéma @fr
definition: Historias relacionadas al cine como arte y entretención @es
definition: Histórias relativas ao cinema como arte e entretenimento. @pt-br
definition: Cinema as art and entertainment @en-gb
definition: Procédé d'enregistrement et de projection de vues photographiques animées et art de réaliser des films @fr
definition: Ideazione, produzione, realizzazione di storie attraverso la pellicola cinematografica e fruizione da parte del pubblico
definition: 芸術や娯楽としての映画と関連した記事 @ja-jp
definition: Film im künstlerischen und unterhaltenden Sinn @de
note: nessuno
in scheme: Subject Code
created: 2000-10-30T12:00:00+00:00
modified: 2010-12-15T17:01:09+00:00
broader: Arte, cultura, intrattenimento
narrower: Festival Cinema

Ballo
type: Concept
preferred label: Danse @fr
preferred label: dance @en-gb
preferred label: dança @pt-br
preferred label: ダンス @ja-jp
preferred label: Tanz @de
preferred label: danza @es
definition: The expression of emotion or message through movement @en-gb
definition: Expressão de emoções ou mensagens através do movimento do corpo. @pt-pt
definition: Der Ausdruck von Gefühlen durch Bewegung. @de
definition: Expressão de emoções ou mensagens através do movimento. @pt-br
definition: Suite de mouvements rythmés exprimant un message ou une émotion @fr
definition: Comunicazione di un'emozione o messaggio attraverso il movimento.
definition: La expresion de emociones o mensajes a través del movimiento @es
definition: 身体動作による感情やメッセージの表現 @ja-jp
note: nessuno
in scheme: Subject Code
created: 2000-10-30T12:00:00+00:00
modified: 2010-12-15T17:01:09+00:00
broader: Arte, cultura, intrattenimento

Moda
type: Concept
preferred label: moda @pt-br
preferred label: Mode @de
preferred label: ファッション @ja-jp
preferred label: fashion @en-gb
definition: Espressione di un gusto e di una cultura nel disegno e nella creazione di abiti e accessori, l'industria, le sfilate, il design
definition: 衣類とアクセサリーのデザイン @ja-jp
definition: Criação de roupa e de acessórios. @pt-pt
definition: Manière peu durable et collective d'agir, de penser, de se vêtir, etc. @fr
definition: El diseño de ropas o accesorios @es
definition: Der Entwurf von Kleidern und Accessoires. @de
definition: The design of clothing and accessories @en-gb
note: nessuno
in scheme: Subject Code
created: 2000-10-30T12:00:00+00:00
modified: 2010-12-15T17:01:09+00:00
broader: Arte, cultura, intrattenimento
narrower: Gioielli

Linguaggio
type: Concept
preferred label: language @en-gb
preferred label: Sprache @de
preferred label: Langue @fr
preferred label: linguagem @pt-pt
preferred label: língua @pt-br
preferred label: lenguaje @es
preferred label: 言語 @ja-jp
definition: Meio através do qual as pessoas comunicam umas com as outras. @pt-pt
definition: Die Mittel mit denen Menschen miteinander kommunizieren. @de
definition: Forme attraverso le quali le persone comunicano.
definition: The means by which people communicate with each other @en-gb
definition: La forma en que la gente se comunica, los unos a los otros. @es
definition: 人がお互いに情報を伝達する手段 @ja-jp
definition: Faculté de communiquer au moyen de la parole @fr
note: nessuno
in scheme: Subject Code
created: 2000-10-30T12:00:00+00:00
modified: 2010-12-15T17:01:09+00:00
broader: Arte, cultura, intrattenimento

Biblioteche, musei
type: Concept
preferred label: bibliotecas e museus @pt-br
preferred label: Bibliothèque et musée @fr
preferred label: bibliotecas y museos @es
preferred label: 図書館・博物館 @ja-jp
preferred label: library and museum @en-gb
preferred label: Bibliothek und Museum @de
definition: 公共の使用や展示を目的とする、過去から現代までの本、音楽、芸術、あるいはオブジェクトの収集を収容するために使われる建造物 @ja-jp
definition: Edifices used to house collections of books, music, art, or objects from the past and present for public use and display @en-gb
definition: Collezioni di libri, musica, arte, o oggetti del passato e del presente per fruizione da parte del pubblico o per esposizione.
definition: Bâtiments ouverts au public pour la consultation de livres et de disques ou l'exposition de collections d'objets d'arts @fr
definition: Edifícios utilizados para albergar coleções de livros, música, arte ou objetos do passado e do presente para uso público e exibição. @pt-br
definition: Edificios utilizados para albergar colecciones de libros, música, arte u objetos del pasado y presente para su exhibición pública. @es
definition: Gebäude, die Sammlungen von Büchern, Musik, Kunst oder Objekte aus Vergangenheit und Gegenwart, zur öffentlichen Nutzung und Ansicht bereitstellen. @de
note: nessuno
in scheme: Subject Code
created: 2000-10-30T12:00:00+00:00
modified: 2010-12-15T17:01:09+00:00
broader: Arte, cultura, intrattenimento

Letteratura
type: Concept
preferred label: literature @en-gb
preferred label: 文学 @ja-jp
preferred label: literatura @es
preferred label: Literatur @de
preferred label: Littérature @fr
definition: Ensemble des œuvres écrites @fr
definition: 思想、物語あるいはその他のメッセージを大衆に伝えるためのパンフレット、本あるいはその他の印刷物の使用 @ja-jp
definition: El uso de panfletos, libros u otro material impreso para comunicar ideas, historias u otros mensajes al público. @es
definition: Uso de panfletos, livros ou outros materiais impressos para transmitir ideias, histórias ou mensagens ao público. @pt-br
definition: Die Nutzung von Broschüren, Büchern oder anderen Printmedien, um Ideen, Geschichten oder andere Botschaften in der Öffentlichkeit zu verbreiten. @de
definition: Opuscoli, libri o altro materiale stampato per comunicare al pubblico idee, storie o altri messaggi.
definition: The use of pamphlets, books or other printed matter to convey ideas, stories or other messages for the public @en-gb
note: nessuno
in scheme: Subject Code
created: 2000-10-30T12:00:00+00:00
modified: 2010-12-15T17:01:09+00:00
broader: Arte, cultura, intrattenimento
narrower: Narrativa
narrower: Poesia

Musica
type: Concept
preferred label: Musique @fr
preferred label: música @pt-pt
preferred label: Musik @de
preferred label: 音楽 @ja-jp
preferred label: music @en-gb
definition: Expressão de emoções ou mensagens através de instrumentos ou voz, usando diferentes sons, tons e harmonias. @pt-br
definition: Ausdruck von Gefühlen oder Botschaften durch Instrumente oder Stimmen, die unterschiedliche Klänge, Töne, Harmonien und ähnliches erzeugen. @de
definition: 異なる音量、音質、調和などを使い、楽器又は音声を通じて感情やメッセージを表現すること @ja-jp
definition: Expresar emociones o mensajes a través de instrumentos o voz usando diferentes sonidos, tonos y harmonías smiliares. @es
definition: Expressing emotion or message through instruments or voice using different sounds, tones, harmonies and the like @en-gb
definition: Espressione di un'emozione o di un messaggio attraverso l'uso di strumenti e/o della voce per mezzo di differenti suoni, toni, armonie
definition: Art de combiner les sons au moyen d'instruments ou de la voix @fr
note: nessuno
in scheme: Subject Code
created: 2000-10-30T12:00:00+00:00
modified: 2010-12-15T17:01:09+00:00
broader: Arte, cultura, intrattenimento
narrower: Classica
narrower: música folclórica
narrower: Jazz
narrower: música popular
narrower: Country
narrower: Rock and roll
narrower: hip-hop

Pittura
type: Concept
preferred label: pintura @pt-br
preferred label: painting @en-gb
preferred label: Peinture @fr
preferred label: 絵画 @ja-jp
preferred label: Malerei @de
definition: 感情やメッセージを表現するため、様々な下地に、油絵の具、水彩絵の具、パステル、鉛筆、チョーク、クレヨンなどの媒体を用いること @ja-jp
definition: Expressão de emoções ou mensagens através do uso de óleos, aquarelas, pastéis, lápis, carvão, etc. em diversas bases. @pt-br
definition: Por medio de aceite, acuarela, pateles, lapices, tiza, crayones, etc., en distintas bases para expresar un sentimiento o mensaje @es
definition: Art d'appliquer des couleurs sur une surface @fr
definition: Nutzung der Möglichkeiten von Öl, Wasserfarbe, Pastellfarbe, Stiften, Kreide etc. auf verschiedenartigem Untergrund, als Ausdruck von Gefühlen und Botschaften. @de
definition: Using the mediums of oils, watercolour, pastel, pencils, chalk, crayon etc on various grounds to express emotion or message @en-gb
definition: Espressione di un'emozione o di un messaggio attraverso l'uso di strumenti di raffigurazione ad olio, tempera, pastelli, matite, gesso, matite a pastello, ecc... su varie superfici.
definition: Expressão de emoções ou mensagens através do uso de óleos, aguarelas, pastéis, lápis, carvão, etc, em diversas bases. @pt-pt
note: nessuno
in scheme: Subject Code
created: 2000-10-30T12:00:00+00:00
modified: 2010-12-15T17:01:09+00:00
broader: Arte, cultura, intrattenimento

Fotografia
type: Concept
preferred label: photography @en-gb
preferred label: Fotografie @de
preferred label: fotografia @pt-pt
preferred label: 写真 @ja-jp
preferred label: Photographie @fr
preferred label: fotografía @es
definition: Meio mecânico de criar imagens mediante o uso da luz e de materiais sensíveis à luz, com químicos ou mediante meios digitais. @pt-pt
definition: Procedimento che permette di creare immagini e di fissarle su di una superficie utilizzando la luce e materiali ad essa sensibili con prodotti chimici, o per mezzo di strumenti e procedimenti digitali.
definition: 光と科学薬品を用いた感光剤を使用する手段やデジタル的な手段によって、対象の画像を作り出す機械的な手法 @ja-jp
definition: Forma mecánica de crear imágenes de objetos mediante el uso de luz y materiales sentitivos a la luz, con quimicos u mediante medios digitales. @es
definition: Art de fixer l'image de sujets ou d'objets par l'utilisation de la lumière sur une surface sensible ou par enregistrement numérique @fr
definition: Technik, Bilder von Objekten herzustellen, unter Benutzung von Licht und lichtempfindlichem Material, mit Hilfe von chemischen oder digitalen Mitteln. @de
definition: Mechanical means of creating images of objects by use of light and light sensitive materials with chemicals or by digitals means @en-gb
note: nessuno
in scheme: Subject Code
created: 2000-10-30T12:00:00+00:00
modified: 2010-12-15T17:01:09+00:00
broader: Arte, cultura, intrattenimento

Radio
type: Concept
preferred label: radio @en-gb
preferred label: ラジオ番組 @ja-jp
preferred label: rádio @pt-pt
definition: Hörfunk im künstlerischen und unterhaltenden Sinn @de
definition: Histórias relativas à rádio como arte e entretenimento. @pt-br
definition: Radio as art and entertainment @en-gb
definition: Média parlé en tant qu'instrument de distraction @fr
definition: Historias relacionadas a la radio como arte y entretención @es
definition: Strumento di comunicazione di massa, notizie collegate ad esso come arte e spettacolo
definition: 芸術と娯楽としてのラジオと関連した記事 @ja-jp
note: nessuno
in scheme: Subject Code
created: 2000-10-30T12:00:00+00:00
modified: 2010-12-15T17:01:09+00:00
broader: Arte, cultura, intrattenimento

Scultura
type: Concept
preferred label: 彫刻 @ja-jp
preferred label: Skulptur und Installation @de
preferred label: escultura @pt-br
preferred label: sculpture @en-gb
preferred label: Sculpture @fr
definition: Representação de formas em barro, pedra, madeira, metal ou outros materiais. @pt-br
definition: 粘土、石、木、金属、その他の材料で、形状を表現すること @ja-jp
definition: Representation of forms in clays, stone, woods, metals or other materials @en-gb
definition: Art de représenter des formes dans ou avec divers matériaux @fr
definition: Darstellung von Formen in Ton, Stein, Holz, Metall oder anderen Materialien. @de
definition: Representacion de formas en arcilla, piedra, madera, metales u otros materiales @es
definition: Espressione di un'emozione o di un messaggio con rappresentazioni di forme in materiali di vario tipo (argilla, pietra, legno, metalli, o altro)
note: nessuno
in scheme: Subject Code
created: 2000-10-30T12:00:00+00:00
modified: 2010-12-15T17:01:09+00:00
broader: Arte, cultura, intrattenimento
narrower: Arti plastiche

Televisione
type: Concept
preferred label: televisão @pt-pt
preferred label: television @en-gb
preferred label: televisión @es
preferred label: Télévision @fr
preferred label: テレビ番組 @ja-jp
preferred label: Fernsehen @de
definition: Strumento di comunicazione di massa, notizie collegate ad esso come arte e spettacolo
definition: Television as art and entertainment @en-gb
definition: Fernsehen im künstlerischen und unterhaltenden Sinn @de
definition: Historias relacionadas a la televisión como arte y entretención @es
definition: Histórias relativas à televisão como arte e entretenimento. @pt-pt
definition: Média audiovisuel en tant qu'instrument de distraction @fr
definition: 芸術と娯楽としてのテレビと関連した記事 @ja-jp
note: nessuno
in scheme: Subject Code
created: 2000-10-30T12:00:00+00:00
modified: 2010-12-15T17:01:09+00:00
broader: Arte, cultura, intrattenimento
narrower: Soap Opera

Teatro
type: Concept
preferred label: teatro @pt-br
preferred label: Théâtre @fr
preferred label: theatre @en-gb
preferred label: 演劇 @ja-jp
preferred label: Theater @de
definition: Representar uma história ou ideia através de diálogos, música e expressão física, em espaço ou edifício concebido para o efeito. @pt-pt
definition: Art de la représentation sur une scène d'œuvres dramatiques ou comiques @fr
definition: 専用に作られた空間、建物の中で、会話、音楽、身体の表現を通じて、物語や思想を伝えること @ja-jp
definition: Telling of a story or idea through dialogue, music and physical expression in a space or building designed for it @en-gb
definition: Rappresentazione artistica sulla scena per raccontare una storia o un'idea attraverso il dialogo e/o la musica
definition: Erzählen einer Geschichte oder Idee durch Dialoge, Musik oder körperlichen Ausdruck in einem Raum oder Gebäude, welches dafür entworfen wurde. @de
definition: relatar una historia o idea a través de un dialogo, súsica y expresion fisica, en un espacio o edificio diseñado para ello. @es
note: nessuno
in scheme: Subject Code
created: 2000-10-30T12:00:00+00:00
modified: 2010-12-15T17:01:09+00:00
broader: Arte, cultura, intrattenimento
narrower: Musica a Teatro

Monumenti, Siti storici
type: Concept
preferred label: monumentos @pt-br
preferred label: monumentos e património @pt-pt
preferred label: Patrimoine @fr
preferred label: Denkmal und Gedenkstätte @de
preferred label: monumentos y patrimonio nacional @es
preferred label: monument and heritage site @en-gb
preferred label: 遺跡・文化財 @ja-jp
definition: Flächen mit Objekten in Gedenken an historische Personen oder Ereignisse. @de
definition: Aree o opere che commemorano personaggi o eventi di rilevanza storica
definition: Áreas que contêm objetos comemorativos da história, de um povo ou de eventos. @pt-br
definition: 歴史的な人々又は出来事に対して、記念となる対象を持つ区域 @ja-jp
definition: Areas containing commemorative objects for historical people or events @en-gb
definition: Sites historiques @fr
definition: Construção ou obra que comemora alguém ou algum facto memorável. @pt-pt
definition: Areas que contienen objetos conmemorativos de la historia, gente o eventos. @es
note: nessuno
in scheme: Subject Code
created: 2000-10-30T12:00:00+00:00
modified: 2010-12-15T17:01:09+00:00
broader: Arte, cultura, intrattenimento
narrower: Istituzioni - ANNULLATO

Tradizioni
type: Concept
preferred label: Coutumes et traditions @fr
preferred label: costumes e tradições @pt-br
preferred label: 伝統 @ja-jp
preferred label: Brauchtum @de
preferred label: customs and tradition @en-gb
preferred label: costumbres y tradiciones @es
definition: A particular way of behaving, or observances that have developed over time by a group of people @en-gb
definition: Eine spezielle Verhaltensweise oder Brauch, die sich für eine bestimmte Gruppe von Menschen über einen Zeitraum entwickelt hat. @de
definition: Comportamentos ou atitudes que se desenvolveram ao longo do tempo entre um grupo de pessoas. @pt-pt
definition: una forma en particular de comportarse, o actitudes que se desarrollan con el tiempo por un grupo de personas. @es
definition: L'ensemble des us et coutumes @fr
definition: Usi e costumi di una comunità sviluppatisi nel corso del tempo
definition: 人々の集団によって長い間に発展させられて来た特別なふるまいの慣習、又はしきたり @ja-jp
note: nessuno
in scheme: Subject Code
created: 2000-10-30T12:00:00+00:00
modified: 2010-12-15T17:01:09+00:00
broader: Arte, cultura, intrattenimento

Arti (generico)
type: Concept
preferred label: Kunst @de
preferred label: artes (geral) @pt-pt
preferred label: 芸術（一般） @ja-jp
preferred label: Arts @fr
preferred label: arts (general) @en-gb
preferred label: artes (general) @es
definition: The collective expression of message or emotion through music, literature, painting, theatre or other means @en-gb
definition: Espressione di un messaggio o un'emozione attraverso musica, letteratura, pittura, teatro o altri mezzi.
definition: Zusammenfassender Ausdruck einer Botschaft oder eines Gefühls durch Musik, Literatur, Malerei, Theater oder andere Mittel. @de
definition: Les arts en général, peinture, sculpture, etc. @fr
definition: Expresiones colectivas de un mensaje o emoción a través de música, literatura, pintura, teatro u otros medios. @es
definition: 音楽、文学、絵画、演劇、その他の手法を用いてメッセージ又は感情の集積した表現 @ja-jp
definition: Expressão de emoções ou mensagens através de música, literatura, pintura, teatro ou outros meios. @pt-br
note: nessuno
in scheme: Subject Code
created: 2000-10-30T12:00:00+00:00
modified: 2010-12-15T17:01:09+00:00
broader: Arte, cultura, intrattenimento
broad match: http://cv.iptc.org/newscodes/mediatopic/20000002

Intrattenimento (generico)
type: Concept
preferred label: Unterhaltung @de
preferred label: espectáculos (general) @es
preferred label: Divertissement @fr
preferred label: 芸能（一般） @ja-jp
preferred label: entertainment (general) @en-gb
preferred label: entretenimento (geral) @pt-pt
definition: Spettacolo attraverso tv, radio, teatro, musica e altri mezzi per intrattenere un pubblico
definition: テレビ、ラジオ、演劇、音楽など大衆のための娯楽の総称 @ja-jp
definition: Nutzung der Möglichkeiten von Fernsehen, Radio, Theater, Musik und ähnlichem, zum Zweck der Unterhaltung von Menschen. @de
definition: Uso coletivo de televisão, rádio, teatro, música e afins para o entretenimento das pessoas. @pt-pt
definition: Les spectacles de distraction en général, télévision, radio, théâtre, musique @fr
definition: El uso colectivo de televisión, radio, teatro, música y el gusto por el entretenimiento de la gente. @es
definition: The collective use of television, radio, theatre, music and the like for the amusement of people @en-gb
note: nessuno
in scheme: Subject Code
created: 2000-10-30T12:00:00+00:00
modified: 2010-12-15T17:01:09+00:00
broader: Arte, cultura, intrattenimento
narrower: Premi
broad match: http://cv.iptc.org/newscodes/mediatopic/20000002

Cultura (generico)
type: Concept
preferred label: cultura (geral) @pt-pt
preferred label: Kultur @de
preferred label: Culture @fr
preferred label: 文化（一般） @ja-jp
preferred label: cultura (general) @es
preferred label: culture (general) @en-gb
definition: Insieme delle idee, costumi, arti, attitudini di un determinato gruppo o di una determinata società.
definition: Ideias, costumes, artes, competências de um grupo em particular. @pt-pt
definition: 特定の集団の思想、習慣、芸術、技術 @ja-jp
definition: The ideas, customs, arts, skills of a particular group @en-gb
definition: L'ensemble des connaissances assimilées par une société donnée @fr
definition: Las ideas, costumbres, artes, aptitudes de un grupo en particular @es
definition: Die Ideen, Bräuche, Künste, Fertigkeiten einer bestimmten Gruppe. @de
note: nessuno
in scheme: Subject Code
created: 2000-10-30T12:00:00+00:00
modified: 2010-12-15T17:01:09+00:00
broader: Arte, cultura, intrattenimento
narrower: Sviluppo culturale

Locali notturni
type: Concept
preferred label: Boîte de nuit @fr
preferred label: Nachtclub @de
preferred label: nightclubs @pt-pt
preferred label: clubes nocturnos @es
preferred label: nightclub @en-gb
preferred label: ライブハウス @ja-jp
definition: Estabelecimento comercial que fornece música e outras formas de entretenimento, assim como comida e bebida, a uma clientela seleta. @pt-pt
definition: 選ばれた客に対し、食べ物や飲み物のほかに音楽や他の娯楽を提供する商業施設 @ja-jp
definition: Kommerzielle Einrichtung für ein ausgewähltes Klientel, die Musik oder andere Unterhaltung anbietet, begleitet mit Essen und Trinken. @de
definition: Etablissement de distraction privé, ouvert la nuit @fr
definition: A commercial establishment providing music, or other entertainment along with food and drink to selected clientele @en-gb
definition: Esercizi aperti in orari notturni dove è possibile fruire di musica e/o di altre forme di intrattenimento e spettacolo
definition: Un establecimiento comercial que provee música u otro entretenimiento, junto con comida y bebidas a una clientela selecta. @es
note: nessuno
in scheme: Subject Code
created: 2000-10-30T12:00:00+00:00
modified: 2010-12-15T17:01:09+00:00
broader: Arte, cultura, intrattenimento

Fumetti
type: Concept
preferred label: Comic @de
preferred label: caricaturas @es
preferred label: cartoon @pt-pt
preferred label: 漫画 @ja-jp
preferred label: Bande dessinée @fr
definition: Still images such as editorial cartoons and comic strips @en-gb
definition: Illustrazioni editoriali, caricature e vignette
definition: Unbewegte Bilder, wie Karikaturen und Comics. @de
definition: Imágenes como caricaturas editoriales y tiras cómicas @es
definition: Dessin éditorial, caricatures et bandes dessinées @fr
definition: 時事漫画やコミック漫画のような静止画 @ja-jp
definition: Banda desenhada, geralmente de carácter humorístico. @pt-pt
definition: Imagens como caricaturas editoriais e tiras de quadrinhos. @pt-br
note: nessuno
in scheme: Subject Code
created: 2000-10-30T12:00:00+00:00
modified: 2010-12-15T17:01:09+00:00
broader: Arte, cultura, intrattenimento

Animazione
type: Concept
preferred label: animação @pt-pt
preferred label: Dessin animé @fr
preferred label: animation @en-gb
preferred label: Animation/Zeichentrick @de
preferred label: animación @es
preferred label: アニメ @ja-jp
definition: Cartoni animati, lungo e cortometraggi, artisti e commercializzazione di oggetti collegati a personaggi di cartoni animati
definition: Animação, incluindo longas e curtas-metragens, artistas e comercialização de produtos com personagens de animação. @pt-br
definition: Animation, including full-length and short cinema, artists and merchandising of goods featuring animation characters. @en-gb
definition: Notícias referentes à técnica que permite dar a desenhos ou bonecos a ilusão de movimento, aos artistas envolvidos e à comercialização de produtos com personagens dos filmes daí resultantes. @pt-pt
definition: Zeichentrickfilm, auch Kurzfilmkino, Künstler und Vermarktung von Produkten rund um Zeichentrickfiguren. @de
definition: Dessins animés de toutes sortes @fr
definition: Animaciones incluidas cine de larga y corta duración, artistas y merchandising de artículos de las figuras animadas. @es
definition: アニメーションムービーに関する、長編･短編の作品、作家、そしてキャラクター商品の販売 @ja-jp
note: nessuno
in scheme: Subject Code
created: 2000-10-30T12:00:00+00:00
modified: 2010-12-15T17:01:09+00:00
broader: Arte, cultura, intrattenimento

Mass Media
type: Concept
preferred label: media @pt-pt
preferred label: Média @fr
preferred label: mídia (cultura) @pt-br
preferred label: マスメディア @ja-jp
preferred label: medios masivos @es
preferred label: Massenmedien @de
preferred label: mass media @en-gb
definition: TV, radio, diarios, revistas. @es
definition: Television, radio, magazines, newspapers etc @en-gb
definition: Mezzi di comunicazione di massa: televisione, radio, riviste, giornali, ecc ...
definition: Televisão, rádio, revistas, jornais, etc. @pt-br
definition: テレビ、ラジオ、雑誌、新聞など @ja-jp
definition: Fernsehen, Radio, Magazine, Zeitungen etc. @de
definition: Télévision, radio, magazines, journaux, etc. @fr
note: nessuno
in scheme: Subject Code
created: 2003-04-05T12:00:00+00:00
modified: 2012-07-10T12:00:00+00:00
broader: Arte, cultura, intrattenimento
narrower: Periodici
narrower: Mezzi informazione
narrower: Giornali
narrower: Recensioni

Internet
type: Concept
preferred label: インターネット @ja-jp
preferred label: internet @es
definition: Internet as art and entertainment @en-gb
definition: Il web e le sue potenzialità nel mondo della comunicazione e nell'intrattenimento
definition: Historias relacionadas con Internet, como arte y entretenimiento. @es
definition: Histoires liées à l'internet comme instrument d'art et de distraction @fr
definition: Histórias relativas à Internet como arte e entretenimento. @pt-br
definition: Internet im künstlerischen und unterhaltenden Sinn @de
definition: 芸術や芸能に関するインターネットの記事 @ja-jp
note: nessuno
in scheme: Subject Code
created: 2003-11-26T12:00:00+00:00
modified: 2012-07-10T12:00:00+00:00
broader: Arte, cultura, intrattenimento

Storia
type: Concept
preferred label: 歴史 @ja-jp
preferred label: Historisches @de
preferred label: história @pt-br
preferred label: history @en-gb
definition: *Assuntos relacionados ao passado; descobertas, restauro, conservação e exibição de artefatos; comemorações de eventos históricos.* @pt-br
definition: 過去や発見、修復、保存、営造物の展示、歴史的出来事の記念などに関わる問題 @ja-jp
definition: Issues connected with the past; discoveries, repair, conservation or display of artifacts; anniversaries of historic events @en-gb
definition: *Assuntos relacionados com o passado; descobertas, restauro, conservação e exibição de artefactos; comemorações de eventos históricos.* @pt-pt
definition: Artikel, die sich auf die Vergangenheit beziehen; Entdeckungen, Restauration, Aufbewahrung und Ausstellung altertümlicher (Kunst)Gegenständen; Jahrestage historischer Ereignisse. @de
definition: Fatti connessi con il passato: scoperte, conservazione o scoperte di manufatti, anniversari di eventi di portata storica
note: nessuno
in scheme: Subject Code
created: 2006-08-21T12:00:00+00:00
modified: 2012-07-10T12:00:00+00:00
broader: Arte, cultura, intrattenimento

Festival Cinema
type: Concept
preferred label: 映画祭 @ja-jp
preferred label: Filmfestival @de
preferred label: festivais de cinema @pt-br
preferred label: Festival de cinéma @fr
preferred label: festival de cine @es
preferred label: film festival @en-gb
definition: Historias acerca de u festival de peliculas nacional o internacional, selecciones, jurados, moninaciones, premios, etc. @es
definition: Nationale und internationale Festivals der bewegten Bilder, deren Auswahl, Nominierungen, Preise, Auszeichnungen und Juris. @de
definition: Histórias sobre festivais, seleções, júris, nomeações e prémios de cinema. @pt-pt
definition: 国内的及び国際的な映画祭におけるストーリー、セレクション、審査員、ノミネート、賞など @ja-jp
definition: Festival e rassegne cinematografiche, selezioni, giurie, candidature, premi, ecc.
definition: Histórias sobre festivais, seleções, júris, nomeações e prémios de cinema, nacionais e internacionais. @pt-br
definition: Festivals nationaux ou internationaux de cinéma, récompenses, jurys @fr
definition: National and international motion pictures festivals, selections, festival juries, nominations, awards etc. @en-gb
note: nessuno
in scheme: Subject Code
created: 2004-04-22T12:00:00+00:00
modified: 2012-07-10T12:00:00+00:00
broader: Cinema

Gioielli
type: Concept
preferred label: joias @pt-br
preferred label: Joaillerie @fr
preferred label: joyas @es
preferred label: Schmuck @de
preferred label: アクセサリー @ja-jp
preferred label: jewelry @en-gb
definition: Accessori ornamentali da indossare, di solito realizzati con metalli o altri materiali nobili ma anche la bigiotteria
definition: Joias como acessórios de roupa. @pt-br
definition: Accessories to clothing @en-gb
definition: Accessoires zur Kleidung. @de
definition: Accesorios de vestimentas @es
definition: 衣服に付けるアクセサリー @ja-jp
definition: Joyaux et bijoux accessoires à l'habillement @fr
note: nessuno
in scheme: Subject Code
created: 2004-10-13T12:00:00+00:00
modified: 2012-07-10T12:00:00+00:00
broader: Moda

Narrativa
type: Concept
preferred label: fiction @en-gb
preferred label: Fiction @fr
preferred label: ficção @pt-br
preferred label: フィクション @ja-jp
preferred label: ficción @es
preferred label: Fiktion @de
definition: Strukturierte Geschichten, die meist der Fantasie des Autors entspringen und nicht auf Fakten beruhen. @de
definition: Racconto in forma di prosa di storie strutturate che generalmente non si basano su fatti reali e che sono frutto dell'immaginazione degli autori; romanzi, racconti, novelle
definition: Structured stories that are usually not based on fact but are the creation of the authors imagination @en-gb
definition: Histórias estruturadas que geralmente não se baseiam em fatos e que são criação da imaginação dos autores. @pt-br
definition: 通常は事実に基づいておらず、著者の想像で創作された物語 @ja-jp
definition: Tout ce qui relève de l'imaginaire @fr
definition: Historias Estructuradas que generalmente no se basan en un hecho, sino en la imaginación de los autores. @es
definition: Histórias estruturadas que geralmente não se baseiam em factos e que são criação da imaginação dos autores. @pt-pt
note: nessuno
in scheme: Subject Code
created: 2003-04-05T12:00:00+00:00
modified: 2012-07-10T12:00:00+00:00
broader: Letteratura

Poesia
type: Concept
preferred label: poesia @pt-pt
preferred label: Poesie @de
preferred label: Poésie @fr
preferred label: poesía @es
preferred label: 詩 @ja-jp
preferred label: poetry @en-gb
definition: Kunst, Struktur und Formen des poetischen Ausdrucks. @de
definition: 芸術、構成、詩的な表現の形式 @ja-jp
definition: Arte, estrutura e formas de expressão poética. @pt-br
definition: Art, structure et formes de l'expresion poétique @fr
definition: El arte, estructuras, y formas de expresón poética. @es
definition: Arte, struttura e forme dell'espressione poetica
definition: The art, structure, forms of poetic expression @en-gb
note: nessuno
in scheme: Subject Code
created: 2004-10-13T12:00:00+00:00
modified: 2012-07-10T12:00:00+00:00
broader: Letteratura

Classica
type: Concept
preferred label: música clássica @pt-pt
preferred label: classical music @en-gb
preferred label: música clásica @es
preferred label: クラシック @ja-jp
preferred label: Musique classique @fr
preferred label: Klassik @de
definition: Música que segue estruturas clássicas de ritmo e harmonia. @pt-br
definition: Música que sigue estructuras clásicas de ritmo y armonía @es
definition: Music that follows classic structures of rhythm and harmony @en-gb
definition: Musique qui suit des structures classiques de rythme et d'harmonie @fr
definition: 古典的なリズムとハーモニーで構成された音楽 @ja-jp
definition: Genere musicale che segue strutture classiche di ritmo e armonia, musica colta europea sviluppatasi fino al XIX secolo
definition: Musik, die klassischen Rhythmus- und Harmoniestrukturen folgt. @de
note: nessuno
in scheme: Subject Code
created: 2003-04-05T12:00:00+00:00
modified: 2012-07-10T12:00:00+00:00
broader: Musica

música folclórica
type: Concept
preferred label: Folk
preferred label: folk @pt-pt
preferred label: folk music @en-gb
preferred label: フォーク @ja-jp
definition: Música desarrollada de culturas folclóricas, que a menudo de basan en historias @es
definition: Music that developed from folk cultures, often based on story-telling @en-gb
definition: Música que se desenvolveu a partir de culturas populares. @pt-pt
definition: Musik, die sich aus folkloristischen Kulturen entwickelt, oft erzählend. @de
definition: Genere musicale sviluppato dalle culture popolari, e che trova le sue radici nelle tradizioni di un popolo o di una particolare zona geografica
definition: Genre musical issu de la culture populaire @fr
definition: 民族文化から発生した音楽で、伝承物語から派生したものもある @ja-jp
note: nessuno
in scheme: Subject Code
created: 2003-04-05T12:00:00+00:00
modified: 2012-07-10T12:00:00+00:00
broader: Musica

Jazz
type: Concept
preferred label: ジャス @ja-jp
preferred label: jazz music @en-gb
preferred label: jazz @pt-pt
preferred label: música jazz @es
definition: Música de várias harmonias, muitas vezes improvisada. @pt-br
definition: しばしば即興で作られる、多様なハーモニーの音楽 @ja-jp
definition: Genre musical mêlant harmonies occidentales et traditions noires américaines, souvent improvisé @fr
definition: A music of diverse harmonics, often improvised @en-gb
definition: Música de diversas armonías @es
definition: Genere musicale caratterizzato da armonie diverse, spesso improvvisate, nato fra fine ‘800 e primo ‘900 nel sud degli Usa
definition: Musik aus ungleichen Harmonien, oft improvisiert. @de
note: nessuno
in scheme: Subject Code
created: 2003-04-05T12:00:00+00:00
modified: 2012-07-10T12:00:00+00:00
broader: Musica

música popular
type: Concept
preferred label: ポピュラー @ja-jp
preferred label: Pop
preferred label: popular music @en-gb
definition: La dernière mode musicale, généralement destinée aux jeunes @fr
definition: A última moda em música, geralmente destinada à geração mais jovem. @pt-br
definition: Genere musicale in cui rientrano in particolare le ultime novità discografiche, in contrapposizione ad altri generi considerati colti, destinato soprattutto alle giovani generazioni
definition: 一般に、若い世代向けの、最新の流行音楽 @ja-jp
definition: Der neuste Trend in der Musik, meist für die jüngere Generation. @de
definition: La ultima moda en música generalmente dirigida a la juventud @es
definition: The latest fad in music, generally aimed at the younger generation @en-gb
note: nessuno
in scheme: Subject Code
created: 2003-04-05T12:00:00+00:00
modified: 2012-07-10T12:00:00+00:00
broader: Musica

Country
type: Concept
preferred label: country @pt-br
preferred label: música country @es
preferred label: country music @en-gb
preferred label: カントリー @ja-jp
definition: Música característica dos Estados Unidos. @pt-br
definition: Parecidas al Música Fol., pero es única de Estados Unidos, y no habla tanto de buscar y perder amor @es
definition: Musique populaire spécifique aux USA @fr
definition: Genere musicale tipico degli Usa, con caratterizzazione analoga al Folk e con la presenza di forme musicali della tradizione americana come la ballata
definition: フォークに類似しているが、米国特有なもので、物語よりはむしろ求愛や失恋についての音楽 @ja-jp
definition: Similar to folk but is unique to the United States and is less about story telling than about loves sought and lost @en-gb
definition: Vergleichbar mit Folk, weniger erzählend, handelt eher von der Suche nach Liebe und deren Verlust und kommt ausschließlich aus den USA. @de
note: nessuno
in scheme: Subject Code
created: 2003-04-05T12:00:00+00:00
modified: 2012-07-10T12:00:00+00:00
broader: Musica

Rock and roll
type: Concept
preferred label: rock @pt-br
preferred label: rock and roll music @en-gb
preferred label: Rock and Roll @de
preferred label: música rock and roll @es
preferred label: ロック @ja-jp
preferred label: Rock @fr
definition: Popular dance music developed in the 1950s @en-gb
definition: Música popular de dança desenvolvida na década de 1950. @pt-br
definition: Populäre Tanzmusik aus den 1950-er Jahren. @de
definition: 1950年代に発展したポピュラーなダンス音楽 @ja-jp
definition: Popolare genere di musica da ballo nato negli anni '50 negli Usa e poi diffusosi nel mondo. Da esso sono derivati vari altri generi, di solito indicati con l'abbreviazione ‘Rock'
definition: Baile popular desamolda a mediados de los años cincuenta @es
definition: Musique populaire caractérisée par une large amplification électrique et par l'accentuation des deuxième et quatrième temps de la mesure @fr
note: nessuno
in scheme: Subject Code
created: 2003-04-05T12:00:00+00:00
modified: 2012-07-10T12:00:00+00:00
broader: Musica

hip-hop
type: Concept
preferred label: Hip-Hop @de
definition: Música urbana contemporânea surgida na década de 1970. @pt-br
definition: A contemporary urban music originating in the 1970s. @en-gb
definition: Eine zeitgenössische urbane Musik mit Ursprung in den 1970er Jahren. @de
in scheme: Subject Code
created: 2008-09-15T12:00:00+00:00
modified: 2012-07-10T12:00:00+00:00
broader: Musica
broad match: http://cv.iptc.org/newscodes/mediatopic/20000018

Arti plastiche
type: Concept
preferred label: artes plásticas @pt-pt
preferred label: Bildhauerei @de
preferred label: 造形 @ja-jp
preferred label: Arts Plastiques @fr
preferred label: arte plástico @es
preferred label: plastic art @en-gb
definition: Handgeformte Kunst inklusive Installationen. @de
definition: 展示品など、手で作り上げる芸術形態 @ja-jp
definition: Arts manuels @fr
definition: Formas de arte criadas à mão, incluindo instalações. @pt-pt
definition: Forme d'arte create a mano o vari tipi di installazioni d'arte
definition: Forms of hand created art including installations @en-gb
definition: formas creadas a mano. @es
note: nessuno
in scheme: Subject Code
created: 2004-10-13T12:00:00+00:00
modified: 2012-07-10T12:00:00+00:00
broader: Scultura

Soap Opera
type: Concept
preferred label: novela @pt-pt
preferred label: ＴＶドラマ @ja-jp
preferred label: soap opera @en-gb
preferred label: novelas @pt-br
preferred label: Telenovela/Soap @de
definition: 通常、昼時間帯に放映されるＴＶドラマ @ja-jp
definition: Episodische TV-Fernsehserie, die meist tagsüber gesendet wird. @de
definition: Episodic TV drama or saga, normally aired during daytime @en-gb
definition: História dramatizada para ser apresentada em televisão, geralmente em capítulos diários. @pt-br
definition: História dramatizada para ser apresentada em televisão, geralmente em episódios diários. @pt-pt
definition: Genere di dramma interpretato da attori inizialmente nato per la radio e poi diffusosi al mezzo televisivo, trasmesso in numerosi episodi o puntate; Serial Televisivo
note: nessuno
in scheme: Subject Code
created: 2006-08-21T12:00:00+00:00
modified: 2012-07-10T12:00:00+00:00
broader: Televisione
broad match: http://cv.iptc.org/newscodes/mediatopic/20000051

Musica a Teatro
type: Concept
preferred label: オペラ・ミュージカル @ja-jp
preferred label: teatro musical @es
preferred label: Musique scénique @fr
preferred label: Musiktheater @de
preferred label: music theatre @en-gb
definition: Ópera, opereta, revistas musicais, music halls. @pt-br
definition: Opéra, opérettes et music hall @fr
definition: Opera, operetta, music revues etc @en-gb
definition: Opera, operetta, varietà musicale, musical, rivista ecc.
definition: Opera, operetta, variedades musicales. @es
definition: Oper, Operette, Musicals etc. @de
definition: 歌劇、オペレッタ、音楽レビューなど @ja-jp
note: nessuno
in scheme: Subject Code
created: 2004-10-13T12:00:00+00:00
modified: 2012-07-10T12:00:00+00:00
broader: Teatro

Istituzioni - ANNULLATO
type: Concept
preferred label: instituição-INATIVO @pt-br
preferred label: Institutions-DEPRECATED @fr
preferred label: institución-ANULADO @es
preferred label: 制度・組織－使用不可 @ja-jp
preferred label: institution-DEPRECATED @en-gb
preferred label: Institution-GELÖSCHT @de
definition: NA @en-gb
definition: --- @de
definition: Estabelecimento, organização de caráter social, religioso, educativo ou sistema similar, como hospital, escola, prisão-INATIVO @pt-br
definition: ANNULLATO
definition: ANULADO @es
definition: Etablissement, organisation à caractère social, religieux, éducatif, ou autre système à but similaire DEPRECATED @fr
definition: 確立された法律、業務、体制、あるいは病院、学校、刑務所のように、社会的/宗教的/教育的に同じ目的を持っている組織 @ja-jp
note: DEPRECATED in V 14 - term moved to 04018001 @fr
note: ANNULLATO in V 14 - Termine spostato al numero 04018001
note: Begriff nach 04018001 verschoben @de
in scheme: Subject Code
created: 2004-08-27T12:00:00+00:00
retired: 2004-08-27T00:00:00+00:00
modified: 2012-07-10T12:00:00+00:00
broader: Monumenti, Siti storici

Premi
type: Concept
preferred label: 芸能関連賞 @ja-jp
preferred label: entretenimento (prémios) @pt-pt
preferred label: entertainment award @en-gb
preferred label: Kulturelle Auszeichnung @de
definition: Premi e cerimonie di premiazione nel mondo dello spettacolo e dell'industria dell'intrattenimento: Oscar, Grammy, ecc.
definition: Prémios da indústria de entretenimento, como os Óscares do cinema, o Prémio Booker de Literatura e os Grammys para a música. @pt-pt
definition: 映画のオスカー、文学のブッカー賞、音楽のグラミー賞あるいは殿堂入りなど娯楽産業における業績に与えられる賞 @ja-jp
definition: Awards for achievement in the entertainment industry, such as the Oscars for film, the Booker Prize for Literature, the Grammys for music, or induction into halls of fame. @en-gb
definition: Prêmios da indústria de entretenimento, como Oscars, Booker Prize, Grammys, etc. @pt-br
definition: Preis für Leistungen in der Unterhaltungsindustrie, wie z.B Oskar beim Film, Buchpreis in der Literatur, der Grammy in der Musikindustrie oder die Einladung in die *Halls of fame*. @de
note: nessuno
in scheme: Subject Code
created: 2006-08-21T12:00:00+00:00
modified: 2012-07-10T12:00:00+00:00
broader: Intrattenimento (generico)
broad match: http://cv.iptc.org/newscodes/mediatopic/20000002

Sviluppo culturale
type: Concept
preferred label: Histoire de la culture @fr
preferred label: 文化史 @ja-jp
preferred label: desenvolvimento cultural @pt-br
preferred label: cultural development @en-gb
preferred label: desarrollo cultural @es
preferred label: Kulturgeschichte @de
definition: História do desenvolvimento de artes e culturas, tais como pinturas rupestres, arte pré-colombiana, confecção de papel chinês. @pt-br
definition: La historia del desarrollo de las artes y culturas tales como las pinturas rupestres, arte pre'colombino, la confección de papel chino. Cualquier cosa no política. @es
definition: Histoire du développement de l'art et de la culture @fr
definition: Storia dello sviluppo artistico e culturale
definition: História do desenvolvimento de artes e culturas, tais como pinturas rupestres, arte pré-colombiana ou confeção de papel chinês. @pt-pt
definition: 政治的には関係ない洞窟壁画、コロンビア芸術、中国製紙の起源のような芸術や文化の発達の歴史 @ja-jp
definition: The history of the development of art and culture such as the rise of cave paintings, pre-Colombian art, Chinese paper-making, anything non-political @en-gb
definition: Die Geschichte der Entwicklung von Kunst und Kultur, wie beispielsweise die Entstehung der Höhlenmalerei, der vorkolumbianischen Kunst oder der chinesische Papierkunst, alles Unpolitische. @de
note: nessuno
in scheme: Subject Code
created: 2004-04-22T12:00:00+00:00
modified: 2012-07-10T12:00:00+00:00
broader: Cultura (generico)

Periodici
type: Concept
preferred label: 定期刊行物 @ja-jp
preferred label: Zeitschrift @de
preferred label: periódicos @es
preferred label: Périodiques @fr
preferred label: periodicals @en-gb
definition: Pubblicazioni periodiche o riviste con cadenza settimanale, quindicinale, mensile o altro
definition: Material escrito que se publica semanal, quinzenal, mensal ou anualmente. @pt-br
definition: Journaux et magazines périodiques : hebdomadaire, bi-hebdo, mensuel, bi-mensuel, bimestriel, trimestriel, semestriel, annuel @fr
definition: Written material that is usually published weekly, bi-weekly, monthly or annually for a long time @en-gb
definition: 週ごと、隔週ごと、月ごと、年ごとに、長期にわたって定期的に発刊される書物 @ja-jp
definition: Geschriebenes, was über einen längeren Zeitraum meist wöchentlich, vierzehntägig, monatlich oder jährlich veröffentlicht wird. @de
definition: Material escrito que generalmente se publica semanal, mensual anualmente durante un largo tiempo @es
note: nessuno
in scheme: Subject Code
created: 2003-04-05T12:00:00+00:00
modified: 2012-07-10T12:00:00+00:00
broader: Mass Media

Mezzi informazione
type: Concept
preferred label: órgãos noticiosos @pt-pt
preferred label: Radio-tv @fr
preferred label: mídia noticiosa @pt-br
preferred label: medios informativos @es
preferred label: Nachrichtensender @de
preferred label: news media @en-gb
preferred label: ニュースメディア @ja-jp
definition: テレビ、ワイヤーサービス、ラジオ。出来事について事実を集め、それをもとに、視聴者/読者に対して全体の話として作り上げて紹介する @ja-jp
definition: Televisione, servizi via cavo, radio e altro con la raccolta di notizie e informazioni e la presentazione di esse al pubblico
definition: Órgãos de comunicação que se dedicam à difusão pública de notícias, incluindo as publicações impressas (jornais e revistas), a rádio e a televisão e, mais recentemente, os serviços de notícias eletrónicos. @pt-pt
definition: Televisão, rádio, serviços de notícias que recolhem fatos sobre incidentes, desenvolvendo e fazendo sua apresentação ao público como uma história completa. @pt-br
definition: Televisión, servicios de telex, radio que recogen hechos acerca de incidentes, desarrollando y presentándolos a la audiencia como toda una historia @es
definition: Television, wire services, radio that collect facts about incidents, developing and presenting them to audiences as a whole story @en-gb
definition: Fernsehen, Radio und Telekommunikationsdienstleister, die Fakten über Ereignisse sammeln und diese für die Öffentlichkeit aufbereiten. @de
definition: Agence de presse, radio, télévision @fr
note: nessuno
in scheme: Subject Code
created: 2003-04-05T12:00:00+00:00
modified: 2012-07-10T12:00:00+00:00
broader: Mass Media

Giornali
type: Concept
preferred label: jornais @pt-br
preferred label: newspapers @en-gb
preferred label: 新聞 @ja-jp
preferred label: diarios y revistas @es
preferred label: Journaux @fr
preferred label: Zeitung @de
definition: Pubblicazioni quotidiane o settimanali di notizie o con servizi speciali
definition: Publicações diárias ou semanais que apresentam histórias do dia a dia, do mundo, filmes, quadrinhos, etc. @pt-br
definition: Tägliche oder wöchentliche Publikationen, die das tägliche Weltgeschehen darstellen, wie Reportagen, Berichte, Comics etc. @de
definition: Publicações diárias ou semanais que apresentam em geral notícias e informações atualizadas, nacionais e internacionais, sobre um amplo número de assuntos e destinadas ao público em geral. @pt-pt
definition: Publicaciones dirías o semanales que presentan día a día noticias, películas y comics, etc. @es
definition: Daily or weekly publications that present the day to day history of the world, as well as features, comics etc @en-gb
definition: Journaux quotidiens et hebdomadaires @fr
definition: 日刊あるいは週刊の刊行物。特集や漫画などだけでなく、世界で日々起こっている歴史を紹介する @ja-jp
note: nessuno
in scheme: Subject Code
created: 2003-04-05T12:00:00+00:00
modified: 2012-07-10T12:00:00+00:00
broader: Mass Media

Recensioni
type: Concept
preferred label: críticas @pt-pt
preferred label: 評論 @ja-jp
preferred label: Revue de critiques @fr
preferred label: análisis @es
preferred label: reviews @en-gb
preferred label: Rezension @de
definition: Ein kritischer Blick auf die Arbeit eines anderen, aus Film, Theater oder Literatur. @de
definition: Article s'appliquant à discerner les qualités et les défauts d'une œuvre @fr
definition: Análise crítica sobre a obra de alguém, seja filme, teatro ou literatura. @pt-br
definition: 映画、演劇、書籍といった他人の作品に対する批評 @ja-jp
definition: Una perspectiva critica del trabajo de alguien, ya sea de cine, teatro o literatura. @es
definition: A critical look at someone else's work, whether film, theatre or writing @en-gb
definition: Articoli critici o di commento dedicati al lavoro artistico: un film, un'opera teatrale o uno scritto, un'opera musicale
note: nessuno
in scheme: Subject Code
created: 2003-04-05T12:00:00+00:00
modified: 2012-07-10T12:00:00+00:00
broader: Mass Media
broad match: http://cv.iptc.org/newscodes/mediatopic/20000002

Giustizia, Criminalità
type: Concept
preferred label: crime, lei e justiça @pt-pt
preferred label: crime, law and justice @en-gb
preferred label: Justiz, Kriminalität @de
preferred label: Police et justice @fr
preferred label: 犯罪・司法 @ja-jp
preferred label: policía y justicia @es
definition: Le regole e le leggi, la punizione delle trasgressioni, le forze di polizia, le organizzazioni e le persone coinvolte in attività criminali.
definition: Establecimiento y/o tratados de las reglas de comportamiento en la sociedad, el fortalecimiento de estas reglas, quiebres de las reglas y penas de los ofensores. Organizaciones y personas involucradas en estas actividades. @es
definition: Estabelecimento e/ou declaração das regras de comportamento em sociedade, aplicação dessas regras, quebra das regras e penas para os infratores. Organizações e pessoas envolvidas nessas atividades. @pt-br
definition: Festlegung und/oder Verlautbarung von Verhaltensregeln einer Gesellschaft, die Durchsetzung dieser Regeln, ihre Verstöße und die Bestrafung der Täter. Organisationen und Einheiten, die mit diesen Aktivitäten betraut sind. @de
definition: Establishment and/or statement of the rules of behaviour in society, the enforcement of these rules, breaches of the rules and the punishment of offenders. Organizations and bodies involved in these activities. @en-gb
definition: 社会における行動の規則を示す制度/文書、規則の施行、規則に対する違反、違反者への処罰。これらに関連する組織や集団 @ja-jp
definition: Police, Justice, lois et ordre public @fr
note: nessuno
in scheme: Subject Code
created: 2000-10-30T12:00:00+00:00
modified: 2010-12-15T17:01:09+00:00
narrower: Criminalità
narrower: Giustizia
narrower: Forze Ordine
narrower: Pena
narrower: Carceri
narrower: Codici
narrower: Giustizia e diritti
narrower: Processo
narrower: Accusa
narrower: Criminalità Organizzata
narrower: Diritto Internazionale
narrower: Crimini societari
narrower: Crimini Guerra
narrower: Inchiesta, Autopsia
narrower: Commissione d'Inchiesta
narrower: Giurisdizioni varie

Criminalità
type: Concept
preferred label: Criminalité @fr
preferred label: criminalidad @es
preferred label: crime @pt-pt
preferred label: 犯罪 @ja-jp
preferred label: Kriminalität @de
definition: Violation of established laws by individuals, companies or organizations @en-gb
definition: Insieme degli atti compiuti da soggetti, gruppi o organizzazioni che contravvengono alle leggi vigenti.
definition: La violación de las leyes establecidas por parte de individuos, compañias u organizaciones @es
definition: Violação das leis por indivíduos, empresas ou organizações. @pt-br
definition: 人、会社、組織による法律違反 @ja-jp
definition: Ensemble des actes contrevenant aux lois @fr
definition: Verletzung von etablierten Gesetzen durch Individuen, Firmen und Organisationen. @de
note: nessuno
in scheme: Subject Code
created: 2000-10-30T12:00:00+00:00
modified: 2010-12-15T17:01:09+00:00
broader: Giustizia, Criminalità
narrower: Omicidio
narrower: Crimini informatici
narrower: Furti, Rapine
narrower: Droga
narrower: Reati sessuali
narrower: Aggressioni (generico)
narrower: Sequestri Persona
narrower: Incendi dolosi
narrower: Gang delinquenziali
narrower: Terrorismus

Giustizia
type: Concept
preferred label: 司法制度 @ja-jp
preferred label: Système judicaire @fr
preferred label: magistratura @es
preferred label: judicial (sistema de justiça) @pt-pt
preferred label: judiciário (sistema de justiça) @pt-br
preferred label: judiciary (system of justice) @en-gb
preferred label: Justiz @de
definition: Sistema giudiziario nel suo complesso e in tutte le sue singole componenti
definition: The system set up to deal with crime and those who do them @en-gb
definition: Sistema estabelecido para lidar com os crimes e com aqueles que os praticam. @pt-pt
definition: Système judiciaire @fr
definition: 犯罪や犯罪者を扱うために用意された制度 @ja-jp
definition: System, das eingesetzt wird zum Umgang mit Kriminalität und Kriminellen. @de
definition: El sistema establecido para lidiar con crimenes y aquellos que los comenten. @es
note: nessuno
in scheme: Subject Code
created: 2000-10-30T12:00:00+00:00
modified: 2010-12-15T17:01:09+00:00
broader: Giustizia, Criminalità
narrower: Avvocatura
narrower: Magistratura
narrower: Amministrazione giustizia

Forze Ordine
type: Concept
preferred label: Police @fr
preferred label: policía @es
preferred label: police @en-gb
preferred label: 警察 @ja-jp
preferred label: Polizei @de
preferred label: polícia @pt-br
definition: Agents of the legal system set up enforce the laws @en-gb
definition: 法律を実行するために準備された合法的な組織 @ja-jp
definition: Agents de la force publique dont la mission est notamment le maintien de l'ordre @fr
definition: Agentes del sistema legal establecido para aplicar la ley. @es
definition: Complesso delle forze a disposizione dello stato per prevenire i reati, individuarne gli autori e tutelare l'ordine pubblico; gli organismi di rappresentanza
definition: Mitarbeiter des rechtsgültigen Systems (Staat), die zur Einhaltung der Gesetze eingesetzt werden. @de
definition: Agentes do sistema legal cuja missão é a aplicação das leis para a manutenção da ordem. @pt-br
definition: Agentes do estado que têm por missão zelar pelo cumprimento da lei, proteger as pessoas e a propriedade e manter a ordem pública. @pt-pt
note: nessuno
in scheme: Subject Code
created: 2000-10-30T12:00:00+00:00
modified: 2010-12-15T17:01:09+00:00
broader: Giustizia, Criminalità
narrower: Corpi Polizia
narrower: Indagine
narrower: Arresto

Pena
type: Concept
preferred label: punishment @en-gb
preferred label: punição / sentença @pt-br
preferred label: 刑罰 @ja-jp
preferred label: Strafverfolgung @de
preferred label: Peines @fr
preferred label: penas @es
definition: 法を破った者に与えられる懲罰 @ja-jp
definition: The retribution handed out to those who break the laws @en-gb
definition: Sentenças impostas àqueles que infringem as leis. @pt-br
definition: Provvedimento giudiziario imposto con sentenza a seguito di processo davanti ad un giudice
definition: Strafe, die gegen Gesetzesbrecher verhängt wird. @de
definition: Sentencias impuestas a aquellos que quebrantan la ley. @es
definition: Condamnation à laquelle on s'expose en enfreignant la loi @fr
note: nessuno
in scheme: Subject Code
created: 2000-10-30T12:00:00+00:00
modified: 2010-12-15T17:01:09+00:00
broader: Giustizia, Criminalità
narrower: Multe, Ammende
narrower: execução

Carceri
type: Concept
preferred label: prisão @pt-br
preferred label: 刑務所 @ja-jp
preferred label: Strafvollzug @de
preferred label: Prison @fr
preferred label: cárcel @es
preferred label: prison @en-gb
definition: Auch bekannt als Gefängnis, Knast, Haft etc. um Gesetzesbrecher von der Gesellschaft fernzuhalten. @de
definition: Prisão, casa de detenção, presídio onde são encarcerados os infratores condenados pela justiça. @pt-br
definition: 社会から法律違反者を隔離するためのもの。例えば刑務所、留置所、拘置所など @ja-jp
definition: Prison, maison d'arrêt, géôle où sont enfermées les personnes condamnées @fr
definition: Also know as jails, lockups, calaboose, etc. for keeping law breakers from society @en-gb
definition: Edificação onde são encarcerados os infratores condenados pela justiça. @pt-pt
definition: Strutture in cui è rinchiuso chi è privato della libertà personale a seguito di una condanna o per un provvedimento cautelare
definition: También conocida como prisión, encierro, calabozo, etc., para mantener lejos de la sociedads, a los que quebrantan las leyes. @es
note: nessuno
in scheme: Subject Code
created: 2000-10-30T12:00:00+00:00
modified: 2010-12-15T17:01:09+00:00
broader: Giustizia, Criminalità

Codici
type: Concept
preferred label: Gesetz @de
preferred label: 法律 @ja-jp
preferred label: Lois @fr
preferred label: laws @en-gb
preferred label: leis @pt-br
preferred label: legislación @es
definition: Raccolte normative delle regole e leggi che nella società disciplinano una determinata materia
definition: L'ensemble des droits et des devoirs que s'impose une société @fr
definition: Codificação de regras de conduta em sociedade. @pt-pt
definition: La codificación de las reglas de conducta. @es
definition: Die systematische Aufzeichnung von Verhaltensvorschriften. @de
definition: The codification of rules of behaviour @en-gb
definition: 行動規則を成文化したもの @ja-jp
note: nessuno
in scheme: Subject Code
created: 2000-10-30T12:00:00+00:00
modified: 2010-12-15T17:01:09+00:00
broader: Giustizia, Criminalità
narrower: Penale
narrower: Civile

Giustizia e diritti
type: Concept
preferred label: Droits @fr
preferred label: Rechtsprechung @de
preferred label: justiça e direitos @pt-br
preferred label: justice and rights @en-gb
preferred label: 司法と権利 @ja-jp
preferred label: justicia y derechos @es
definition: 法や規則の公正な執行 @ja-jp
definition: Administração equitativa de leis e regulamentos. @pt-pt
definition: The equitable administration of laws and regulations @en-gb
definition: Die gerechte Anwendung von Gesetzen und Regularien. @de
definition: Administration équitable des lois et des réglements @fr
definition: La administración equitativa de las leyes y regulaciones. @es
definition: Equa amministrazione di leggi e normative
note: nessuno
in scheme: Subject Code
created: 2000-10-30T12:00:00+00:00
modified: 2010-12-15T17:01:09+00:00
broader: Giustizia, Criminalità
narrower: Diritti civili

Processo
type: Concept
preferred label: trials @en-gb
preferred label: julgamentos @pt-pt
preferred label: juicios @es
preferred label: 裁判 @ja-jp
preferred label: Procès @fr
preferred label: Prozess/Gericht @de
definition: 有罪か無罪か、または正しいか間違っているかを決定され宣告される手続き @ja-jp
definition: El proceso mediante el cual culpable o inocente, o correcto o incorrecto es determinado y juzgado. @es
definition: Processo mediante o qual culpado ou inocente, certo ou errado é determinado e julgado. @pt-br
definition: The process by which guilt or innocence, or right or wrong is determined and adjudged @en-gb
definition: Passage devant un tribunal pour régler un différend entre deux ou plusieurs parties @fr
definition: Processo mediante o qual se determina e julga a culpa ou a inocência, o certo e o errado. @pt-pt
definition: Vorgang, bei dem Schuld oder Unschuld, richtig oder falsch festgesetzt und geklärt wird. @de
definition: Procedimento giudiziario mediante il quale vengono stabilite e giudicate la colpevolezza o l'innocenza, la ragione o il torto
note: nessuno
in scheme: Subject Code
created: 2000-10-30T12:00:00+00:00
modified: 2010-12-15T17:01:09+00:00
broader: Giustizia, Criminalità
narrower: Causa
narrower: Arbitrato
narrower: Udienza preliminare

Accusa
type: Concept
preferred label: Accusation @fr
preferred label: acusação @pt-pt
preferred label: Anklage @de
preferred label: 起訴 @ja-jp
preferred label: prosecution @en-gb
preferred label: proceso judicial @es
definition: Attività ed indagini svolte o coordinate dal pubblico ministero
definition: Historias de actividades e investigaciones públicas @es
definition: Histórias relativas às atividades e investigações públicas. @pt-pt
definition: Stories regarding activities and investigations by public prosecutors. @en-gb
definition: Ministère public ou parquet @fr
definition: Artikel über Aktivitäten und Nachforschungen von Staatsanwälten. @de
definition: 検察官による活動と捜査に関係した記事 @ja-jp
note: nessuno
in scheme: Subject Code
created: 2000-10-30T12:00:00+00:00
modified: 2010-12-15T17:01:09+00:00
broader: Giustizia, Criminalità
narrower: Imputato
narrower: Teste

Criminalità Organizzata
type: Concept
preferred label: crimen organizado @es
preferred label: Crime organisé @fr
preferred label: crime organizado @pt-br
preferred label: 組織犯罪 @ja-jp
preferred label: Organisierte Kriminalität @de
preferred label: organized crime @en-gb
definition: Crimes cometidos por gangues ou grupos criminosos. @pt-pt
definition: Crímenes cometidos por mafiosos o grupos criminales @es
definition: Groupe organisé ayant pour but de commettre des crimes ==== Crimes commis par des bandes ou des groupes organisés @fr
definition: Organizzazioni o gruppi criminali strutturati secondo un dato codice o sistema; Mafia, Camorra, ‘Ndrangheta, Sacra Corona Unita, Stidda ecc.
definition: Crimes committed by gangs or criminal groups. @en-gb
definition: 暴力団あるいは犯罪者グループによって犯された罪 @ja-jp
definition: Kriminelle Handlungen, die von Banden oder kriminellen Gruppen begangen wurden. @de
note: nessuno
in scheme: Subject Code
created: 2000-10-30T12:00:00+00:00
modified: 2010-12-15T17:01:09+00:00
broader: Giustizia, Criminalità

Diritto Internazionale
type: Concept
preferred label: derecho internacional @es
preferred label: 国際法 @ja-jp
preferred label: lei internacional @pt-br
preferred label: Internationales Recht @de
preferred label: Droit International @fr
preferred label: international law @en-gb
definition: Les lois internationales telles que la Convention de Genève, le droit de la mer, etc. @fr
definition: すべての国によって受け入れられた法律の体系。海の国際法、ジュネーブ条約など @ja-jp
definition: The system of laws embraced by all nations, such as the Geneva Convention, the International Law of the Seas, etc. @en-gb
definition: Sistema de leis adotadas internacionalmente, como a convenção de Genebra, o direito do mar, etc. @pt-br
definition: Sistema de leyes abrazado por todas las naciones, tales como Convención de Ginebra, Tratado Internacional de los mares, etc. @es
definition: Sistema normativo e le leggi internazionali adottate da tutte le nazioni, ad es. la Convenzione di Ginevra
definition: Rechtssystem, was alle Nationen einschließt, wie die Genfer Konvention, das Internationale Seerecht etc. @de
note: nessuno
in scheme: Subject Code
created: 2000-10-30T12:00:00+00:00
modified: 2010-12-15T17:01:09+00:00
broader: Giustizia, Criminalità
narrower: Corti, Tribunali internazionali
narrower: Estradizione

Crimini societari
type: Concept
preferred label: corporate crime @en-gb
preferred label: Délinquance financière @fr
preferred label: crime económico @pt-pt
preferred label: delitos corporativos @es
preferred label: 企業犯罪 @ja-jp
preferred label: crime econômico @pt-br
preferred label: Firmenkriminalität @de
definition: Delitos de corporaciones y de sus cabezas @es
definition: Untaten von Unternehmen oder Geschäftsführungen. @de
definition: 企業や企業役員の犯罪 @ja-jp
definition: Delitti compiuti da società e/o loro responsabili
definition: Delitos cometidos por empresas e por seus responsáveis. @pt-br
definition: Misdeeds of corporations and corporate officers @en-gb
definition: Malversations commises par des entreprises et/où par des responsables @fr
definition: Delitos cometidos por empresas e pelos seus responsáveis. @pt-pt
note: nessuno
in scheme: Subject Code
created: 2000-10-30T12:00:00+00:00
modified: 2010-12-15T17:01:09+00:00
broader: Giustizia, Criminalità
narrower: Frodi
narrower: Appropriazioni indebite
narrower: Limitazioni alla concorrenza
narrower: Inadempienze contrattuali
narrower: Infrazioni all'antitrust
narrower: Corruzione
narrower: Tangenti

Crimini Guerra
type: Concept
preferred label: crime de guerra @pt-br
preferred label: Kriegsverbrechen @de
preferred label: crimen de guerra @es
preferred label: 戦争犯罪 @ja-jp
preferred label: war crime @en-gb
preferred label: Crime de guerre @fr
definition: 戦争または武力紛争の間に通常民間人や捕虜に対して犯される犯罪。そのような犯罪の告発・起訴を含む @ja-jp
definition: Kriminelle Handlungen und deren Strafverfolgung, die während eines Krieges oder bewaffneten Konfliktes begangen werden, gewöhnlich gegen Zivilisten oder Kriegsgefangene. @de
definition: Crimes cometidos durante uma guerra ou conflito armado, geralmente contra civis ou prisioneiros de guerra, incluindo a perseguição dos seus autores. @pt-pt
definition: Crímenes cometidos durante una guerra o conflicto armado, generalmente contra civiles o prisioneros de guerra, lo que incluye la condena de tales crímenes. @es
definition: Crimes committed during a war or armed conflict, usually against civilians or POW's, including the prosecution of such crimes @en-gb
definition: Crimes de guerre y compris les poursuites contre leurs auteurs @fr
definition: Crimes cometidos durante uma guerra ou conflito armado, geralmente contra civis ou prisioneiros de guerra, incluindo a perseguição de seus autores. @pt-br
definition: Crimini commessi durante una guerra o un conflitto armato, generalmente contro civili o prigionieri di guerra e i processi istruiti contro tali crimini
note: nessuno
in scheme: Subject Code
created: 2003-11-26T12:00:00+00:00
modified: 2012-07-10T12:00:00+00:00
broader: Giustizia, Criminalità

Inchiesta, Autopsia
type: Concept
preferred label: Gerichtsmedizin @de
preferred label: investigação @pt-pt
preferred label: 検死 @ja-jp
preferred label: inquest @en-gb
definition: Investigação formal de morte súbita ou inesperada e audiência para apurar a causa de morte. @pt-pt
definition: Formal investigation of sudden or unexpected death and the hearing to decide cause of death. @en-gb
definition: 突然あるいは不慮の死の公式捜査と死因に関する公聴 @ja-jp
definition: Formale Untersuchung bei plötzlichem oder unerwartetem Tod mit anschließender Feststellung der Todesursache. @de
definition: Investigazione formale condotta per stabilire le cause di una morte improvvisa o inaspettata
note: nessuno
in scheme: Subject Code
created: 2006-08-21T12:00:00+00:00
modified: 2012-07-10T12:00:00+00:00
broader: Giustizia, Criminalità
broad match: http://cv.iptc.org/newscodes/mediatopic/20000131

Commissione d'Inchiesta
type: Concept
preferred label: inquérito @pt-pt
preferred label: 公聴会 @ja-jp
preferred label: inquiry @en-gb
preferred label: Untersuchung @de
definition: Offizielle Anhörung nach einem Unglück, einem politischen Ereignis etc. Beispiel Zugunglück, Drogenskandal. @de
definition: Audiência formal, envolvendo desastre, evento político, etc. @pt-pt
definition: 列車事故、薬害など災害、政治的出来事などに関する公式の公聴。 @ja-jp
definition: Formal hearing involving a disaster, political event etc. Eg rail crash, drug prescription scandal. @en-gb
definition: Attività di una commissione istituita per fare luce su un determinato evento: audizioni formali, ecc.
note: nessuno
in scheme: Subject Code
created: 2006-08-21T12:00:00+00:00
modified: 2012-07-10T12:00:00+00:00
broader: Giustizia, Criminalità
broad match: http://cv.iptc.org/newscodes/mediatopic/20000111

Giurisdizioni varie
type: Concept
preferred label: tribunal @pt-pt
preferred label: 聴聞会 @ja-jp
preferred label: Verhandlung @de
definition: Altri tipi di giurisdizioni: giudice di pace, giudice del lavoro, Tar, ecc.
definition: Audiência formal, envolvendo questões relacionadas ao emprego, propriedade, etc. @pt-br
definition: 雇用、財産などに関する公式の聴聞 @ja-jp
definition: Audiência formal, envolvendo questões relacionadas com o emprego, propriedade, etc. @pt-pt
definition: Formal hearing usually involving employment issues, property etc. @en-gb
definition: Offizielle Anhörung gewöhnlich bei Arbeitsauseinandersetzungen, Eigentumsfragen etc. @de
note: nessuno
in scheme: Subject Code
created: 2006-08-21T12:00:00+00:00
modified: 2012-07-10T12:00:00+00:00
broader: Giustizia, Criminalità
broad match: http://cv.iptc.org/newscodes/mediatopic/20000111

Omicidio
type: Concept
preferred label: 殺人 @ja-jp
preferred label: homicide @en-gb
preferred label: homicídio @pt-br
preferred label: homicidio @es
preferred label: Mord @de
preferred label: Homicide @fr
definition: Matar a un persona @es
definition: Crime de sang, action visant à donner la mort à quelqu'un volontairement ou non @fr
definition: Assassinio di una persona
definition: Morte de uma pessoa cometida por outra(s). @pt-br
definition: Killing of one person by another @en-gb
definition: 人を殺害すること @ja-jp
definition: Tod eines Menschen durch einen anderen. @de
note: nessuno
in scheme: Subject Code
created: 2003-04-05T12:00:00+00:00
modified: 2012-07-10T12:00:00+00:00
broader: Criminalità

Crimini informatici
type: Concept
preferred label: ＩＴ犯罪 @ja-jp
preferred label: computer crime @en-gb
preferred label: Computerkriminalität @de
preferred label: crime informático @pt-pt
preferred label: Piratage informatique @fr
preferred label: delitos informaticos @es
definition: Atti delittuosi compiuti attraverso l'utilizzo di computers o sistemi informatici
definition: Theft or destructive behaviour using a computer @en-gb
definition: Roubo ou comportamento destrutivo usando um computador. @pt-pt
definition: Robo o conducta dañina al usar un computador @es
definition: Diebstahl oder zerstörerisches Verhalten mithilfe eines Computers. @de
definition: コンピュータを用いた盗み、および破壊行動 @ja-jp
definition: Crime informatique, action visant à s'introduire illégalement dans un ordinateur @fr
note: nessuno
in scheme: Subject Code
created: 2003-04-05T12:00:00+00:00
modified: 2012-07-10T12:00:00+00:00
broader: Criminalità

Furti, Rapine
type: Concept
preferred label: theft @en-gb
preferred label: roubo @pt-pt
preferred label: Diebstahl @de
preferred label: robo @es
preferred label: 窃盗 @ja-jp
preferred label: Vol @fr
definition: Unlawful taking @en-gb
definition: Apropiación ilegal @es
definition: Sottrazioni illegali di beni, anche attraverso atti violenti
definition: Action de dérober quelque chose à quelqu'un @fr
definition: 盗みをすること @ja-jp
definition: Apropriação ilegal. @pt-br
definition: Ungesetzliche Beschaffung. @de
note: nessuno
in scheme: Subject Code
created: 2003-04-05T12:00:00+00:00
modified: 2012-07-10T12:00:00+00:00
broader: Criminalità

Droga
type: Concept
preferred label: tráfico de droga @pt-br
preferred label: narcotráfico @es
preferred label: drug trafficking @en-gb
preferred label: Drogenkriminalität @de
preferred label: 麻薬取引 @ja-jp
preferred label: Trafic de drogue @fr
definition: Unerlaubter Handel mit meist gesundheitsgefährdenden Stoffen. @de
definition: Atti delittuosi connessi con le sostanze stupefacenti: la produzione o sintesi, il narcotraffico, lo spaccio di tali sostanze illecite e dannose
definition: Tráfico de substâncias ilícitas. @pt-pt
definition: 有害物質(麻薬)を不正取引すること @ja-jp
definition: Dealing in illicit often harmful substances @en-gb
definition: Trafic visant à écouler des substances illégales @fr
definition: Tráfico de substâncias ilegais. @pt-br
definition: Negociar con sustancias ilícitas y dañinas @es
note: nessuno
in scheme: Subject Code
created: 2003-04-05T12:00:00+00:00
modified: 2012-07-10T12:00:00+00:00
broader: Criminalità

Reati sessuali
type: Concept
preferred label: asalto sexual @es
preferred label: crimes sexuais @pt-pt
preferred label: 性犯罪 @ja-jp
preferred label: sexual assault @en-gb
preferred label: Sexuelle Gewalt @de
preferred label: Viol @fr
definition: Agressão de natureza sexual cometida contra outra pessoa. @pt-br
definition: 異性に対する性的暴行 @ja-jp
definition: Sexuelle Nötigung und Körperverletzung. @de
definition: Sexual battery of one sex against another @en-gb
definition: Ataque sexual de un sexo en contra del otro. @es
definition: Abusi o violenze sessuali commessi ai danni di qualcuno; il turismo sessuale
definition: Attaque sexuelle @fr
note: nessuno
in scheme: Subject Code
created: 2004-04-22T12:00:00+00:00
modified: 2012-07-10T12:00:00+00:00
broader: Criminalità

Aggressioni (generico)
type: Concept
preferred label: assalto @pt-pt
preferred label: assault (general) @en-gb
preferred label: Agression @fr
preferred label: asalto (general) @es
preferred label: 暴行（一般） @ja-jp
preferred label: Gewalt (allgemein) @de
definition: Battery, slugfests, brawls and threatening behaviour @en-gb
definition: Estropicio, puñetazos, reyertas y comportamiento amenzador. @es
definition: 殴打、殴り合い、口論(けんか)や脅迫的な行動 @ja-jp
definition: Körperverletzung, Prügeleien, Streit und bedrohliches Verhalten. @de
definition: Comportamenti violenti o quelli atti ad intimidire qualcuno, le risse, violenze personali, percosse, lesioni
definition: Agressão física, briga, rixa e comportamento ameaçador. @pt-br
definition: Coups et blessures, bagarre et comportement menaçant @fr
note: nessuno
in scheme: Subject Code
created: 2004-10-13T12:00:00+00:00
modified: 2012-07-10T12:00:00+00:00
broader: Criminalità

Sequestri Persona
type: Concept
preferred label: Kidnapping @fr
preferred label: kidnapping @en-gb
preferred label: Entführung @de
preferred label: rapto @pt-br
preferred label: 誘拐 @ja-jp
preferred label: secuestro @es
definition: To seize and detain or carry away a person against that person's will by unlawful threat, force or fraud @en-gb
definition: Agarrar y detener a alguien o llevarse a una persona en contra de su propia voluntad, mediante amenzas ilegales, fuerza o fraude. @es
definition: Levar ou capturar e deter alguém contra a sua vontade, mediante ameaças ilegais, força ou fraude. @pt-pt
definition: Levar ou capturar e deter alguém contra sua vontade, mediante ameaças ilegais, força ou fraude. @pt-br
definition: Jemanden gegen seinen Willen widerrechtlich und gewaltsam gefangen nehmen, festhalten oder verschleppen. @de
definition: Atti delittuosi finalizzati a portare via una persona contro la sua volontà o privarla comunque della sua libertà ricorrendo a minacce, forza e inganno
definition: Enlèvement et détention d'une personne contre son gré @fr
definition: 不当な脅迫、強圧あるいは詐欺により、意志に反してその人を強奪し、拘束すること。または連れ去ること @ja-jp
note: nessuno
in scheme: Subject Code
created: 2004-10-13T12:00:00+00:00
modified: 2012-07-10T12:00:00+00:00
broader: Criminalità

Incendi dolosi
type: Concept
preferred label: incêndio criminoso @pt-br
preferred label: incendio premeditado @es
preferred label: 放火 @ja-jp
preferred label: fogo posto @pt-pt
preferred label: arson @en-gb
preferred label: Incendie criminel @fr
preferred label: Brandstiftung @de
definition: Mettre le feu de manière intentionnelle @fr
definition: Incêndio intencional, de origem criminosa. @pt-pt
definition: 犯行目的で意図的に火をつけること @ja-jp
definition: Absichtliches in Brand stecken mit krimineller Intention. @de
definition: Inicio intencional de un fuego con intentos criminales @es
definition: Incendi appiccati con premeditazione e intenzionalmente con un intento criminale
definition: Intentional setting of fires with criminal intent @en-gb
note: nessuno
in scheme: Subject Code
created: 2004-10-13T12:00:00+00:00
modified: 2012-07-10T12:00:00+00:00
broader: Criminalità

Gang delinquenziali
type: Concept
preferred label: gangues @pt-br
preferred label: 集団犯罪 @ja-jp
preferred label: Délinquance en bandes @fr
preferred label: Bandenkriminalität @de
preferred label: gang activity @en-gb
preferred label: actividad pandillera @es
definition: Atividades criminosas cometidas por grupos de indivíduos, geralmente em áreas urbanas, que se aliam por territórios, língua ou etnia comuns. @pt-br
definition: Attività criminali commesse da gruppi di individui, generalmente in aree urbane, uniti da provenienza territoriale, linguistica o etnica comune; Bande urbane; Bande di minorenni
definition: Criminal activities by groups of individuals, usually in urban areas, who are allied by common territories, languages, ethnic backgrounds but generally are loosely organized. @en-gb
definition: 複数の構成員からなる一団による犯罪活動。主に都市部において、共通の領土や言語や民族的背景によって結びついてはいるが、一般的に、厳密には組織されていない @ja-jp
definition: Activités criminelles en bandes généralement en milieu urbain @fr
definition: Actividades criminales de grupos o individuos, usualmente en áreas urbanas, que ase alian por territorios comunes. @es
definition: Kriminelle Aktivitäten von Gruppen, meist in Randgebieten, die verbunden sind durch gemeinsame Herkunft, Sprache und ethnischem Hintergrund aber meist nur wenig organisiert. @de
note: nessuno
in scheme: Subject Code
created: 2004-10-13T12:00:00+00:00
modified: 2012-07-10T12:00:00+00:00
broader: Criminalità

Terrorismus
type: Concept
preferred label: terrorism @en-gb
preferred label: terrorismo @pt-pt
definition: Violência contra as pessoas para criar medo e alcançar objetivos políticos ou ideológicos. @pt-pt
definition: Gewalt gegen Menschen um Angst zu erzeugen mit dem Ziel politische oder ideologische Ideale zu erreichen. @de
definition: Violence against people to create fear in order to achieve political or ideological objectives @en-gb
in scheme: Subject Code
created: 2008-09-15T12:00:00+00:00
modified: 2012-07-10T12:00:00+00:00
broader: Criminalità

Avvocatura
type: Concept
preferred label: advogado @pt-br
preferred label: abogado @es
preferred label: 弁護人 @ja-jp
preferred label: Avocat @fr
preferred label: Anwalt @de
preferred label: lawyer @en-gb
definition: Coloro i quali, esercitando la professione forense, sono legalmente autorizzati a rappresentare qualcuno in una questione o in una controversia legale; gli organismi di rappresentanza ed i consigli
definition: Indivíduo habilitado legalmente para representar outra pessoa ou entidade em assunto legal, tal como advogado, solicitador, procurador, notário. @pt-br
definition: 弁護士、事務弁護士、法廷弁護士、代理人、公証人のような、法律上の問題で他の人や実体を弁護する法的に有能な人 @ja-jp
definition: Cualquiera legalmente habilitado para representar a otra persona o una entidad en un asunto legal, como abogado o solicitante. @es
definition: Jeder der offiziell in der Lage ist eine andere Person rechtlich zu vertreten, wie Anwalt, Rechtsbeistand, Prokurist, Notar. @de
definition: Anyone legally able to represent another person or entity in a legal matter, such as a lawyer, solicitor, barrister, procurator, notary. @en-gb
definition: Personne capable de représenter légalement une autre personne dans une affaire de droit @fr
note: nessuno
in scheme: Subject Code
created: 2004-10-13T12:00:00+00:00
modified: 2012-07-10T12:00:00+00:00
broader: Giustizia
broad match: http://cv.iptc.org/newscodes/mediatopic/20000282

Magistratura
type: Concept
preferred label: judge @en-gb
preferred label: juez @es
preferred label: Juge @fr
preferred label: Richter @de
preferred label: juiz @pt-br
preferred label: 裁判官 @ja-jp
definition: Membro do poder judiciário que tem autoridade para julgar @pt-br
definition: Personne qui a le droit et l'autorité de juger @fr
definition: Membro do poder judicial que tem autoridade para julgar. @pt-pt
definition: 裁判を行う裁判所のメンバー @ja-jp
definition: Mitglieder des Gerichts, die zu Gericht sitzen und Recht sprechen. @de
definition: Insieme degli organi che costituiscono il potere giudiziario; gli organismi di rappresentanza
definition: Miembros del Poder Judicial que que determinar los juicios. @es
definition: Members of the bench that sit in judgement @en-gb
note: nessuno
in scheme: Subject Code
created: 2004-10-13T12:00:00+00:00
modified: 2012-07-10T12:00:00+00:00
broader: Giustizia

Amministrazione giustizia
type: Concept
preferred label: Gerichtsverwaltung @de
preferred label: serviços de tribunal @pt-pt
preferred label: Greffe @fr
preferred label: court administration @en-gb
preferred label: 裁判所職員 @ja-jp
preferred label: administración de corte @es
definition: Auxiliares de justiça. @pt-pt
definition: 裁判所の職員、執行官、速記者など @ja-jp
definition: Angestellte des Gerichts, Gerichtsdiener, Stenografen etc. @de
definition: Actuarios, administradores, taquígrafos. @es
definition: Cancellieri, ufficiali giudiziari, stenografi, ecc...
definition: Court clerks, bailiffs, stenographers etc. @en-gb
definition: Auxiliaires de la justice @fr
note: nessuno
in scheme: Subject Code
created: 2004-10-13T12:00:00+00:00
modified: 2012-07-10T12:00:00+00:00
broader: Giustizia

Corpi Polizia
type: Concept
preferred label: law enforcement @en-gb
preferred label: 法執行機関 @ja-jp
preferred label: Sicherheitskräfte (BGS, LKA, BKA) @de
preferred label: autoridades @es
preferred label: forças policiais @pt-br
preferred label: Forces de l'ordre @fr
definition: Police et gendarmerie, chargés de faire respecter la loi d'un pays @fr
definition: I vari corpi, agenzie, direzioni, dipartimenti impegnati nella prevenzione di azioni delittuose o nell'esecuzione di provvedimenti dell'autorità giudiziaria
definition: Tätigkeitesbereiche, die eingebunden sind in Präventivmaßnahmen zur Verhinderung von Verstößen gegen gültige Gesetze, oder die Gesetzesbrecher vor Gericht zu bringen. @de
definition: Agencias que previenen que se desobedezcan las leyes establecidas, y llevar a juicio a quienes tratan de violarlas. @es
definition: 制定された法律に違反しないようにしたり、法律に服従しないものを公正に導くことに関係している政府機関 @ja-jp
definition: Agências envolvidas na prevenção da desobediência às leis estabelecidas e em levar a tribunal os que desobedecem a essas leis. @pt-br
definition: Agencies involved in attempts to prevent disobedience to established laws, or to bring to justice those that disobey those laws @en-gb
note: nessuno
in scheme: Subject Code
created: 2003-04-05T12:00:00+00:00
modified: 2012-07-10T12:00:00+00:00
broader: Forze Ordine

Indagine
type: Concept
preferred label: 捜査 @ja-jp
preferred label: investigation @en-gb
preferred label: Enquête @fr
preferred label: Strafanzeige @de
preferred label: investigação policial @pt-pt
preferred label: investigación @es
definition: 逮捕するまでの犯罪に対する調査過程 @ja-jp
definition: Processus d'enquête sur un éventuel crime @fr
definition: Processo de investigação sobre um crime eventual. @pt-pt
definition: Proceso de indagación de un posible crimen, hasta el momento de un arresto. @es
definition: Process of inquiry of a possible crime up to the point of arrest @en-gb
definition: Untersuchung über ein mögliches Verbrechen bis zur Verhaftung. @de
definition: Procedimento di inchiesta su un possibile crimine
note: nessuno
in scheme: Subject Code
created: 2004-04-22T12:00:00+00:00
modified: 2012-07-10T12:00:00+00:00
broader: Forze Ordine

Arresto
type: Concept
preferred label: arrest @en-gb
preferred label: detenção @pt-br
preferred label: Untersuchungshaft @de
preferred label: arresto @es
preferred label: Arrestation @fr
preferred label: 逮捕・拘束 @ja-jp
definition: Festnahme bei Verdacht auf ein Verbrechen. @de
definition: 犯罪容疑者の拘留 @ja-jp
definition: Detention of a suspect of a crime @en-gb
definition: Détention du suspect d'un crime @fr
definition: Provvedimento limitativo della libertà personale
definition: Detenção de um suspeito de um crime. @pt-pt
definition: Detención de un sospechodo de un crimen @es
note: nessuno
in scheme: Subject Code
created: 2004-04-22T12:00:00+00:00
modified: 2012-07-10T12:00:00+00:00
broader: Forze Ordine

Multe, Ammende
type: Concept
preferred label: multa @pt-br
preferred label: 罰金 @ja-jp
preferred label: fine @en-gb
preferred label: Amende @fr
preferred label: Geldstrafe @de
definition: Pene monetarie
definition: 罰金刑 @ja-jp
definition: Strafe, die mit Geld abgegolten wird. @de
definition: Punição monetária. @pt-br
definition: Castigo monetario. @es
definition: Condamnation à payer une somme d'argent pour une infraction @fr
definition: Monetary punishment @en-gb
note: nessuno
in scheme: Subject Code
created: 2004-10-13T12:00:00+00:00
modified: 2012-07-10T12:00:00+00:00
broader: Pena

execução
type: Concept
preferred label: Exekution @de
preferred label: execution @en-gb
definition: Cumprimento de execuções por um governo ou estado. @pt-pt
definition: The carrying out of executions by a government or state, not by extralegal groups/organisations @en-gb
definition: Hinrichtungen durch eine Regierung oder Staat, nicht durch extralegale Gruppen/Organisationen. @de
in scheme: Subject Code
created: 2007-08-28T12:00:00+00:00
modified: 2012-07-10T12:00:00+00:00
broader: Pena
broad match: http://cv.iptc.org/newscodes/mediatopic/20000134

Penale
type: Concept
preferred label: criminal @es
preferred label: 刑法 @ja-jp
preferred label: Droit Pénal @fr
preferred label: Strafgesetzbuch @de
definition: 刑法典体系 @ja-jp
definition: Sistema del código criminal @es
definition: Sistema do código criminal. @pt-pt
definition: Sistema del codice e della procedura penale
definition: L'administration de la justice et les droits de la défense @fr
definition: System der Strafvergehen und Delikte. @de
definition: The criminal code system @en-gb
note: nessuno
in scheme: Subject Code
created: 2004-10-13T12:00:00+00:00
modified: 2012-07-10T12:00:00+00:00
broader: Codici

Civile
type: Concept
preferred label: civil @en-gb
preferred label: Bürgerliches Gesetzbuch @de
preferred label: 民法 @ja-jp
preferred label: Droit civil @fr
definition: Sistema do código civil. @pt-pt
definition: 民法典体系 @ja-jp
definition: Sistema del codice e della procedura civile
definition: Les droits individuels @fr
definition: System der zivilen Vergehen und Delikte. @de
definition: The civil code system @en-gb
definition: Sistema del código civil @es
note: nessuno
in scheme: Subject Code
created: 2004-10-13T12:00:00+00:00
modified: 2012-07-10T12:00:00+00:00
broader: Codici

Diritti civili
type: Concept
preferred label: Zivilrecht @de
preferred label: 公民権 @ja-jp
preferred label: direitos cívicos @pt-br
preferred label: Droits civils @fr
preferred label: civil rights @en-gb
preferred label: derechos civiles @es
definition: Rechte des Einzelnen im Bürgerlichen Recht. @de
definition: Diritti degli individui sotto la legge
definition: Direitos dos indivíduos no plano civil. @pt-br
definition: Droits des citoyens sur le plan civil @fr
definition: Rights of individuals under civil law @en-gb
definition: Derechos de los individuos bajo la ley civil. @es
definition: 民法上の個人の権利 @ja-jp
note: nessuno
in scheme: Subject Code
created: 2003-04-05T12:00:00+00:00
modified: 2012-07-10T12:00:00+00:00
broader: Giustizia e diritti

Causa
type: Concept
preferred label: litigios @es
preferred label: litígio @pt-pt
preferred label: Rechtsstreit @de
preferred label: Litige @fr
preferred label: litigation @en-gb
preferred label: 訴訟 @ja-jp
definition: Llevar a la corte por medio de un juez o jurado asuntos que se disputan @es
definition: Streitigkeiten, die vor Gericht gebracht werden, um von einer Jury entschieden zu werden. @de
definition: Presentazione degli argomenti di una controversia davanti ad un giudice per una risoluzione
definition: Levar a tribunal assuntos que se disputam para resolução por meio de juiz e/ou júri. @pt-pt
definition: Action en justice pour régler un litige @fr
definition: 係争点を裁判官そして/あるいは陪審員が解決するために裁判を起こす @ja-jp
definition: Taking disputed issues to court for settlement by judge and/or jury @en-gb
note: nessuno
in scheme: Subject Code
created: 2003-04-05T12:00:00+00:00
modified: 2012-07-10T12:00:00+00:00
broader: Processo

Arbitrato
type: Concept
preferred label: arbitragem @pt-br
preferred label: arbitration @en-gb
preferred label: 調停 @ja-jp
preferred label: arbitraje @es
preferred label: Schiedsgericht @de
preferred label: Arbitrage @fr
definition: Règlement d'un différend par un arbitre @fr
definition: Lösung von Streitigkeiten durch eine neutrale Instanz. @de
definition: Risoluzione di una controversia mediante il ricorso ad uno o più arbitri nominati dalle parti
definition: 中立の委員会による問題の解決 @ja-jp
definition: Resolução de disputas por meio de tribunal arbitral. @pt-pt
definition: Resolución de asuntos en cuestión por medio de un tribunal neutral. @es
definition: Resolution of disputed issues by a neutral panel @en-gb
note: nessuno
in scheme: Subject Code
created: 2003-04-05T12:00:00+00:00
modified: 2012-07-10T12:00:00+00:00
broader: Processo

Udienza preliminare
type: Concept
preferred label: corte preliminar @es
preferred label: court preliminary @en-gb
preferred label: Audiences préliminaires @fr
preferred label: 予審 @ja-jp
preferred label: processos preliminares @pt-pt
preferred label: Anhörung @de
definition: Action intentée par la justice en vue de poursuites judiciaires @fr
definition: Procedimentos anteriores à fase de julgamento que incluem arguições, fianças, moções e depoimentos. @pt-pt
definition: Vorgerichtliches Vorgehen inklusive Verteidigung, Kaution, Anträge, Indizien, Aussagen. @de
definition: Pre-juicio que incluye hechos como declaratorias, fianzas, mociones, descubriemientos y deposiciones. @es
definition: Eventos preliminares que incluem arguições, fianças, moções, descobertas, depoimentos. @pt-br
definition: Procedimento giudiziario precedente il processo per la conferma di provvedimenti dell'A.G. o per decidere sul rinvio a giudizio
definition: 請願、保釈、裁定の申立、証拠開示手続、証言録取を含む公判前のイベント @ja-jp
definition: Pre-trial events including pleas, bail, motions, discovery, depositions. @en-gb
note: nessuno
in scheme: Subject Code
created: 2004-04-22T12:00:00+00:00
modified: 2012-07-10T12:00:00+00:00
broader: Processo

Imputato
type: Concept
preferred label: acusado @es
preferred label: Accusé @fr
preferred label: réu @pt-br
preferred label: 被告 @ja-jp
preferred label: defendant @en-gb
preferred label: Angeklagter @de
definition: La persona en juicio. @es
definition: Indivíduo que está sendo julgado em tribunal. @pt-br
definition: Indivíduo que está a ser julgado em tribunal. @pt-pt
definition: Chi nel processo penale viene accusato di aver commesso un reato.
definition: 公判中の人 @ja-jp
definition: The person on trial @en-gb
definition: Die Person, die vor Gericht steht. @de
definition: Une personne qui est accusée lors d'un procès @fr
note: nessuno
in scheme: Subject Code
created: 2004-04-22T12:00:00+00:00
modified: 2012-07-10T12:00:00+00:00
broader: Accusa

Teste
type: Concept
preferred label: testemunha @pt-pt
preferred label: witness @en-gb
preferred label: Zeuge @de
preferred label: Témoin @fr
preferred label: testigo @es
preferred label: 証人 @ja-jp
definition: A person who testifies @en-gb
definition: Eine Person, die etwas bezeugt. @de
definition: Chi viene chiamato rendere testimonianza
definition: 証言する人 @ja-jp
definition: Indivíduo que testemunha. @pt-br
definition: Una persona que testifica. @es
definition: Une personne qui témoigne @fr
note: nessuno
in scheme: Subject Code
created: 2004-04-22T12:00:00+00:00
modified: 2012-07-10T12:00:00+00:00
broader: Accusa

Corti, Tribunali internazionali
type: Concept
preferred label: corte o tribunal internacional @es
preferred label: international court or tribunal @en-gb
preferred label: tribunal internacional @pt-pt
preferred label: 国際法廷 @ja-jp
preferred label: Cour ou tribunal international @fr
preferred label: Internationales Strafgericht @de
definition: 欧州人権裁判所、ハーグ国際司法裁判所、国際司法裁判所などの国際法廷の活動 @ja-jp
definition: Attività dei tribunali internazionali come la Corte Europea per i Diritti Umani, Tribunale dell'Aia, la Corte Internazionale di giustizia, ecc...
definition: Tribunaux et cours internationales de justice @fr
definition: Aktivitäten von internationalen Tribunalen wie der Europäische Gerichtshof für Menschenrechte, Internationaler Gerichtshof in Den Haag etc. @de
definition: Actividades de tribunales internacionales como la corte europea de derechos humanos, el tribunal de la Haya, la corte internacional de justicia, etc. @es
definition: Atividades de tribunais internacionais como o Tribunal Europeu dos Direitos do Homem, o Tribunal de Haia, o Tribunal Internacional de Justiça, etc. @pt-pt
definition: The activities of international tribunals such as European court for human rights, Hague tribunal, International Court of Justice etc @en-gb
note: nessuno
in scheme: Subject Code
created: 2003-11-26T12:00:00+00:00
modified: 2012-07-10T12:00:00+00:00
broader: Diritto Internazionale

Estradizione
type: Concept
preferred label: Extradition @fr
preferred label: extradición @es
preferred label: extradition @en-gb
preferred label: extradição (processos) @pt-br
preferred label: 犯罪者引き渡し @ja-jp
preferred label: Auslieferung @de
definition: Legaler Austausch zwischen Ländern von Kriminellen und Verdächtigen. @de
definition: Transferencia legal de criminales o sospechosos entre paises. @es
definition: Transferência legal de criminosos ou suspeitos de crimes entre países. @pt-br
definition: 国家間で行われる法に則った犯罪者や容疑者の移送 @ja-jp
definition: Legal transfer of criminals or suspects between countries @en-gb
definition: Trasferimento legale da un Paese ad un altro di una persona ricercata per un determinato crimine o condannata per esso.
definition: Remise légale à un pays d'un individu recherché ou soupçonné de crime @fr
note: nessuno
in scheme: Subject Code
created: 2004-10-13T12:00:00+00:00
modified: 2012-07-10T12:00:00+00:00
broader: Diritto Internazionale

Frodi
type: Concept
preferred label: Fraude @fr
preferred label: fraude @pt-pt
preferred label: 詐欺 @ja-jp
preferred label: Betrug @de
preferred label: fraud @en-gb
definition: Absichtliche Täuschung, die die Rechte und das Eigentum anderer beschädigen. @de
definition: Engano intencional que causa a perda de direitos e bens. @pt-br
definition: Intentional deception that causes others to give up rights or property @en-gb
definition: 意図的にだまして他人の権利あるいは財産を処分すること @ja-jp
definition: Actes frauduleux @fr
definition: Attività delittuose che determinano la perdita di diritti o di proprietà da parte di altri
definition: Engaño intencional a causa del cual otros pierden derechos o bienes. @es
note: nessuno
in scheme: Subject Code
created: 2000-10-30T12:00:00+00:00
modified: 2010-12-15T17:01:09+00:00
broader: Crimini societari

Appropriazioni indebite
type: Concept
preferred label: embezzlement @en-gb
preferred label: peculato @pt-pt
preferred label: 横領 @ja-jp
preferred label: Veruntreuung/Unterschlagung @de
preferred label: malversación @es
preferred label: Détournements @fr
definition: Robo intencional de dinero que ha sido dejado en nuestra custodia. @es
definition: 人から委ねられた財産の意図的な窃盗 @ja-jp
definition: The intentional theft of money left in one's care @en-gb
definition: Absichtlicher Diebstahl von anvertrautem Geld. @de
definition: Détournements de fonds publics ou privés @fr
definition: Roubo intencional de dinheiro deixado a cargo de alguém. @pt-br
definition: Reati compiuti da chi si appropria di un bene altrui di cui abbia disponibilità
definition: Desvio e roubo de dinheiros públicos por quem os tinha a seu cargo. @pt-pt
note: nessuno
in scheme: Subject Code
created: 2000-10-30T12:00:00+00:00
modified: 2010-12-15T17:01:09+00:00
broader: Crimini societari

Limitazioni alla concorrenza
type: Concept
preferred label: restrição ao comércio @pt-pt
preferred label: Infraction commerciale @fr
preferred label: restraint of trade @en-gb
preferred label: Wettbewerbsverstoß @de
preferred label: 不当な取引制限 @ja-jp
preferred label: restricción del comercio @es
definition: Interferenze nella libera concorrenza in affari e commercio
definition: Entrave à livre concorrência nos negócios e no comércio. @pt-pt
definition: Interferencia en libre competencia de empresas y comercio @es
definition: Interference in free competition in business and trade @en-gb
definition: Eingreifen in den freien Wettbewerb in Markttätigkeit und Handel. @de
definition: ビジネスと通商の自由競争への介入 @ja-jp
definition: Entrave à la libre concurrence @fr
note: nessuno
in scheme: Subject Code
created: 2000-10-30T12:00:00+00:00
modified: 2010-12-15T17:01:09+00:00
broader: Crimini societari

Inadempienze contrattuali
type: Concept
preferred label: breach of contract @en-gb
preferred label: violación de contrato @es
preferred label: Violation de contrat @fr
preferred label: quebra de contrato @pt-pt
preferred label: 契約違反 @ja-jp
preferred label: Vertragsbruch @de
definition: Bruch von legalen Verträgen zwischen Unternehmen und mit Kunden. @de
definition: Ruptura de acuerdos legales entre compañías y con clientes @es
definition: Rupture of legal agreements between companies, and with customers @en-gb
definition: 会社と顧客の間で契約破棄に至る一連の不祥事 @ja-jp
definition: Quebra de contratos legais entre companhias ou com clientes. @pt-pt
definition: Rotture di accordi legali tra società e/o con i clienti
definition: Rupture de contrat entre des compagnies ou avec des clients @fr
note: nessuno
in scheme: Subject Code
created: 2000-10-30T12:00:00+00:00
modified: 2010-12-15T17:01:09+00:00
broader: Crimini societari

Infrazioni all'antitrust
type: Concept
preferred label: Kartellverstoß @de
preferred label: delitos antimonopolio @es
preferred label: crime antitruste @pt-br
preferred label: anti-trust crime @en-gb
preferred label: 独禁法違反 @ja-jp
preferred label: Infraction anti-trust @fr
preferred label: crime antitrust @pt-pt
definition: Violação das leis contra monopólios. @pt-br
definition: Violations of laws against monopolies @en-gb
definition: Verletzung von Gesetzen gegen Monopole. @de
definition: 独占禁止法の違反 @ja-jp
definition: Violaciones de leyes entre monopolios @es
definition: Violazioni delle leggi contro i monopoli
definition: Violation des lois contre le monopole @fr
note: nessuno
in scheme: Subject Code
created: 2000-10-30T12:00:00+00:00
modified: 2010-12-15T17:01:09+00:00
broader: Crimini societari

Corruzione
type: Concept
preferred label: Korruption @de
preferred label: 汚職 @ja-jp
preferred label: corrupção @pt-br
preferred label: corrupción @es
preferred label: corruption @en-gb
preferred label: Corruption @fr
definition: General business misbehaviour @en-gb
definition: Comportamento desonesto nos negócios em geral. @pt-br
definition: Comportamento in generale scorretto negli affari
definition: 事業上の不正行為全般 @ja-jp
definition: Comportement malhonnête dans les affaires @fr
definition: Mal manejo de negocios en general. @es
definition: Generelles Missverhalten in Geschäftsbeziehungen. @de
note: nessuno
in scheme: Subject Code
created: 2004-10-13T12:00:00+00:00
modified: 2012-07-10T12:00:00+00:00
broader: Crimini societari

Tangenti
type: Concept
preferred label: suborno @pt-br
preferred label: Bestechung @de
preferred label: Subornation de témoins @fr
preferred label: 贈収賄 @ja-jp
preferred label: soborno @es
preferred label: bribery @en-gb
definition: Payments or benefits to influence the outcome of a legal case @en-gb
definition: Pagos o regalos que se dan para influenciar el resultado de un caso legal o decisiones. @es
definition: Dinheiro ou benefícios com que se pretende influenciar o resultado de um caso legal. @pt-pt
definition: Action de suborner des témoins pour influencer le cours d'une affaire de justice @fr
definition: 金銭もしくは利益(の供与)が訴訟結果に影響を与える @ja-jp
definition: Comportamenti delittuosi consistenti nel dare/ricevere beni perché siano compiuti atti contrari ai doveri d'ufficio
definition: Zahlungen oder Spenden, um den Ausgang einer legalen Angelegenheit zu beeinflussen. @de
note: nessuno
in scheme: Subject Code
created: 2004-10-13T12:00:00+00:00
modified: 2012-07-10T12:00:00+00:00
broader: Crimini societari

Disastri, Incidenti
type: Concept
preferred label: catástrofes y accidentes @es
preferred label: disaster and accident @en-gb
preferred label: Katastrophe und Unglück @de
preferred label: acidentes e desastres @pt-br
preferred label: 災害・事故 @ja-jp
preferred label: Désastres et accidents @fr
definition: 命を奪い、生き物を傷つけ、物や財産の損害をもたらすような、人災や自然災害 @ja-jp
definition: Disastri naturali o provocati dall'uomo che determinano la morte o il ferimento di esseri viventi e/o danni a oggetti o proprietà
definition: Désastres naturels ou provoqués par l'homme @fr
definition: Accidentes humanos y eventos de la naturaleza resultantes en pérdida de vidas o daños a criaturas vivientes @es
definition: Man made and natural events resulting in loss of life or injury to living creatures and/or damage to inanimate objects or property. @en-gb
definition: Desastres naturais ou provocados pelo homem, de que resultam perda de vidas ou ferimentos de criaturas e/ou danos de objetos ou propriedade. @pt-pt
definition: Von Menschen erzeugte oder naturgegebene Ereignisse, die zu Todesfällen oder Verletzungen von Lebewesen und/oder der Zerstörung von Objekten oder Eigentum führen. @de
note: nessuno
in scheme: Subject Code
created: 2000-10-30T12:00:00+00:00
modified: 2010-12-15T17:01:09+00:00
narrower: Siccità
narrower: Terremoto
narrower: Carestia
narrower: Incendio
narrower: Inondazione
narrower: Incidente industriale
narrower: Disastri meteorologici
narrower: Incidenti nucleari
narrower: Inquinamento
narrower: Incidenti nei trasporti
narrower: Eruzione
narrower: Organizzazioni di aiuto e soccorso
narrower: Incidente (generico)
narrower: Emergenza
narrower: Disastri (generico)
narrower: Piani Emergenza
narrower: Salvataggio

Siccità
type: Concept
preferred label: sequía @es
preferred label: seca @pt-br
preferred label: 干ばつ @ja-jp
preferred label: Sécheresse @fr
preferred label: Dürre @de
preferred label: drought @en-gb
definition: Grave falta de água durante determinado período de tempo. @pt-br
definition: Ein schwerer Mangel an Wasser über einen bestimmten Zeitraum. @de
definition: ある期間での厳しい水不足 @ja-jp
definition: La falta severa de agua dentro de un periodo de tiempo. @es
definition: Grave e prolungata mancanza d'acqua
definition: Période au cours de laquelle l'eau manque @fr
definition: A severe lack of water over a period of time @en-gb
note: nessuno
in scheme: Subject Code
created: 2000-10-30T12:00:00+00:00
modified: 2010-12-15T17:01:09+00:00
broader: Disastri, Incidenti

Terremoto
type: Concept
preferred label: terremoto @pt-br
preferred label: Tremblement de terre @fr
preferred label: sismo @pt-pt
preferred label: Erdbeben @de
preferred label: earthquake @en-gb
preferred label: 地震 @ja-jp
definition: El movimientos de las placa tectónicas de la Tierra, que crean an algunos casos, daños a las estructuras. @es
definition: 地球の地殻変動プレートが動くこと。場合によっては構造物に被害を引き起こす @ja-jp
definition: The shifting of the tectonic plates of the Earth, creating in some cases damage to structures @en-gb
definition: Movimentos das placas tectônicas da crosta terrestre, que, em alguns casos, provocam danos nas estruturas. @pt-br
definition: Die Bewegung der Erdplatten, die in manchen Fällen eine Zerstörung der Oberfläche verursacht. @de
definition: Vibração da superfície terrestre resultante de movimentos de placas tectónicas, de atividade vulcânica ou da migração de gases no interior da Terra, principalmente metano. @pt-pt
definition: Rapida e violenta vibrazione della crosta terrestre per la rottura dell'equilibrio all'interno delle masse rocciose
definition: Mouvement des plaques de la croûte terrestre, endommageant parfois les structures @fr
note: nessuno
in scheme: Subject Code
created: 2000-10-30T12:00:00+00:00
modified: 2010-12-15T17:01:09+00:00
broader: Disastri, Incidenti

Carestia
type: Concept
preferred label: fome @pt-pt
preferred label: 飢饉 @ja-jp
preferred label: Hunger @de
preferred label: Famine @fr
preferred label: hambruna @es
preferred label: famine @en-gb
definition: Grave falta de comida para a população. @pt-br
definition: Grave mancanza di cibo o comunque di sostentamento in un'area geografica o per una popolazione e per un lungo periodo di tempo
definition: Disète de vivres @fr
definition: Severe lack of food for a large population @en-gb
definition: Schwerer Mangel an Nahrungsmitteln für eine große Bevölkerung. @de
definition: Falta severa de comida entre la población. @es
definition: 多くの人々がひどい食料不足になること @ja-jp
note: nessuno
in scheme: Subject Code
created: 2000-10-30T12:00:00+00:00
modified: 2010-12-15T17:01:09+00:00
broader: Disastri, Incidenti

Incendio
type: Concept
preferred label: fire @en-gb
preferred label: Brand, Feuer @de
preferred label: 火災 @ja-jp
preferred label: incendios @es
preferred label: incêndios @pt-pt
preferred label: Incendie @fr
definition: Queima e combustão de materiais, mediante a combinação de calor elevado e oxigênio. @pt-br
definition: Flammes qui accompagnent une combustion @fr
definition: Accensione e consumo di materiali attraverso una combinazione di alta temperatura e ossigeno
definition: 高温と酸素の化合によって物質が燃焼し焼失すること @ja-jp
definition: Verbrennung und Zerstörung von Materialien durch eine Verbindung von großer Hitze und Sauerstoff. @de
definition: Queima e combustão de materiais, mediante a combinação de calor elevado e oxigénio. @pt-pt
definition: Ignition and consumption of materials through a combination of high heat and oxygen @en-gb
definition: Quema o consumo de materiales a través de una combinación de algo calor y oxigeno. @es
note: nessuno
in scheme: Subject Code
created: 2000-10-30T12:00:00+00:00
modified: 2010-12-15T17:01:09+00:00
broader: Disastri, Incidenti

Inondazione
type: Concept
preferred label: Inondation @fr
preferred label: inundações @pt-br
preferred label: flood @en-gb
preferred label: inundaciones @es
preferred label: Hochwasser @de
preferred label: 洪水 @ja-jp
definition: Excesso de água, causado por chuvas intensas ou por neve derretida. @pt-br
definition: Débordement des eaux qui submergent le sol @fr
definition: Exceso de agua causado por intensas lluvias o derretimiento de nieve, usualmenete en lugares donde no es deseado. @es
definition: Übermaß an Wasser, verursacht durch schwere Regenfälle oder Schneeschmelze, in der Regel an Orten, wo es nicht gewünscht ist. @de
definition: Surfeit of water, caused by heavy rains or melting snow, usually in places where it's not wanted @en-gb
definition: 通常は望まれない場所で、豪雨や雪解けにより引き起こされる水の氾濫 @ja-jp
definition: Allagamento di un territorio o zona geografica determinato da piogge intense o scioglimento di nevi che possono provocare la rottura di argini e la tracimazione di corsi d'acqua
note: nessuno
in scheme: Subject Code
created: 2000-10-30T12:00:00+00:00
modified: 2010-12-15T17:01:09+00:00
broader: Disastri, Incidenti

Incidente industriale
type: Concept
preferred label: 事故（構造物） @ja-jp
preferred label: accidente industrial @es
preferred label: acidente industrial @pt-pt
preferred label: Accident industriel @fr
preferred label: Industrieunglück @de
preferred label: industrial accident @en-gb
definition: Unfall in einer Fabrik, einem Shop oder einem Büro, meist gefährlich für Menschen. @de
definition: A mishap in a factory, a shop or an office, potentially harmful to humans @en-gb
definition: Una desgracia en una fábrica, negocio u oficina, potencialmente dañino para los humanos. @es
definition: Acidente em fábrica, loja ou oficina, potencialmente perigoso. @pt-pt
definition: Disgrazia o Incidente avvenuti in una fabbrica, in uno stabilimento o comunque in un luogo di produzione, con possibili conseguenze sulla salute degli esseri viventi; Incidente lavoro
definition: 工場、店、オフィスで起こる災難で、潜在的に人に有害な場合もある @ja-jp
definition: Accident industriel @fr
note: nessuno
in scheme: Subject Code
created: 2000-10-30T12:00:00+00:00
modified: 2010-12-15T17:01:09+00:00
broader: Disastri, Incidenti
narrower: Cedimento strutturale

Disastri meteorologici
type: Concept
preferred label: desastre meteorológico @es
preferred label: desastres meteorológicos @pt-pt
preferred label: Unwetter @de
preferred label: meteorological disaster @en-gb
preferred label: Désastre météorologique @fr
preferred label: 気象災害 @ja-jp
definition: Desastre relacionado com o clima. @pt-pt
definition: Desastre relacionado ao clima. @pt-br
definition: Disastri collegati ad avverse condizioni del tempo
definition: Un desastre relacionado al clima. @es
definition: Accident météorologique @fr
definition: A weather-related disaster @en-gb
definition: Ein wetterbedingstes Unglück. @de
definition: 天気関連の災害 @ja-jp
note: nessuno
in scheme: Subject Code
created: 2000-10-30T12:00:00+00:00
modified: 2010-12-15T17:01:09+00:00
broader: Disastri, Incidenti
narrower: Tempeste vento

Incidenti nucleari
type: Concept
preferred label: Atomunglück @de
preferred label: acidente nuclear @pt-pt
preferred label: accidente nuclear @es
preferred label: 放射線事故 @ja-jp
preferred label: Accident nucléaire @fr
preferred label: nuclear accident @en-gb
definition: Sciagura o incidente con la liberazione di sostanze radioattive
definition: Accident nucléaire @fr
definition: Unglück im Zusammenhang mit radioaktiven Materialien. @de
definition: Una tragedia que envuelve materiales radioactivos. @es
definition: 放射性物質を含んだ災害 @ja-jp
definition: A mishap involving radioactive materials @en-gb
definition: Acidente envolvendo materiais radioativos. @pt-pt
note: nessuno
in scheme: Subject Code
created: 2000-10-30T12:00:00+00:00
modified: 2010-12-15T17:01:09+00:00
broader: Disastri, Incidenti

Inquinamento
type: Concept
preferred label: poluição @pt-pt
preferred label: pollution @en-gb
preferred label: Pollution @fr
preferred label: contaminación @es
preferred label: 公害 @ja-jp
preferred label: Umweltverschmutzung @de
definition: Nuisance contribuant à la dégradation de l'environnement @fr
definition: Emissão de materiais indesejados em áreas onde pode ser prejudicial. @pt-pt
definition: Emissions of unwanted materials in areas where it can be harmful @en-gb
definition: 有害物質をある地域に放出すること @ja-jp
definition: Emisión de materiales no deseados en áreas donde puede ser dañino. @es
definition: Emissione o liberazione di sostanze o anche di particolari effetti dannosa per l'ambiente e per l'equilibrio tra esso e le specie viventi
definition: Verschmutzung mit unerwünschtem Material, in Gebieten in denen es gefährlich werden kann. @de
note: nessuno
in scheme: Subject Code
created: 2000-10-30T12:00:00+00:00
modified: 2010-12-15T17:01:09+00:00
broader: Disastri, Incidenti

Incidenti nei trasporti
type: Concept
preferred label: Accident de transport @fr
preferred label: Transportunfall @de
preferred label: acidentes de transporte @pt-br
preferred label: 事故（運輸） @ja-jp
preferred label: accidente de transporte @es
preferred label: transport accident @en-gb
definition: Incidenti che coinvolgono veicoli, mezzi o reti di trasporto
definition: Acidente envolvendo um ou mais veículos. @pt-br
definition: accident mettant en cause un ou plusieurs véhicules et moyen de transport @fr
definition: Accidente que envuelve a uno o más vehiculos. @es
definition: １台以上の乗り物を伴っている事故 @ja-jp
definition: An accident involving one or more vehicles @en-gb
definition: Unfall in den ein oder mehrere Fahrzeuge verwickelt sind. @de
note: nessuno
in scheme: Subject Code
created: 2000-10-30T12:00:00+00:00
modified: 2010-12-15T17:01:09+00:00
broader: Disastri, Incidenti
narrower: Stradali
narrower: Ferroviari
narrower: Aerei e spaziali
narrower: Marittimi

Eruzione
type: Concept
preferred label: volcanic eruption @en-gb
preferred label: Vulkanausbruch @de
preferred label: erupção vulcânica @pt-br
preferred label: erupción volcánica @es
preferred label: 火山噴火 @ja-jp
preferred label: éruption volcanique @fr
definition: Ruptura da crosta terrestre que permite a emissão de material derretido para a superfície. @pt-br
definition: Emissione di lava o altri materiali da un vulcano o da altre fratture nella crosta terrestre
definition: A rupture in the skin of the Earth allowing molten material to escape to the surface @en-gb
definition: 地表にできた裂け目を通じて、融解した物質が表面に漏れること @ja-jp
definition: La ruptura de la corteza terrestre que permite el escape de material derretido hacia la superficie. @es
definition: Bruch in der Erdkruste, aus dem geschmolzenes Material an der Oberfläche ausgeworfen wird. @de
definition: Projections plus ou moins violentes de diverses matières par un volcan @fr
definition: Rutura da crosta terrestre que permite a emissão de material derretido para a superfície. @pt-pt
note: nessuno
in scheme: Subject Code
created: 2000-10-30T12:00:00+00:00
modified: 2010-12-15T17:01:09+00:00
broader: Disastri, Incidenti

Organizzazioni di aiuto e soccorso
type: Concept
preferred label: 救援・支援 @ja-jp
preferred label: relief and aid organisation @en-gb
preferred label: ONG @fr
preferred label: organizações de socorro @pt-pt
preferred label: Hilfsorganisation @de
preferred label: organizaciones de socorro @es
definition: Organizaciones tablecidas para proveer ayuda a aquellos que la necesitan debido a falta de alimentos, agua o albergue. @es
definition: Organismes de secours, généralement protection civile et organisations non gouvernementales @fr
definition: Organisationen, die jenen Hilfe anbieten, die Mangel an Nahrungsmitteln, Wasser oder Unterkunft haben. @de
definition: Organizações estabelecidas para fornecer ajuda àqueles que necessitam devido a falta de alimentos, água ou abrigo. @pt-br
definition: Organizzazioni che intervengono per fornire aiuti a chi ne abbia bisogno per mancanza di cibo, acqua, riparo ecc.
definition: 食物、水あるいは住まいの欠如で困難な状況にいる人々に援助を提供するために設立される組織 @ja-jp
definition: Organizations set up to provide help to those in need because of lack of food, water or shelter @en-gb
note: nessuno
in scheme: Subject Code
created: 2000-10-30T12:00:00+00:00
modified: 2010-12-15T17:01:09+00:00
broader: Disastri, Incidenti

Incidente (generico)
type: Concept
preferred label: 事故（一般） @ja-jp
preferred label: accidentes (general) @es
preferred label: Accident @fr
preferred label: acidente (geral) @pt-pt
preferred label: Unfall @de
preferred label: accident (general) @en-gb
definition: Evénement imprévisible aux conséquences non voulues @fr
definition: Todo evento com consequências indesejadas. @pt-br
definition: Qualquer evento com consequências indesejadas. @pt-pt
definition: Cualquier evento no planeado que causa consecuencias no deseadas. @es
definition: 望まぬ結果を引き起こす予期せぬ出来事 @ja-jp
definition: Any unplanned event that causes unwanted consequences @en-gb
definition: Ogni evento imprevedibile e dalle conseguenze indesiderate generalmente negative per chi lo subisce
definition: Jedes ungeplante Ereignis, das ungewollte Kosequenzen nach sich zieht. @de
note: nessuno
in scheme: Subject Code
created: 2000-10-30T12:00:00+00:00
modified: 2010-12-15T17:01:09+00:00
broader: Disastri, Incidenti

Emergenza
type: Concept
preferred label: caso de emergência @pt-br
preferred label: Situation d'urgence @fr
preferred label: incidentes de emergencia @es
preferred label: Notfall @de
preferred label: emergency incident @en-gb
preferred label: 緊急事態 @ja-jp
definition: 即座の対応を必要とする突然で予期しない出来事 @ja-jp
definition: Ein plötzliches, unerwartetes Ereignis, was eine sofortige Reaktion erfordert. @de
definition: A sudden, unexpected event that requires immediate action @en-gb
definition: Evénement imprévu et soudain demandant une action urgente et immédiate @fr
definition: Evento súbito, inesperado que requer ação imediata. @pt-pt
definition: Un hecho súbito, inesperado que requiere atención inmediata. @es
definition: Evento improvviso e inaspettato che richiede un intervento urgente ed immediato
note: nessuno
in scheme: Subject Code
created: 2000-10-30T12:00:00+00:00
modified: 2010-12-15T17:01:09+00:00
broader: Disastri, Incidenti
narrower: Esplosione

Disastri (generico)
type: Concept
preferred label: catástrofes (general) @es
preferred label: desastre (geral) @pt-pt
preferred label: Katastrophe @de
preferred label: 災害（一般） @ja-jp
preferred label: Désastre @fr
preferred label: disaster (general) @en-gb
definition: Gravi o improvvise sciagure, Catastrofi
definition: Azar sério ou súbito. @pt-br
definition: Desgracias serias o súbitas. @es
definition: 重大なあるいは不意な災難 @ja-jp
definition: Serious or sudden misfortune @en-gb
definition: Tous les désastres sérieux et soudains @fr
definition: Ernsthaftes und plötzliches Unglück. @de
definition: Desgraça imprevista e grave. @pt-pt
note: nessuno
in scheme: Subject Code
created: 2000-10-30T12:00:00+00:00
modified: 2010-12-15T17:01:09+00:00
broader: Disastri, Incidenti
narrower: Disastri naturali
narrower: Frane, Valanghe

Piani Emergenza
type: Concept
preferred label: planificación de emergencia @es
preferred label: Katastrophenschutz @de
preferred label: emergency planning @en-gb
preferred label: planos de emergência @pt-br
preferred label: 災害対策 @ja-jp
preferred label: Prévention et organisation des secours @fr
definition: Planning for actions to deal with sudden, unplanned events @en-gb
definition: Planos de ação para lidar com eventos súbitos e inesperados. @pt-pt
definition: Attività di prevenzione e di pianificazione per affrontare eventi improvvisi e non programmati
definition: 不意で、予期せぬ出来事に対処するための行動を計画すること @ja-jp
definition: Plans d'interventions d'urgence @fr
definition: Vorbereitung auf Aktionen, um mit unvorhergesehenen Ereignissen umgehen zu können. @de
definition: La planificación de acciones para lidiar contra eventos súbitos o no planeados. @es
note: nessuno
in scheme: Subject Code
created: 2000-10-30T12:00:00+00:00
modified: 2010-12-15T17:01:09+00:00
broader: Disastri, Incidenti

Salvataggio
type: Concept
preferred label: 救助活動 @ja-jp
preferred label: Rettung @de
preferred label: salvamento / busca @pt-pt
preferred label: rescue @en-gb
definition: 人間や動物、財産を被害や危険から守るための活動 @ja-jp
definition: Operazione condotta per mettere in salvo persone, animali o proprietà da un danno o un pericolo
definition: Operação para salvar pessoas, animais ou propriedade de dano ou perigo. @pt-br
definition: Aktion um Menschen, Tiere oder Eigentum vor Verletzung oder Gefahr zu schützen. @de
definition: An operation to save people, animals or property from harm or danger. @en-gb
note: nessuno
in scheme: Subject Code
created: 2006-08-21T12:00:00+00:00
modified: 2012-07-10T12:00:00+00:00
broader: Disastri, Incidenti
broad match: http://cv.iptc.org/newscodes/mediatopic/20000168

Cedimento strutturale
type: Concept
preferred label: fallas estructurales @es
preferred label: Konstruktionsfehler @de
preferred label: falhas estruturais @pt-pt
preferred label: 倒壊 @ja-jp
preferred label: structural failures @en-gb
preferred label: Effondrement @fr
definition: Malfaçons d'une structure @fr
definition: Crollo o cedimento di un edificio, un ponte o altro genere di strutture a causa di forze inattese o di progetti inadeguati.
definition: When a building, bridge or other structures collapse because of unexpected forces or poor design @en-gb
definition: Defeitos de um edifício, ponte ou outras estruturas que podem provocar a sua queda. @pt-pt
definition: Wenn ein Gebäude, eine Brücke oder andere Konstruktionen zusammenbrechen aufgrund von unerwarteten Krafteinwirkungen oder Materialfehlern. @de
definition: 予期せぬ力や、貧弱な設計のために、建物、橋などの建造物が壊れてしまう場合 @ja-jp
definition: Cuando edificios , puentes o otras estructuras colapsan debido a hechos fortuitos o diseños precarios. @es
note: nessuno
in scheme: Subject Code
created: 2003-04-05T12:00:00+00:00
modified: 2012-07-10T12:00:00+00:00
broader: Incidente industriale

Tempeste vento
type: Concept
preferred label: Tempête @fr
preferred label: tempestade @pt-br
preferred label: tormentas de viento @es
preferred label: 暴風 @ja-jp
preferred label: Orkan @de
preferred label: tempestade ciclónica @pt-pt
preferred label: windstorms @en-gb
definition: Sturm mit hoher Geschwindigkeit, aber ohne das gewaltige Tempo eines Hurrikans, mit wenig oder ohne Regen oder Hagel. Meistens stark zerstörerisch. @de
definition: Tempeste dovute al maltempo ma senza la forza degli uragani, con presenza o meno di pioggia o grandine e dagli effetti quasi sempre altamente distruttivi
definition: 雨やあられを伴うことは少ない高風速の嵐で、ハリケーンとは異なる。破壊力はきわめて大きい @ja-jp
definition: Tormenta de alta velocidad sin los movimientos de un huracán con poca lluvia y granizos. A menudo muy destructivo. @es
definition: Fenómeno atmosférico caracterizado por ventos fortes, geralmente com pouca chuva, que pode ser altamente destrutivo. @pt-pt
definition: Tempestade de grande velocidade mas sem furacões e com pouca chuva ou granizo. Altamente destrutiva. @pt-br
definition: A storm of high velocity but non-hurricane force movements of air with little or no rain or hail. Often highly destructive @en-gb
definition: Orages, tempêtes mais pas ouragan @fr
note: nessuno
in scheme: Subject Code
created: 2003-04-05T12:00:00+00:00
modified: 2012-07-10T12:00:00+00:00
broader: Disastri meteorologici

Stradali
type: Concept
preferred label: acidente rodoviário @pt-pt
preferred label: Verkehrsunfall @de
preferred label: road accident @en-gb
preferred label: Accident de la route @fr
preferred label: 交通事故 @ja-jp
preferred label: accidentes carreteros @es
definition: Incidenti su strada
definition: Acidentes em estradas. @pt-br
definition: Accidentes en carreteras @es
definition: Unfälle im Straßenverkehr. @de
definition: Accident de la route @fr
definition: 路上事故 @ja-jp
definition: Accidents on roads. @en-gb
note: nessuno
in scheme: Subject Code
created: 2000-10-30T12:00:00+00:00
modified: 2010-12-15T17:01:09+00:00
broader: Incidenti nei trasporti

Ferroviari
type: Concept
preferred label: acidente ferroviário @pt-pt
preferred label: railway accident @en-gb
preferred label: Bahnunglück @de
preferred label: accidentes ferroviarios @es
preferred label: 鉄道事故 @ja-jp
preferred label: Accident de chemin de fer @fr
definition: Accidents involving trains. @en-gb
definition: Acidente envolvendo trens. @pt-br
definition: 列車関連事故 @ja-jp
definition: Unfälle mit Zügen. @de
definition: Accident mettant en cause des trains @fr
definition: Incidenti su reti ferroviarie
definition: Acidente envolvendo comboios. @pt-pt
definition: Accidentes que involucran trenes @es
note: nessuno
in scheme: Subject Code
created: 2000-10-30T12:00:00+00:00
modified: 2010-12-15T17:01:09+00:00
broader: Incidenti nei trasporti

Aerei e spaziali
type: Concept
preferred label: accidentes aéreos y espaciales @es
preferred label: Flugunglück @de
preferred label: Accident dans l'air et l'espace @fr
preferred label: acidente aéreo @pt-pt
preferred label: air and space accident @en-gb
preferred label: 航空・宇宙事故 @ja-jp
definition: Acidente envolvendo aviões ou naves espaciais. @pt-pt
definition: 空あるいは宇宙における航空機関連事故 @ja-jp
definition: Accident aérien ou spatial @fr
definition: Accidentes que involucran naves aéreas o espaciales @es
definition: Unfälle mit Fahrzeugen im Luft- oder Weltraum. @de
definition: Incidenti di mezzi aerei o spaziali
definition: Accidents involving craft in air or space. @en-gb
note: nessuno
in scheme: Subject Code
created: 2000-10-30T12:00:00+00:00
modified: 2010-12-15T17:01:09+00:00
broader: Incidenti nei trasporti

Marittimi
type: Concept
preferred label: accidentes marítimos @es
preferred label: 海難事故 @ja-jp
preferred label: Accidents maritimes @fr
preferred label: acidente marítimo @pt-pt
preferred label: Schiffsunglück @de
preferred label: maritime accident @en-gb
definition: Incidenti in acque marittime o interne
definition: Acidente envolvendo barcos. @pt-pt
definition: Accidentes que involucran naves marinas @es
definition: Accident mettant en cause des bateaux @fr
definition: Accidents involving marine vessels. @en-gb
definition: Unfälle mit Wasserfahrzeugen. @de
definition: 船舶関連事故 @ja-jp
note: nessuno
in scheme: Subject Code
created: 2000-10-30T12:00:00+00:00
modified: 2010-12-15T17:01:09+00:00
broader: Incidenti nei trasporti

Esplosione
type: Concept
preferred label: 爆発 @ja-jp
preferred label: Explosion @de
preferred label: explosão @pt-pt
preferred label: explosión @es
preferred label: explosion @en-gb
definition: Erupções súbitas, geralmente de substâncias químicas. @pt-pt
definition: Sudden eruptions, usually of chemical substances @en-gb
definition: Plötzliche Stichflammen, meistens durch chemischen Substanzen. @de
definition: Erupción imprevista, usualmente causada por sustancias químicas. @es
definition: Eclatement soudain, souvent de substances chimiques @fr
definition: Improvviso scoppio, generalmente provocato da fenomeni fisici o chimici
definition: 通常、化学物質による突然の噴出(爆発) @ja-jp
note: nessuno
in scheme: Subject Code
created: 2004-10-13T12:00:00+00:00
modified: 2012-07-10T12:00:00+00:00
broader: Emergenza

Disastri naturali
type: Concept
preferred label: 自然災害 @ja-jp
preferred label: desastres naturais @pt-br
preferred label: Catastrophe naturelle @fr
preferred label: desastre natural @es
preferred label: Naturkatastrophe @de
preferred label: natural disasters @en-gb
definition: Sucesos Destructivos causados por la naturaleza; huracanes, terremotos, inundaciones, etc. @es
definition: Désastres provoqués par les éléments naturels comme les ouragans @fr
definition: Zerstörerische Ereignisse verursacht durch die Natur, wie Hurrikan, Erdbeben, Flut etc. @de
definition: Destructive incidents caused by the very nature of nature -- hurricanes, earthquakes, floods etc @en-gb
definition: Incidentes destrutivos causados pela natureza - furacões, sismos, inundações, etc. @pt-pt
definition: 自然のまさにその本質によって起こされた破壊的な出来事 -- ハリケーン、地震、洪水など @ja-jp
definition: Incidenti distruttivi causati dai fenomeni naturali.
note: nessuno
in scheme: Subject Code
created: 2003-04-05T12:00:00+00:00
modified: 2012-07-10T12:00:00+00:00
broader: Disastri (generico)

Frane, Valanghe
type: Concept
preferred label: avalanche/deslizamento de terra @pt-br
preferred label: avalancha/alud @es
preferred label: avalanche/aluimento de terras @pt-pt
preferred label: 雪崩・地滑り @ja-jp
preferred label: Avalanche/Glissement de terrain @fr
preferred label: avalanche/landslide @en-gb
preferred label: Lawine/Erdrutsch @de
definition: Plötzliches Verrutschen von großen Schnee- oder Erdmassen. @de
definition: Deslocamento súbito de grandes massas de neve ou terra. @pt-pt
definition: Eboulement soudain du sol ou d'une grande quantité de neige @fr
definition: Sudden dislodging of massive amounts of snow or soil. @en-gb
definition: Movimientos imprevistos de masas de nieve o tierra. @es
definition: 大量の雪や土壌が突然移動すること @ja-jp
definition: Cedimenti improvvisi con conseguenti dislocazioni di grandi masse di terra o sassi o neve; Slavine
note: nessuno
in scheme: Subject Code
created: 2004-10-13T12:00:00+00:00
modified: 2012-07-10T12:00:00+00:00
broader: Disastri (generico)

Economia, affari e finanza
type: Concept
preferred label: 経済・産業 @ja-jp
preferred label: Economie et finances @fr
preferred label: economía, negocios y finanzas @es
preferred label: economia, negócios e finanças @pt-pt
preferred label: Wirtschaft und Finanzen @de
preferred label: economy, business and finance @en-gb
definition: Assuntos relativos à planificação, produção e troca de riqueza. @pt-pt
definition: La pianificazione, la produzione, la circolazione, lo scambio e il consumo della ricchezza
definition: Tout ce qui concerne la production, la circulation, la répartition et la consommation des richesses @fr
definition: All matters concerning the planning, production and exchange of wealth. @en-gb
definition: 富の計画、産出、交換に関連するすべての事柄 @ja-jp
definition: Alle Inhalte, die Planung, Produktion und Austausch von Wohlstand betreffen. @de
definition: Todos los asuntos concernientes a la planificación, producción e intercambio de riqueza @es
note: nessuno
in scheme: Subject Code
created: 2000-10-30T12:00:00+00:00
modified: 2010-12-15T17:01:09+00:00
narrower: Agricoltura
narrower: Produzione Chimica
narrower: Informatica e Telecomunicazioni
narrower: Costruzioni, Proprietà
narrower: Energia
narrower: Servizi finanziari
narrower: Beni Consumo
narrower: Macroeconomia
narrower: Mercati, Borse
narrower: Media
narrower: Metallurgia e Meccanica
narrower: Metalli, Minerali
narrower: Industria Trasformazione
narrower: Turismo, Tempo libero
narrower: Trasporti
narrower: Informazione d'impresa
narrower: Economia (generico)
narrower: Affari (generico)
narrower: Finanza (generico)

Agricoltura
type: Concept
preferred label: agricultura e pescas @pt-br
preferred label: 農林水産 @ja-jp
preferred label: agriculture @en-gb
preferred label: Agriculture @fr
preferred label: agricultura @es
preferred label: Landwirtschaft/Agrar @de
definition: Produção de bens naturais para consumo. @pt-pt
definition: 消費のための天然資材を生産する工程 @ja-jp
definition: Produzione di beni vegetali ed animali destinati al consumo
definition: Prozess zur Produktion von natürlichen Konsumgütern. @de
definition: Ensemble des productions végétales et animales destinées à la consommation @fr
definition: The process of producing natural materials for consumption @en-gb
definition: El proceso de producción de elementos naturales para el consumo. @es
note: nessuno
in scheme: Subject Code
created: 2000-10-30T12:00:00+00:00
modified: 2010-12-15T17:01:09+00:00
broader: Economia, affari e finanza
narrower: Coltivazioni
narrower: Industria ittica
narrower: Silvicoltura
narrower: Allevamento
narrower: Viticoltura
narrower: Acquicoltura

Produzione Chimica
type: Concept
preferred label: 化学工業 @ja-jp
preferred label: indústria e produtos químicos @pt-pt
preferred label: Chimie @fr
preferred label: productos químicos @es
preferred label: Chemie @de
preferred label: chemicals @en-gb
definition: Natural or manmade materials used to produce other materials @en-gb
definition: 他の材料生成の為に使われる天然または人工の材料 @ja-jp
definition: Materiais naturais ou feitos pelo homem para produzir outros materiais. @pt-pt
definition: Natürliche oder künstliche Stoffe, um andere Materialien zu erzeugen. @de
definition: Processi riguardanti prodotti naturali o di sintesi utilizzati per la realizzazione di altri materiali e/o sostanze
definition: Materiales naturales o hechos por el hombre para producir otros materiales. @es
definition: Produits naturels ou non utilisés pour la production d'autres produits @fr
note: nessuno
in scheme: Subject Code
created: 2000-10-30T12:00:00+00:00
modified: 2010-12-15T17:01:09+00:00
broader: Economia, affari e finanza
narrower: Biotecnologia
narrower: Fertilizzanti
narrower: Cosmetici, Prodotti per l'igiene
narrower: Chimica inorganica
narrower: Chimica organica
narrower: Industria Farmaceutica
narrower: Sintetici e plastica

Informatica e Telecomunicazioni
type: Concept
preferred label: Computer und Informationstechnologie @de
preferred label: ＩＴ産業 @ja-jp
preferred label: computing and information technology @en-gb
preferred label: computación e informática @es
preferred label: tecnologias de informação @pt-br
preferred label: Informatique et technologie de l'information @fr
definition: Anything to do with the computing and/or transmission of information from one point to another. @en-gb
definition: Quanto concerne con l'elaborazione e il trattamento tecnologico dei dati e con la trasmissione delle informazioni
definition: コンピュータ処理および(または)通信で行われる情報転送 @ja-jp
definition: Tout ce qui concerne les ordinateurs et la transmission de l'information d'un point à un autre @fr
definition: Tudo o que diz respeito à computação e à transmissão de informação de um ponto para outro. @pt-br
definition: Cualquier cosa que tenga que ver con computación y/o transmisión de información de un punto a otro. @es
definition: Alles was die elektronische Verarbeitung und Übertragung von Information von einem Punkt zu einem anderen. @de
note: nessuno
in scheme: Subject Code
created: 2000-10-30T12:00:00+00:00
modified: 2010-12-15T17:01:09+00:00
broader: Economia, affari e finanza
narrower: hardware
narrower: Reti e Connessioni
narrower: Tecnologia satellitare
narrower: Semiconduttori, Componenti elettronici
narrower: software
narrower: Sistemi Telecomunicazione
narrower: Servizi Telecomunicazione
narrower: Sicurezza
narrower: Tecnologia wireless

Costruzioni, Proprietà
type: Concept
preferred label: équipement et immobilier @fr
preferred label: construção e obras públicas @pt-pt
preferred label: Bau @de
preferred label: 建設・不動産 @ja-jp
preferred label: construction and property @en-gb
preferred label: construcción e inmobiliaria @es
definition: Alle Inhalte, die den Bau und Verkauf von baulichem Eigentum betreffen. @de
definition: Tutti gli elementi che hanno a che fare con la costruzione e/o la vendita di proprietà immobiliari
definition: Elementos relativos à construção e venda de propriedades. @pt-br
definition: Industrie de la construction et de l'immobilier @fr
definition: All items pertaining to the construction and sale of property @en-gb
definition: 建設と不動産販売に関係する全ての事柄 @ja-jp
definition: todos los elementos relacionados a la construccion y venta de propiedades. @es
note: nessuno
in scheme: Subject Code
created: 2000-10-30T12:00:00+00:00
modified: 2010-12-15T17:01:09+00:00
broader: Economia, affari e finanza
narrower: Grandi Opere
narrower: Edilizia Residenziale
narrower: Immobiliaristica
narrower: Fattorie
narrower: Prezzo Terreni
narrower: Ristrutturazioni
narrower: Progettazione, Ingegneria

Energia
type: Concept
preferred label: エネルギー・資源 @ja-jp
preferred label: énergie et ressources @fr
preferred label: energía y recursos @es
preferred label: Energie @de
preferred label: energy and resource @en-gb
preferred label: energia @pt-pt
definition: Produktion elektrischer Energie und Wasser, Wind, Sonne und Brennstoffe um diese zu erzeugen. @de
definition: Production of electrical power, and the water, air, sunlight, and fuels used to produce them @en-gb
definition: Processo di produzione dell'energia elettrica
definition: 電力の生産と、電力を生産するのに必要な水、空気、太陽光やその他の燃料 @ja-jp
definition: Produção de energia elétrica e água, ar, luz solar e combustíveis usados na sua produção. @pt-br
definition: Producción de energía eléctrica, y agua, aire, luz solar, y los combustibles usados para su producción. @es
definition: L'ensemble des ressources servant à produire de l'énergie @fr
note: nessuno
in scheme: Subject Code
created: 2000-10-30T12:00:00+00:00
modified: 2010-12-15T17:01:09+00:00
broader: Economia, affari e finanza
narrower: Energie alternative
narrower: Carbone
narrower: Petrolio e Gas, distribuzione
narrower: Petrolio e Gas, riserve
narrower: Energia nucleare
narrower: Elettricità
narrower: Trattamento Rifiuti
narrower: Risorse Idriche
narrower: Risorse naturali (generico)
narrower: Energia (generico)
narrower: Gas naturali
narrower: Benzina
narrower: Gasolio
narrower: Kerosene

Servizi finanziari
type: Concept
preferred label: serviços financeiros @pt-br
preferred label: (Finanz)dienstleistung @de
preferred label: servicios financieros y comerciales @es
preferred label: 金融・サービス業 @ja-jp
preferred label: financial and business service @en-gb
preferred label: Services financiers @fr
definition: Services financiers et aux entreprises @fr
definition: お金の送金、保護手段、入出金の補足、または営利事業に対しての支援を提供する事業 @ja-jp
definition: Serviços que transmitem, protegem, acompanham o dinheiro ou fornecem apoio a empresas comerciais. @pt-br
definition: Unternehmen die vermitteln, beschützen Geldgeschäfte begleiten, oder Unterstützung anbieten für kommerzielle Unternehmen. @de
definition: Services that transmit, safeguard, keep track of money or provide backup to commercial enterprises @en-gb
definition: Servizi riguardanti la movimentazione del denaro o di sostegno alle imprese commerciali
definition: Servicios que transportan, protegen, observan los cursos de dinero y proveen respaldo a empresas comerciales. @es
note: nessuno
in scheme: Subject Code
created: 2000-10-30T12:00:00+00:00
modified: 2010-12-15T17:01:09+00:00
broader: Economia, affari e finanza
narrower: Contabilità, Revisione
narrower: Banche
narrower: Consulenze
narrower: Agenzie per l'impiego
narrower: Servizi Sanitari
narrower: Assicurazioni
narrower: Servizi legali
narrower: Indagini Mercato
narrower: Negoziazioni Titoli
narrower: Investimenti personali
narrower: Tendenze Mercato
narrower: Spedizioni
narrower: Servizi per la persona
narrower: Servizi Ambientali
narrower: Servizi funebri
narrower: Noleggi
narrower: Servizi matrimoniali
narrower: Finanze personali
narrower: Redditi personali
narrower: Aste
narrower: Servizi di stampa, promozionali
narrower: Servizi Investimento

Beni Consumo
type: Concept
preferred label: Konsumgüter @de
preferred label: consumer goods @en-gb
preferred label: Distribution @fr
preferred label: 流通 @ja-jp
preferred label: bens de consumo @pt-pt
preferred label: bienes de consumo @es
definition: Artículos producidos para ser vendidos a individuos. @es
definition: Items produced for and sold to individuals @en-gb
definition: Waren, die für Individuen produziert und an sie verkauft werden. @de
definition: Les biens non durables destinés à la consommation @fr
definition: Artigos produzidos para serem vendidos. @pt-br
definition: Articoli prodotti per essere venduti
definition: 個人向けに生産して販売する商品 @ja-jp
note: nessuno
in scheme: Subject Code
created: 2000-10-30T12:00:00+00:00
modified: 2010-12-15T17:01:09+00:00
broader: Economia, affari e finanza
narrower: Abbigliamento
narrower: Grandi magazzini
narrower: Alimenti
narrower: Vendita per corrispondenza
narrower: Dettaglio
narrower: Negozi specializzati
narrower: Ingrosso
narrower: Bevande
narrower: Commercio elettronico
narrower: Beni di lusso
narrower: Beni non durevoli
narrower: Giocattoli

Macroeconomia
type: Concept
preferred label: macroeconomía @es
preferred label: macro economics @en-gb
preferred label: macroeconomia @pt-pt
preferred label: Volkswirtschaft @de
preferred label: Macro économie @fr
preferred label: マクロ経済 @ja-jp
definition: Economia em grande escala, a nível mundial ou nacional. @pt-pt
definition: Broad scale economics and the world or national level @en-gb
definition: スケールの大きい経済分析。全世界、もしくは一国のレベル @ja-jp
definition: Macro-économie @fr
definition: Economia su larga scala, a livello mondiale o nazionale
definition: Escala amplia de la economía, a nivel mundial o nacional. @es
definition: Wirtschaftsraum auf nationaler oder internationaler Ebene. @de
note: nessuno
in scheme: Subject Code
created: 2000-10-30T12:00:00+00:00
modified: 2010-12-15T17:01:09+00:00
broader: Economia, affari e finanza
narrower: Banche centrali
narrower: Consumatori
narrower: Mercato emissioni obbligazionarie e titoli
narrower: Indici economici
narrower: Mercati emergenti
narrower: Mercato Cambi
narrower: Aiuto pubblico
narrower: Debito pubblico
narrower: Tassi interesse
narrower: Istituzioni economiche internazionali
narrower: Commercio Estero
narrower: Mercato monetario
narrower: Organizzazioni economiche
narrower: Fiducia Consumatori
narrower: Dispute commerciali
narrower: Inflazione, Deflazione
narrower: Prezzi
narrower: Valute
narrower: Bilancio
narrower: Credito, Debito
narrower: Prestiti
narrower: Ipoteca
narrower: Mercati finanziari
narrower: Mercati Materie prime
narrower: Investimenti
narrower: Azioni
narrower: Obbligazioni
narrower: Fondi mutuabili
narrower: Titoli derivati
narrower: Importazioni
narrower: Esportazioni
narrower: Accordi commerciali
narrower: Politica commerciale
narrower: Imprese
narrower: Tariffe
narrower: Bilancia commerciale

Mercati, Borse
type: Concept
preferred label: mercado e câmbios @pt-pt
preferred label: market and exchange @en-gb
preferred label: mercados y bolsas @es
preferred label: Marchés @fr
preferred label: Markt und Börse @de
preferred label: 取引所 @ja-jp
definition: Entidades organizadas para a compra e venda de ações, divisas, matérias-primas e outros bens. @pt-br
definition: Organisierte Körperschaften, die Aktien, Währungen, Rohstoffe und andere Güter kaufen und verkaufen. @de
definition: Entidades organizadas para la compra y venta de stocks, monedas, propiedades y otros bienes. @es
definition: 株式、通貨、産物、日用品、その他の商品を売買するための組織 @ja-jp
definition: Enti organizzati per la compravendita di azioni, valute, materie prime ed altri beni
definition: Organized entities for buying and selling stocks, currencies, commodities and other goods @en-gb
definition: Entité organisée dans la vente et l'achat d'actions, de monnaies, de matières premières et autres biens @fr
note: nessuno
in scheme: Subject Code
created: 2000-10-30T12:00:00+00:00
modified: 2010-12-15T17:01:09+00:00
broader: Economia, affari e finanza
narrower: Energia
narrower: Metallo
narrower: Titoli, Valori mobiliari
narrower: Beni non durevoli

Media
type: Concept
preferred label: media @pt-pt
preferred label: mídia @pt-br
preferred label: メディア @ja-jp
preferred label: Médias @fr
preferred label: Medien @de
preferred label: medios de difusión @es
definition: Os vários meios que transmitem notícias e informações ao público. @pt-br
definition: Tous les moyens de large diffusion de l'information au public @fr
definition: The various means of disseminating news and information to the public @en-gb
definition: ニュースや案内を一般に広める様々な手段 @ja-jp
definition: Vari mezzi di comunicazione di massa per la diffusione di notizie e informazione al pubblico
definition: Los variados medios que diseminan las noticias e informaciones hacia el público. @es
definition: Verschiedene Mittel für die Verbreitung von Informationen und Nachrichten in der Öffentlichkeit. @de
note: nessuno
in scheme: Subject Code
created: 2000-10-30T12:00:00+00:00
modified: 2010-12-15T17:01:09+00:00
broader: Economia, affari e finanza
narrower: Pubblicità
narrower: Editoria
narrower: Industria cinematografica
narrower: Agenzie di stampa
narrower: Quotidiani e periodici
narrower: On line
narrower: Pubbliche Relazioni
narrower: Industria Radiofonica
narrower: Servizi via satellite e via cavo
narrower: Industria televisiva
narrower: Industria musicale

Metallurgia e Meccanica
type: Concept
preferred label: Metall und Technische Industrie @de
preferred label: manufacturing and engineering @en-gb
preferred label: indústria metalomecânica e engenharia @pt-br
preferred label: manufactura e ingeniería @es
preferred label: Industries métallurgiques et mécaniques @fr
preferred label: 製造業 @ja-jp
definition: Fabrication d'équipement électrique, électronique et mécanique autre que l'ingénierie civile @fr
definition: *Fabricantes de equipamento elétrico, eletrónico ou mecânico; não inclui engenharia civil.* @pt-pt
definition: Manufacturers of electrical, electronic and mechanical equipment but does not cover civil engineering. @en-gb
definition: Hersteller von elektrischer, elektronischer und mechanischer Ausrüstung, umfasst nicht das Ingenieurwesen. @de
definition: Manufactura de equipos electricos, electrónicos y mecánicos, pero no incluye la ingeniería civíl. @es
definition: *Fabricantes de equipamento elétrico, eletrônico ou mecânico; não inclui engenharia civil.* @pt-br
definition: 電気装置、電子装置、あるいは機械装置の製造業者、しかし土木工事まではカバーしない @ja-jp
definition: Industria produttrice di apparecchi elettrici, elettronici e meccanici, ma non riguardante l'ingegneria civile
note: nessuno
note: Name changed, Explanation added in V 15 @es
in scheme: Subject Code
created: 2000-10-30T12:00:00+00:00
modified: 2010-12-15T17:01:09+00:00
broader: Economia, affari e finanza
narrower: Aerospaziale
narrower: Automobilistica
narrower: Armamenti
narrower: Elettrodomestici
narrower: Ingegneria pesante
narrower: Componenti industriali
narrower: Strumentazioni
narrower: Cantieri navali
narrower: Macchinari

Metalli, Minerali
type: Concept
preferred label: Métaux et minéraux @fr
preferred label: minérios e metais @pt-br
preferred label: metal and mineral @en-gb
preferred label: metales y minerales @es
preferred label: 金属 @ja-jp
preferred label: Metall und Mineralien @de
definition: Producción y refinamiento de minerales en metales. @es
definition: 鉱石を金属へと精製し生産すること @ja-jp
definition: Produzione e raffinazione dei minerali in metalli
definition: La production et la transformation des minerais en métaux @fr
definition: Produção e refinação de minerais em metais. @pt-pt
definition: Herstellung und Verfeinerung von Mineralien zu Metall. @de
definition: Production and refining of ores into metals @en-gb
note: nessuno
in scheme: Subject Code
created: 2000-10-30T12:00:00+00:00
modified: 2010-12-15T17:01:09+00:00
broader: Economia, affari e finanza
narrower: Materiali edili
narrower: Oro, Materiali preziosi
narrower: Siderurgia
narrower: Metalli non ferrosi
narrower: Miniere

Industria Trasformazione
type: Concept
preferred label: Verarbeitende Industrie @de
preferred label: process industry @en-gb
preferred label: Industries de transformation @fr
preferred label: 加工業 @ja-jp
preferred label: industrias de elaboración @es
preferred label: indústria transformadora @pt-pt
definition: Das Geschäft aus Rohstoffen nützliche Produkte herzustellen. @de
definition: Negócio da transformação de matéria-prima em produtos utilizáveis. @pt-br
definition: Trasformazione delle materie prime in prodotti che possono essere usati
definition: The business of turning raw materials into useable products @en-gb
definition: El negocio de transformar materiales brutos en productos usables. @es
definition: 原鉱石を有用な生産物に変える商売 @ja-jp
definition: L'industrie de transformation des matières brutes @fr
note: nessuno
in scheme: Subject Code
created: 2000-10-30T12:00:00+00:00
modified: 2010-12-15T17:01:09+00:00
broader: Economia, affari e finanza
narrower: Distillerie, Birrerie
narrower: Alimentare
narrower: Arredamento, Mobili
narrower: Carta, Imballaggi
narrower: Gomma
narrower: Analcolici
narrower: Tessile, Abbigliamento
narrower: Tabacchi

Turismo, Tempo libero
type: Concept
preferred label: turismo @pt-pt
preferred label: turismo y tiempo libre @es
preferred label: tourism and leisure @en-gb
preferred label: Tourismus und Freizeit @de
preferred label: 観光 @ja-jp
preferred label: Tourisme et loisirs @fr
definition: Tourism and leisure industries @en-gb
definition: Historias acerca del turismo e industrias de tiempo libre @es
definition: Histórias relativas à indústria do turismo e do lazer. @pt-pt
definition: Sport- und Freizeitindustrie. @de
definition: Les histoires liées au tourisme et à l'industie des loisirs @fr
definition: Industria del turismo e del tempo libero
definition: 観光事業とレジャー産業についての記事 @ja-jp
note: nessuno
in scheme: Subject Code
created: 2000-10-30T12:00:00+00:00
modified: 2010-12-15T17:01:09+00:00
broader: Economia, affari e finanza
narrower: Casinò, Giochi
narrower: Alberghiero
narrower: Articoli sportivi, Tempo libero
narrower: Ristorazione, Catering
narrower: Tour Operator

Trasporti
type: Concept
preferred label: transport @en-gb
preferred label: Industrie de transport @fr
preferred label: transportes @pt-br
preferred label: Transport @de
preferred label: transporte @es
preferred label: 運輸 @ja-jp
definition: Ensemble des moyens permettant de déplacer des personnes ou des marchandises d'un point à un autre @fr
definition: Meios que permitem chegar de um lugar a outro sem caminhar. @pt-pt
definition: Industria dei trasporti e dello spostamento delle persone e/o delle merci
definition: 歩行無しで、ある場所から他の場所へ到着する手段 @ja-jp
definition: Möglichkeiten von einem Ort zum anderen zu gelangen, ohne zu laufen. @de
definition: Medio que permite llegar de un lugar a otrosin caminar. @es
definition: The means of getting from one place to the other without walking @en-gb
note: nessuno
in scheme: Subject Code
created: 2000-10-30T12:00:00+00:00
modified: 2010-12-15T17:01:09+00:00
broader: Economia, affari e finanza
narrower: Aerei
narrower: Ferrovie
narrower: Stradali
narrower: Marittimi, Acque interne

Informazione d'impresa
type: Concept
preferred label: company information @en-gb
preferred label: Informação sobre empresas @pt-pt
preferred label: Vie des sociétés @fr
preferred label: Firmeninformation @de
preferred label: información para empresas @es
preferred label: 企業情報 @ja-jp
definition: Informationen über einzelne Firmen und Konzerne. @de
definition: Informazione riguardante le singole società e imprese d'affari
definition: L'information sur les sociétés @fr
definition: Information about individual companies or business entities @en-gb
definition: Informação sobre empresas individuais ou companhias de negócios. @pt-pt
definition: 個々の会社か事業体に関する情報 @ja-jp
definition: informacióna acerca de individuos, compañias o entidades de negocios. @es
note: nessuno
in scheme: Subject Code
created: 2000-10-30T12:00:00+00:00
modified: 2010-12-15T17:01:09+00:00
broader: Economia, affari e finanza
narrower: Rendicontazione, Verifica
narrower: Assemblee generali
narrower: Relazioni annuali
narrower: Antitrust
narrower: Fusioni, Acquisizioni, Cambi gestione
narrower: Commenti analisti
narrower: Fallimenti
narrower: Consigli Amministrazione
narrower: Riacquisto Azioni
narrower: Interviste Dirigenti
narrower: Funzionari aziendali
narrower: Profili aziendali
narrower: Contratti
narrower: Contratti militari
narrower: Comunicazioni dividendi
narrower: Previsioni profitti
narrower: Aziende depresse
narrower: Profitti
narrower: Finanziamenti, Offerte azionarie
narrower: Contratti pubblici
narrower: Espansione globale
narrower: Insider Trading
narrower: Joint Venture
narrower: Leveraged buy out
narrower: Licenziamenti, Ridimensionamenti
narrower: Accordi di licenza
narrower: Contenziosi, Regolamenti
narrower: Cambi Management
narrower: marketing
narrower: Nuovi prodotti
narrower: Brevetti, Copyright
narrower: Chiusure Stabilimenti
narrower: Aperture Stabilimenti
narrower: Privatizzazioni
narrower: Deleghe
narrower: Rating
narrower: Ricerche, Sviluppo
narrower: Comunicazioni finanziarie trimestrali, semestrali
narrower: Ricapitalizzazioni
narrower: Spin-Off
narrower: Attività Titoli
narrower: Produzione industriale
narrower: Produttività
narrower: Inventari
narrower: Vendite
narrower: Società
narrower: Azionisti
narrower: Risultati aziendali
narrower: Perdite
narrower: Affidabilità creditizia
narrower: Frazionamenti azionari
narrower: Stock Options
narrower: Richiamo Prodotti
narrower: Globalizzazione
narrower: Consumatori
narrower: Acquisti
narrower: Nuovi Servizi

Economia (generico)
type: Concept
preferred label: Wirtschaft @de
preferred label: economy (general) @en-gb
preferred label: economia (geral) @pt-pt
preferred label: économie @fr
preferred label: 経済（一般） @ja-jp
preferred label: economía (general) @es
definition: 通商と経済についての一般的な性質に関する内容 @ja-jp
definition: Economia e Commercio in senso generale
definition: Conteúdo geral sobre comércio e economia. @pt-br
definition: L'économie et le commerce en général @fr
definition: Inhalte grundsätzlicher Art über Handel und Ökonomie. @de
definition: Contenido sobre el comercio y la economía en general @es
definition: Content of a general nature about trade and the economy @en-gb
note: nessuno
in scheme: Subject Code
created: 2000-10-30T12:00:00+00:00
modified: 2010-12-15T17:01:09+00:00
broader: Economia, affari e finanza
narrower: Politica economica

Affari (generico)
type: Concept
preferred label: business (general) @en-gb
preferred label: negócios (geral) @pt-br
preferred label: ビジネス（一般） @ja-jp
preferred label: negocios (general) @es
preferred label: Geschäft/Markttätigkeit @de
preferred label: Affaires @fr
definition: Temi generali riguardanti gli affari
definition: Les affaires en général @fr
definition: Content of a general nature about business @en-gb
definition: Inhalte über Geschäfte und den Markt grundsätzlicher Art. @de
definition: Conteúdo geral sobre negócios. @pt-pt
definition: ビジネスについての一般的な性質に関する内容 @ja-jp
definition: Contenido general sobre negocios @es
note: nessuno
in scheme: Subject Code
created: 2000-10-30T12:00:00+00:00
modified: 2010-12-15T17:01:09+00:00
broader: Economia, affari e finanza
narrower: Istituzioni
broad match: http://cv.iptc.org/newscodes/mediatopic/04000000

Finanza (generico)
type: Concept
preferred label: dinheiro e política monetária @pt-br
preferred label: Finanzen @de
preferred label: finanzas (general) @es
preferred label: Finances @fr
preferred label: 金融（一般） @ja-jp
preferred label: finance (general) @en-gb
definition: Content of a general nature about finance @en-gb
definition: Conteúdo geral sobre finanças. @pt-pt
definition: 金融についての一般的な性質に関する内容 @ja-jp
definition: Temi generali riguardanti la finanza
definition: Les finances en général @fr
definition: Inhalte über Finanzen grundsätzlicher Art. @de
definition: Contenido general sobre finanzas @es
note: nessuno
in scheme: Subject Code
created: 2000-10-30T12:00:00+00:00
modified: 2010-12-15T17:01:09+00:00
broader: Economia, affari e finanza
narrower: Politica monetaria
broad match: http://cv.iptc.org/newscodes/mediatopic/04000000

Coltivazioni
type: Concept
preferred label: agricultura @pt-br
preferred label: Cultures @fr
preferred label: Ackerbau @de
preferred label: arable farming @en-gb
preferred label: cultivos agrícolas @es
preferred label: 農業 @ja-jp
definition: Produção de alimentos no solo. @pt-pt
definition: 土地を使った食糧生産 @ja-jp
definition: Production of food in the ground @en-gb
definition: Gewinnung von Nahrungsmittel aus dem Boden. @de
definition: Producción de alimentos en la tierra. @es
definition: Travail de la terre, exploitation du milieu naturel @fr
definition: Lavorazione della terra affinché essa diventi produttiva e dia frutti per il consumo
note: nessuno
in scheme: Subject Code
created: 2000-10-30T12:00:00+00:00
modified: 2010-12-15T17:01:09+00:00
broader: Agricoltura

Industria ittica
type: Concept
preferred label: Fischindustrie @de
preferred label: pescas @pt-pt
preferred label: fishing industry @en-gb
preferred label: Pêche @fr
preferred label: 水産 @ja-jp
preferred label: industria pesquera @es
definition: Raising or gathering of fish @en-gb
definition: 魚介類の養殖または捕獲 @ja-jp
definition: Cultivar o reunir el producto de la pesca. @es
definition: Criação ou recolha de peixe. @pt-br
definition: Industrie de l'élevage et de la transformation des produits de la pêche @fr
definition: Züchten und Fangen von Fisch. @de
definition: Pesca o allevamento di pesce
note: nessuno
in scheme: Subject Code
created: 2000-10-30T12:00:00+00:00
modified: 2010-12-15T17:01:09+00:00
broader: Agricoltura

Silvicoltura
type: Concept
preferred label: 林業 @ja-jp
preferred label: Exploitation forestière @fr
preferred label: forestry and timber @en-gb
preferred label: silvicultura y madera @es
preferred label: floresta e madeira @pt-br
preferred label: Forstwirtschaft @de
definition: Production and collection and preparation of wood products for future use @en-gb
definition: Produção, recolha e preparação de produtos de madeira para uso futuro. @pt-pt
definition: Produzione, raccolta e trattamento del legname per vario uso
definition: 将来、使用のための材木製品の生産、採取、準備 @ja-jp
definition: L'ensemble des activités concernant les fôrets @fr
definition: Producción, colección y preparación de productos de madera para el futuro. @es
definition: Herstellung, Sammlung und Verarbeitung von Baumbeständen für die zukünftige Nutzung. @de
note: nessuno
in scheme: Subject Code
created: 2000-10-30T12:00:00+00:00
modified: 2010-12-15T17:01:09+00:00
broader: Agricoltura

Allevamento
type: Concept
preferred label: pecuária @pt-br
preferred label: élevage @fr
preferred label: Tierhaltung @de
preferred label: ganadería @es
preferred label: livestock farming @en-gb
preferred label: 畜産 @ja-jp
definition: Criação de animais para consumo alimentar. @pt-pt
definition: 食糧用の動物の飼育 @ja-jp
definition: Cultivación de animales para el consumo. @es
definition: Raising of animals for food @en-gb
definition: Elevage fermier destiné à la consommation @fr
definition: Züchtung von Tieren als Nahrungsmittel. @de
definition: Riproduzione e allevamento degli animali destinati al consumo
note: nessuno
in scheme: Subject Code
created: 2000-10-30T12:00:00+00:00
modified: 2010-12-15T17:01:09+00:00
broader: Agricoltura

Viticoltura
type: Concept
preferred label: viniculture @en-gb
preferred label: ブドウ栽培 @ja-jp
preferred label: vinicultura @pt-br
preferred label: Viticulture @fr
preferred label: Weinbau @de
definition: Coltivazione della vite e produzione del vino
definition: Production of wines from the vines to the finish products @en-gb
definition: Herstellung von Weinen von der Weinrebe bis zum Endprodukt. @de
definition: Indústria do vinho e da vinha. @pt-pt
definition: Industrie du vin et de la vigne @fr
definition: ワイン醸造用葡萄の栽培 @ja-jp
definition: Producción de viñedos para la elaboración de productos finales. @es
note: nessuno
in scheme: Subject Code
created: 2000-10-30T12:00:00+00:00
modified: 2010-12-15T17:01:09+00:00
broader: Agricoltura

Acquicoltura
type: Concept
preferred label: aquacultura @pt-br
preferred label: acuacultura @es
preferred label: Aquaculture @fr
preferred label: Aquakultur @de
preferred label: 養殖 @ja-jp
preferred label: aquaculture @en-gb
definition: Culture d'organismes vivants dans l'eau pour la consommation humaine @fr
definition: 人間の消費のために水中で植物や動物を育てること @ja-jp
definition: Growing plants or animals in water for human consumption @en-gb
definition: Produção de plantas ou animais em água para consumo humano. @pt-pt
definition: Allevamento e/o produzione di animali e/o piante per il consumo umano sfruttando acque dolci o marine
definition: Cultivar platas o crian animales en agua para el consumo humano @es
definition: Zucht von Wasserpflanzen und -tieren zum Gebrauch unter kontrollierten Bedingungen @de
note: nessuno
in scheme: Subject Code
created: 2004-10-13T12:00:00+00:00
modified: 2012-07-10T12:00:00+00:00
broader: Agricoltura

Biotecnologia
type: Concept
preferred label: Biotechnologie @de
preferred label: biotecnologia @pt-pt
preferred label: biotecnología @es
preferred label: biotechnology @en-gb
preferred label: バイオテクノロジー @ja-jp
definition: Tätigkeiten, die Technologien verwenden, um Probleme und Lösungen von lebenden Organismen zu erforschen. @de
definition: La ciencia que utiliza tecnología ingenieril para estudiar y resolver los problemas de los organizmos vivientes. @es
definition: 生有機体の問題を研究したり、解決した工学技術を用いるビジネス @ja-jp
definition: Uso de engenharia tecnológica para estudar e resolver problemas dos organismos vivos. @pt-br
definition: Ensemble des procédés et techniques utilisant des processus biologiques à des fins industrielles @fr
definition: Insieme dei procedimenti e delle tecniche utilizzati nei processi biologici
definition: The business of using engineering technology to study and solved problems of living organisms @en-gb
note: nessuno
in scheme: Subject Code
created: 2000-10-30T12:00:00+00:00
modified: 2010-12-15T17:01:09+00:00
broader: Produzione Chimica

Fertilizzanti
type: Concept
preferred label: Düngemittel @de
preferred label: fertilizantes @pt-pt
preferred label: Engrais @fr
preferred label: fertiliser @en-gb
preferred label: 肥料 @ja-jp
definition: Prodotti naturali o di sintesi utilizzati per favorire la crescita delle piante
definition: 植物の生長を促進する為に使用する天然または人工の材料 @ja-jp
definition: Material natural o hecho por el hombre para fomentar el crecimiento de las plantas. @es
definition: Natürliche oder künstliche Stoffe, um das Wachstum von Pflanzen zu fördern. @de
definition: Materiais naturais ou feitos pelo homem para estimular o crescimento de plantas. @pt-pt
definition: Produits naturels ou non utilisés pour faciliter la pousse des végétaux @fr
definition: Natural or manmade materials used to encourage the growth of plants @en-gb
note: nessuno
in scheme: Subject Code
created: 2000-10-30T12:00:00+00:00
modified: 2010-12-15T17:01:09+00:00
broader: Produzione Chimica

Cosmetici, Prodotti per l'igiene
type: Concept
preferred label: produtos de saúde e beleza @pt-pt
preferred label: 健康・美容 @ja-jp
preferred label: productos de salud y belleza @es
preferred label: Hygiène et Cosmétiques @fr
preferred label: health and beauty product @en-gb
preferred label: Kosmetik @de
definition: Prodotti e/o sostanze per la bellezza del corpo o per il benessere
definition: recopilación de quimicos y otras sustancias para exaltar la aparaciencia fisica u olores. @es
definition: Produits pour l'embellissement et le soin du visage et de la peau @fr
definition: Zusammenstellung von chemischen und anderen Stoffen um Aussehen und Geruch zu verbessern. @de
definition: Produtos químicos e outras substâncias usados para embelezamento físico. @pt-br
definition: Compilation of chemicals and other substances for use in enhancing ones looks or smell @en-gb
definition: 外見や香りの質を高めるために、使用される化学物質やその他の物質の編成物 @ja-jp
note: nessuno
in scheme: Subject Code
created: 2000-10-30T12:00:00+00:00
modified: 2010-12-15T17:01:09+00:00
broader: Produzione Chimica

Chimica inorganica
type: Concept
preferred label: químicos inorgânicos @pt-br
preferred label: productos químicos inorgánicos @es
preferred label: Anorganische Chemie @de
preferred label: Chimie inorganique @fr
preferred label: 無機化学 @ja-jp
preferred label: inorganic chemical @en-gb
definition: Branche de la chimie relative aux minéraux et aux métaux @fr
definition: The branch of chemistry dealing with minerals and metals @en-gb
definition: Parte de la química que se encarga de los minerales y metales. @es
definition: 無機物と金属を扱う化学の一分野 @ja-jp
definition: Zweig der Chemie, der von Mineralien und Metallen handelt. @de
definition: Ramo da química que estuda minerais e metais. @pt-pt
definition: Branca della chimica che tratta la materia inorganica, minerali e metalli
note: nessuno
in scheme: Subject Code
created: 2000-10-30T12:00:00+00:00
modified: 2010-12-15T17:01:09+00:00
broader: Produzione Chimica

Chimica organica
type: Concept
preferred label: químicos orgânicos @pt-br
preferred label: Organische Chemie @de
preferred label: organic chemical @en-gb
preferred label: Chimie organique @fr
preferred label: productos químicos orgánicos @es
preferred label: 有機化学 @ja-jp
definition: Parte de la química que se encarga de los humanos, animales o sustancias a base de carbon. @es
definition: Branche de la chimie relative aux organismes vivants et aux substances carboniques @fr
definition: The branch of chemistry dealing with human, animal or carbon-based substances @en-gb
definition: Zweig der Chemie, der von menschlichen, tierischen oder kohlenstoffbasierten Stoffen handelt. @de
definition: Ramo da química que estuda substâncias humanas, animais ou à base de carbono. @pt-br
definition: 人間、動物、または有機物質を扱う化学の一分野 @ja-jp
definition: Branca della chimica che si occupa degli organismi viventi e della materia a base di carbonio
note: nessuno
in scheme: Subject Code
created: 2000-10-30T12:00:00+00:00
modified: 2010-12-15T17:01:09+00:00
broader: Produzione Chimica

Industria Farmaceutica
type: Concept
preferred label: indústria farmacêutica @pt-br
preferred label: pharmaceutical @en-gb
preferred label: productos farmacéuticos @es
preferred label: Pharmacie @fr
preferred label: Pharmaindustrie @de
preferred label: 製薬・薬品 @ja-jp
definition: Produzione di medicine a base di prodotti chimici e/o naturali
definition: The production of medicines from various chemicals and natural substances @en-gb
definition: さまざまな化学物質と天然の物質からの医薬品製造 @ja-jp
definition: Produção de medicamentos a partir de substâncias químicas ou naturais. @pt-pt
definition: la creación de medicinas a base de varios químicos y sustancias naturales. @es
definition: Die Herstellung von Medizin aus verschiedenen Chemikalien und natürlichen Stoffen. @de
definition: Production de médicaments à partir de substances naturelles ou chimiques @fr
note: nessuno
in scheme: Subject Code
created: 2000-10-30T12:00:00+00:00
modified: 2010-12-15T17:01:09+00:00
broader: Produzione Chimica

Sintetici e plastica
type: Concept
preferred label: productos sintéticos y plásticos @es
preferred label: プラスチック @ja-jp
preferred label: produtos sintéticos e plásticos @pt-br
preferred label: Kunststoff @de
preferred label: synthetic and plastic @en-gb
preferred label: Plastiques et synthétiques @fr
definition: Chemicals used to produce plastics and other artificial substances to be used in manufacturing @en-gb
definition: Industrie des plastiques et produits synthétiques @fr
definition: Quimicos usados para producir plásticos y otras sustancias artificiales para ser utilizador en manufactura. @es
definition: Químicos usados para produzir plásticos e outras substâncias artificiais. @pt-pt
definition: 製造で使用されるプラスチックとその他の人造物質を生成する化学 @ja-jp
definition: Produzione ed industria della plastica e dei prodotti sintetici
definition: Chemikalien, die genutzt werden um Plastik und andere künstliche Stoffe für die Industrie zu produzieren. @de
note: nessuno
in scheme: Subject Code
created: 2000-10-30T12:00:00+00:00
modified: 2010-12-15T17:01:09+00:00
broader: Produzione Chimica

hardware
type: Concept
preferred label: ハードウエア @ja-jp
preferred label: Matériel informatique @fr
preferred label: Hardware
definition: los aparatos físicos utilizados para proveer servicios computacionales tales como monitor, disco duro, teclado, etc. @es
definition: Physikalisches Gerät zur Unterstützung der Dienstleistung eines Computers, wie Monitor, Festplatten, Tastatur etc. kann auch benutzt werden für Ausrüstung wie Router, Server und andere Netzwerkgeräte @de
definition: Dispositivi e/o apparati informatici o che comunque vengono usati nell'informatica
definition: Componentes físicos usados para fornecer serviços computacionais, tais como monitor, disco rígido, teclado, etc. e que também incluem routers, servidores e outros dispositivos de rede. @pt-pt
definition: The physical devices used to provide computer services, such as monitors, hard drives, keyboards etc. but can also be used for equipment such as routers, servers and other network devices. @en-gb
definition: コンピュータサービスを提供する物理的な装置。例えばモニター、ハードディスク、キーボードなどのこと。また、例えばルータ、サーバーや他のネットワーク機器のような装置のことでもある @ja-jp
definition: Equipement informatique ou utilisé en informatique @fr
definition: Componentes físicos usados para fornecer serviços computacionais, tais como tela, disco rígido, teclado, etc. e que também incluem roteadores, servidores e outros dispositivos de rede. @pt-br
note: nessuno
in scheme: Subject Code
created: 2000-10-30T12:00:00+00:00
modified: 2010-12-15T17:01:09+00:00
broader: Informatica e Telecomunicazioni
broad match: http://cv.iptc.org/newscodes/mediatopic/20000222

Reti e Connessioni
type: Concept
preferred label: Réseaux et télécommunications @fr
preferred label: networking @en-gb
preferred label: ligação em rede @pt-pt
preferred label: Netzwerk @de
preferred label: ネットワーク @ja-jp
preferred label: conexão em rede @pt-br
preferred label: interconexión @es
definition: Interconexão entre os componentes de hardware que estabelece um meio de transmissão de dados. @pt-pt
definition: La interconección entre hardwares que provee elmedio por el cual se transmiten datos. @es
definition: データの転送のための手段を提供するハードウェア間の相互接続 @ja-jp
definition: Interconnexion entre les équipements pour la transmission de données @fr
definition: Verbindung zwischen Computern, die den Austausch von Daten ermöglichen. @de
definition: Collegamenti che permettono la trasmissione dei dati e/o informazioni fra diversi apparati
definition: The interconnectivity between hardware that provides the medium for the transmission of data. @en-gb
note: nessuno
in scheme: Subject Code
created: 2000-10-30T12:00:00+00:00
modified: 2010-12-15T17:01:09+00:00
broader: Informatica e Telecomunicazioni

Tecnologia satellitare
type: Concept
preferred label: satellite technology @en-gb
preferred label: satélite @pt-br
preferred label: Satellitentechnologie @de
preferred label: 衛星通信 @ja-jp
preferred label: Satellites @fr
preferred label: tecnología satelital @es
definition: 周回軌道衛星経由で、地上装置が互いに信号を送ることができるようなハードウェアやソフトウェア @ja-jp
definition: Technologie satellitaire @fr
definition: Hardware und Software, die Geräte unterstützt um Signale hin und her zusenden via Satellit im Weltraum. @de
definition: Hardware e software che consentono a servizi a terra di inviare dati attraverso un satellite in orbita
definition: Hardware e software que permite que aparelhos em terra enviem sinais entre si, através de satélites em órbita. @pt-br
definition: Hardware and software that enables groundbased devices to send signals to each other via an orbiting satellite. @en-gb
definition: Hardware y software que permite a aparatos en la tierra enviar señales entre si, a través de una satélite en orbita. @es
note: nessuno
in scheme: Subject Code
created: 2000-10-30T12:00:00+00:00
modified: 2010-12-15T17:01:09+00:00
broader: Informatica e Telecomunicazioni

Semiconduttori, Componenti elettronici
type: Concept
preferred label: semicondutores @pt-br
preferred label: 半導体 @ja-jp
preferred label: semiconductors and active components @en-gb
preferred label: semiconductores @es
preferred label: Elektronik @de
preferred label: Semiconducteurs @fr
definition: Grundlegende Komponenten die das Funktionieren elektronischer Geräte ermöglichen, wie beispielsweise Computer. @de
definition: composants électroniques pour la fabrication d'ordinateurs notamment @fr
definition: Los componentes básicos que juntos permiten la operación de a aparatos electrónicos tales como computadores. @es
definition: コンピュータのような電子装置を構成する基礎的な部品 @ja-jp
definition: Os componentes básicos que, juntos, permitem o funcionamento de dispositivos eletrónicos como computadores. @pt-pt
definition: Componenti base per la fabbricazione ed il funzionamento dei vari meccanismi e strumenti elettronici
definition: Os componentes básicos que, juntos, permitem o funcionamento de dispositivos eletrônicos como computadores. @pt-br
definition: The basic components that together create working electronic devices such as computers @en-gb
note: nessuno
in scheme: Subject Code
created: 2000-10-30T12:00:00+00:00
modified: 2010-12-15T17:01:09+00:00
broader: Informatica e Telecomunicazioni

software
type: Concept
preferred label: Software
preferred label: Logiciels @fr
preferred label: ソフトウエア @ja-jp
definition: Conjunto de programas que, quando instalados em computadores, realizam funções específicas. @pt-br
definition: Programmi che una volta installati su un hardware, lo fanno funzionare per specifiche funzioni
definition: Programming sets that, when installed on hardware, perform specified functions. @en-gb
definition: ハードウエアにインストールされた時に、特定の機能を遂行する一連のプログラム @ja-jp
definition: Programación que permite -cuando instalado en un compotador- la ejecución de distintas funciones. @es
definition: Ensemble de programmes qui une fois installés, réalisent différentes fonctions @fr
definition: Programme, die bei Installation auf der Hardware bestimmte Funktionen ausführen. @de
note: nessuno
in scheme: Subject Code
created: 2000-10-30T12:00:00+00:00
modified: 2010-12-15T17:01:09+00:00
broader: Informatica e Telecomunicazioni

Sistemi Telecomunicazione
type: Concept
preferred label: Telekommunikationsinstallation @de
preferred label: équipement de télécommunication @fr
preferred label: telecomunicações (equipamentos) @pt-br
preferred label: equipos de telecomunicaciones @es
preferred label: 通信機器 @ja-jp
preferred label: telecommunication equipment @en-gb
definition: Dispositivi e apparati per le trasmissioni di voce/dati da un punto ad un altro
definition: Equipement de télécommunications comme les téléphones et les modems @fr
definition: Aparatos tales com teléfonos, voz/datos intercambiadores, modems, etc,que facilitan la transmision voz-datos de un punto a otro. @es
definition: Aparelhos como telefones, comutadores de integração voz/dados, modems, etc., que facilitam a transmissão voz-dados de um ponto para outro. @pt-br
definition: Devices such as telephone sets, voice/data switches, modems etc that facilitate point-to-point voice/data transmissions @en-gb
definition: Geräte wie Telefonanlagen, Modems, Fax etc. die den Austausch von Sprache/Daten erleichtern. @de
definition: Aparelhos como telefones, comutadores de integração voz/dados, modems, etc., que facilitam a transmissão voz/dados de um ponto para outro. @pt-pt
definition: 電話機、音声やデータの交換機、モデムなど、音声やデータ伝送を容易にするような機器 @ja-jp
note: nessuno
in scheme: Subject Code
created: 2000-10-30T12:00:00+00:00
modified: 2010-12-15T17:01:09+00:00
broader: Informatica e Telecomunicazioni

Servizi Telecomunicazione
type: Concept
preferred label: 通信事業 @ja-jp
preferred label: servicio de telecomunicaciones @es
preferred label: Telekommunikationsdienst @de
preferred label: telecomunicações @pt-br
preferred label: telecommunication service @en-gb
preferred label: Services télécoms @fr
definition: Dienstleistung, die von kommerziellen Firmen angeboten wird, die die Verbindung zwischen Telefonen, Fax und Computern erleichtern. @de
definition: Servizi forniti da compagnie per le connessioni tra dispositivi di telecomunicazione
definition: Services provided by commercial companies that facilitate connections between telephones, pagers, computers @en-gb
definition: Serviços fornecidos por empresas que facilitam ligações entre telefones, pagers ou computadores. @pt-pt
definition: Servicios provistos por compañias comerciales para facilitar las conecciones entre teléfonos, buscapersonas y compoutadores. @es
definition: Services de télécommunications fournis par des compagnies commerciales @fr
definition: 電話、ポケベル、コンピュータ間の接続を容易にする商事会社によって提供されるサービス @ja-jp
note: nessuno
note: typo fixed in Explanation @en-gb
in scheme: Subject Code
created: 2000-10-30T12:00:00+00:00
modified: 2010-12-15T17:01:09+00:00
broader: Informatica e Telecomunicazioni

Sicurezza
type: Concept
preferred label: segurança @pt-pt
preferred label: Sicherheitstechnologie @de
preferred label: セキュリティー @ja-jp
preferred label: seguridad @es
preferred label: Sécurité @fr
preferred label: security @en-gb
definition: ハードウェアとソフトウェアにおける技術開発や基礎研究、およびサイバー･セキュリティのようなものに関する分野を含むもの @ja-jp
definition: Tout ce qui a trait à la sécurité informatique et cybernétique @fr
definition: Tudo o que diz respeito a desenvolvimentos técnicos em hardware e software, investigação básica e áreas relacionadas, como cibersegurança. @pt-pt
definition: Quanto concerne con le reti e gli apparati di sicurezza informatica e cibernetica
definition: Abarca desarrollos técnicos en hardware y software, investigación básica y áreas relacionadas como seguridad electrónica. @es
definition: Umfasst technische Entwicklungen in Hardware und Software, Forschung und verwandte Gebiete wie Cyber-Sicherheit. @de
definition: To encompass technical developments in hardware and software, basic research and related areas such as cyber security @en-gb
note: nessuno
in scheme: Subject Code
created: 2000-10-30T12:00:00+00:00
modified: 2010-12-15T17:01:09+00:00
broader: Informatica e Telecomunicazioni

Tecnologia wireless
type: Concept
preferred label: 無線通信 @ja-jp
preferred label: wireless technology @en-gb
preferred label: tecnologia inalambrica @es
preferred label: tecnologia sem fios @pt-pt
preferred label: Drahtlose Technologie @de
preferred label: Technologie sans-fil @fr
preferred label: tecnologia sem fio @pt-br
definition: Transmissão de informação sem utilizar fios ou cabos conectados. @pt-br
definition: Austausch von Informationen mit Mitteln außerhalb der direkten verdrahteten Schaltung. @de
definition: Transmission d'information sans utiliser de fil ou de cable @fr
definition: Transmission of information through means other than point-to-point wired hookups @en-gb
definition: 地点間をケーブルで接続する以外の手段で情報を送信すること @ja-jp
definition: Tecnologie e trasmissione dati da un punto ad un altro con mezzi diversi dalle connessioni via cavo
definition: Transmisión de información a través de otros medios que no sean mediante cables conectados. @es
note: nessuno
in scheme: Subject Code
created: 2004-10-13T12:00:00+00:00
modified: 2012-07-10T12:00:00+00:00
broader: Informatica e Telecomunicazioni

Grandi Opere
type: Concept
preferred label: Travaux Publics @fr
preferred label: Tiefbau @de
preferred label: construcción pesada @es
preferred label: heavy construction @en-gb
preferred label: 大規模建設 @ja-jp
preferred label: obras públicas @pt-pt
definition: Projetos de construção de grande escala: estradas, barragens, edifícios de escritórios, fábricas, estádios, etc. @pt-pt
definition: Bau von Straßen, Dämmen, Büro- und anderen Großbauten. @de
definition: Progetti e costruzioni su larga scala di impianti e/o strutture; Lavori Pubblici
definition: Industrie du bâtiment et des travaux publics @fr
definition: Large scale construction projects, construction of roads, dams, office/factory buildings, offshore and onshore structures, large sport stadiums @en-gb
definition: Proyectos de construcción a gran escala: caminos, represas, edificios de oficinas o fábricas dentro o fuera de la costa. @es
definition: Projetos de construção de grande escala: estradas, represas, edifícios de escritórios, fábricas, estádios, etc. @pt-br
definition: 道路やダム、事務所/工場の建物、沖合いや沿岸の建造物、巨大なスポーツスタジアムのような、大規模な建設プロジェクト @ja-jp
note: nessuno
note: Explanation changed in V 15 @fr
in scheme: Subject Code
created: 2000-10-30T12:00:00+00:00
modified: 2010-12-15T17:01:09+00:00
broader: Costruzioni, Proprietà

Edilizia Residenziale
type: Concept
preferred label: construção civil @pt-pt
preferred label: Bâtiment @fr
preferred label: construcción de viviendas @es
preferred label: house building @en-gb
preferred label: Wohnungsbau @de
preferred label: 住宅建設 @ja-jp
definition: Construcción de viviendas para el uso privado. @es
definition: 個人用住宅の建設 @ja-jp
definition: Construction of residences, for private use @en-gb
definition: Construção de residências, para uso privado. @pt-pt
definition: Construction immobilière privée @fr
definition: Bau von Wohnraum. @de
definition: Costruzione di abitazioni per uso privato
note: nessuno
in scheme: Subject Code
created: 2000-10-30T12:00:00+00:00
modified: 2010-12-15T17:01:09+00:00
broader: Costruzioni, Proprietà

Immobiliaristica
type: Concept
preferred label: Immobilier @fr
preferred label: imobiliário @pt-pt
preferred label: bienes raíces @es
preferred label: real estate @en-gb
preferred label: Immobilien @de
preferred label: 不動産 @ja-jp
definition: Compra e venda de todo tipo de propriedades. @pt-br
definition: Concerne l'achat et vente de biens immobiliers @fr
definition: あらゆる種類の不動産の売買行為 @ja-jp
definition: The buying and selling of properties of all types @en-gb
definition: La compra y venta de propiedades de todos los tipos. @es
definition: Kaufen und Verkaufen von baulichem Eigentum aller Art. @de
definition: Operazioni di compravendita e/o affitto di beni immobiliari
definition: Compra e venda de todo o tipo de propriedades. @pt-pt
note: nessuno
in scheme: Subject Code
created: 2000-10-30T12:00:00+00:00
modified: 2010-12-15T17:01:09+00:00
broader: Costruzioni, Proprietà

Fattorie
type: Concept
preferred label: granjas @es
preferred label: Landwirtschaftsbau @de
preferred label: Exploitations agricoles @fr
preferred label: 農地 @ja-jp
preferred label: propriedade agrícola @pt-pt
preferred label: farms @en-gb
definition: Aree agricole per la produzione di generi alimentari, incluso prodotti di latteria, frutta, bestiame, e pesce
definition: Agricultural areas for the production of foodstuffs, including dairy products, fruits and livestock, such as cattle and fish @en-gb
definition: 魚や牛など家畜、酪農製品、果物を含む食糧生産のための農業地域 @ja-jp
definition: L'ensemble des exploitations agricoles @fr
definition: Áreas de agricultura para la producción frutícola, ganado y pescado. @es
definition: Áreas agrícolas para a produção alimentar, incluindo laticínios, frutos, gado e peixe. @pt-br
definition: Landwirtschaftliche Areale zur Nahrungsmittelproduktion wie Milch, Obst und Tierbestand wie Vieh und Fisch. @de
note: nessuno
in scheme: Subject Code
created: 2003-04-05T12:00:00+00:00
modified: 2012-07-10T12:00:00+00:00
broader: Costruzioni, Proprietà

Prezzo Terreni
type: Concept
preferred label: preço do terreno @pt-br
preferred label: Grundstückspreis @de
preferred label: 地価 @ja-jp
preferred label: Foncier @fr
preferred label: costo de tierras @es
preferred label: land price @en-gb
definition: In Japan, werden durch die Regierung alljährlich regelmäßig Listen mit aktuellen Grundstückspreisen veröffentlicht als ökonomisches Barometer und hoher Verarbeitung in der Presse. @de
definition: 信頼できる組織によって商業地域や住宅地域などに区画化された特定地域の土地の価格 @ja-jp
definition: El precio de tierras en áreas segmentadas tales como comerciales, residencia, cultibable, y que es determinado por una entidad responsable. @es
definition: Valutazione del prezzo dei terreni a seconda delle specifiche aree e destinazioni d'uso così come stabilito da un ente di competenza
definition: Preço da terra em áreas específicas como zonas comerciais, residenciais ou cultiváveis e que é determinado por uma entidade responsável. @pt-pt
definition: Prix de la propriété foncière @fr
definition: The price of land in specific zoned areas such as commercial, residential arable as provided by a responsible body @en-gb
note: In Japan, government publishes lists of standard land prices every year as an economic barometer and Newspapers take up with a lot of space. @es
note: nessuno
in scheme: Subject Code
created: 2004-04-22T12:00:00+00:00
modified: 2012-07-10T12:00:00+00:00
broader: Costruzioni, Proprietà

Ristrutturazioni
type: Concept
preferred label: renovación @es
preferred label: 再開発 @ja-jp
preferred label: renovation @en-gb
preferred label: Sanierung @de
preferred label: Rénovation @fr
preferred label: obras de renovação @pt-br
definition: Recuperação de propriedades ou estruturas, mediante limpeza, reparação ou reconstrução. @pt-pt
definition: Restauration des propriétés et des structures @fr
definition: Interventi di restauro di proprietà/strutture con modifiche esterne e/o interne tramite pulitura, riparazione o ricostruzione
definition: Restoring properties/structures to a former better state by cleaning, repairing or rebuilding. @en-gb
definition: Restauración de propiedades- estructuras otorgandoles un mejor estado mediante limpieza, reparación o reconstrucción. @es
definition: 掃除、修理、再建することにより以前よりよい状態に性質や構造を復元すること @ja-jp
definition: Wiederherstellung von Eigentum/Bauwerken in einen ehemaligen Zustand durch Reinigung, Reparatur oder Wiederaufbau. @de
note: nessuno
in scheme: Subject Code
created: 2004-10-13T12:00:00+00:00
modified: 2012-07-10T12:00:00+00:00
broader: Costruzioni, Proprietà

Progettazione, Ingegneria
type: Concept
preferred label: design and engineering @en-gb
preferred label: Design und Technik @de
preferred label: Design et ingénierie @fr
preferred label: design e engenharia @pt-pt
preferred label: deseño e ingeniería @es
preferred label: 土木 @ja-jp
definition: Concepção e planejamento, por engenheiros, arquitetos, de estradas, escritórios, fábricas, represas, etc. @pt-br
definition: Conceção e planeamento, por engenheiros e arquitetos, de estradas, escritórios, fábricas, barragens, etc. @pt-pt
definition: 道路、オフィス、工場、ダム、海洋構造物をエンジニア、建築家などによって設計および計画すること @ja-jp
definition: Progetti di strutture e/o infrastrutture
definition: Deseño y planeamiento hecho por Ingenieros, Arquitectos, etc., de caminos, oficinas, fábricas, represas u estructuras mas adentro. @es
definition: Design und Planung durch Ingenieure, Architekten etc. von Straßen, Büros, Fabriken, Dämmen, Bauwerken in Gewässern. @de
definition: Conception et ingénierie des ponts, chaussées, bâtiments @fr
definition: Design and planning by Engineers, Architects etc. of roads, offices, factories, dams , offshore structures, @en-gb
note: nessuno
in scheme: Subject Code
created: 2004-10-13T12:00:00+00:00
modified: 2012-07-10T12:00:00+00:00
broader: Costruzioni, Proprietà

Energie alternative
type: Concept
preferred label: alternative energy @en-gb
preferred label: energias alternativas @pt-br
preferred label: 代替エネルギー @ja-jp
preferred label: énergies alternatives @fr
preferred label: Alternativ-Energien @de
preferred label: energía alternativa @es
definition: Das Geschäft mit Alternativen-Energien. @de
definition: Les sources d'énergie de remplacement, énergies alternatives @fr
definition: Risorse energetiche alternative
definition: Histórias sobre o negócio das energias alternativas. @pt-br
definition: Alternative energy business @en-gb
definition: 代替エネルギービジネスに関する話 @ja-jp
definition: Historias de negocios en energía alternativa @es
note: nessuno
in scheme: Subject Code
created: 2000-10-30T12:00:00+00:00
modified: 2010-12-15T17:01:09+00:00
broader: Energia

Carbone
type: Concept
preferred label: coal @en-gb
preferred label: Charbon @fr
preferred label: Kohle @de
preferred label: carvão @pt-br
preferred label: 石炭 @ja-jp
preferred label: carbón @es
definition: L'exploitation de charbon et de schistes bitumineux pour la production d'énergie @fr
definition: Produção e extração de antracite e de produtos betuminosos para usar na produção de energia. @pt-br
definition: Producción y extracción de productos de carbón y betún utilizados para la protección de energía. @es
definition: Production and mining of anthracite and bituminous products for use in power production @en-gb
definition: 電力生産のために使用する無煙炭やれき青質製品の産出や採鉱 @ja-jp
definition: Herstellung und Förderung von Glanz- und Steinkohle zur Energieerzeugung. @de
definition: Processi di produzione ed estrazione di carbone e prodotti bituminosi usati nella produzione di energia
note: nessuno
in scheme: Subject Code
created: 2000-10-30T12:00:00+00:00
modified: 2010-12-15T17:01:09+00:00
broader: Energia

Petrolio e Gas, distribuzione
type: Concept
preferred label: Pétrole et gaz @fr
preferred label: petróleo e gás (distribuição) @pt-br
preferred label: 石油・ガス業 @ja-jp
preferred label: Öl und Gas (Verwertung) @de
preferred label: petróleo y gas secundarios @es
preferred label: oil and gas - downstream activities @en-gb
definition: All matters concerning oil and gas, typically refining and distribution activities @en-gb
definition: Assuntos relativos ao petróleo e ao gás, tipicamente atividades de refinaria e de distribuição. @pt-br
definition: Tutte le attività concernenti raffineria e distribuzione del petrolio e del gas
definition: 石油と天然ガスにおける一般的な精製と流通活動に関するすべての事柄 @ja-jp
definition: La production et le raffinage du pétrole et du gaz @fr
definition: Alle Sachverhalte, die sich auf Öl und Gas beziehen, kennzeichnend hier die Raffinierung und Verteilung. @de
definition: Asuntos concernientes a petróleo y gas, típicamente actividades de refinería y distribución @es
note: nessuno
in scheme: Subject Code
created: 2000-10-30T12:00:00+00:00
modified: 2010-12-15T17:01:09+00:00
broader: Energia

Petrolio e Gas, riserve
type: Concept
preferred label: Öl und Gas (Förderung) @de
preferred label: oil and gas - upstream activities @en-gb
preferred label: petróleo e gás (extração) @pt-pt
preferred label: petróleo y gas primarios @es
preferred label: Pétrole et gaz @fr
preferred label: 石油・ガス鉱業 @ja-jp
definition: La distribution du pétrole et du gaz @fr
definition: 石油と天然ガスにおける貯蔵所から精油所ゲートまでの一連の供給活動に関するすべての事柄 @ja-jp
definition: Assuntos relativos ao petróleo e ao gás, tipicamente atividades da cadeia de abastecimento desde a reserva até o portão da refinaria. @pt-br
definition: All matters concerning oil and gas, typically supply chain activities from the reservoir to the refinery gate @en-gb
definition: Alle Sachverhalte, die sich auf Öl und Gas beziehen, kennzeichnend hier die Gewinnung und der Transport zur Raffinerie. @de
definition: Asuntos concernientes a petróleo y gas, típicamente actividades de la cadena de abastecimiento desde la reserva hasta la puerta de refinería. @es
definition: Tutte le attività concernenti riserve ed estrazione del petrolio e del gas
definition: Assuntos relativos ao petróleo e ao gás, tipicamente atividades da cadeia de abastecimento desde a reserva até ao portão da refinaria. @pt-pt
note: nessuno
in scheme: Subject Code
created: 2000-10-30T12:00:00+00:00
modified: 2010-12-15T17:01:09+00:00
broader: Energia

Energia nucleare
type: Concept
preferred label: energia nuclear @pt-br
preferred label: energía nuclear @es
preferred label: 原子力 @ja-jp
preferred label: nuclear power @en-gb
preferred label: énergie nucléaire @fr
preferred label: Atomenergie @de
definition: Uso de materiais radioativos na produção de energia. @pt-br
definition: L'énergie produite par fission nucléaire @fr
definition: 電力生産のために放射性物質を使用すること @ja-jp
definition: Nutzung von radioaktivem Material zur Energiegewinnung. @de
definition: Use of radioactive materials for power production @en-gb
definition: Attività riguardanti la produzione di energia attraverso la fissione nucleare
definition: Uso de materiales radioactivos para la procucción de energía. @es
note: nessuno
in scheme: Subject Code
created: 2000-10-30T12:00:00+00:00
modified: 2010-12-15T17:01:09+00:00
broader: Energia

Elettricità
type: Concept
preferred label: producción y distribución deelectricidad @es
preferred label: électricité @fr
preferred label: eletricidade (prod e dist) @pt-pt
preferred label: electricity production and distribution @en-gb
preferred label: Strom @de
preferred label: 電力 @ja-jp
definition: Tudo o que diz respeito ao sistema de distribuição de energia, mas também à venda de energia elétrica por grosso e a retalho. @pt-pt
definition: Primarily concerning the power line distribution system, but also the sale of electrical power at wholesale and retail levels @en-gb
definition: Le système de distribution et la vente d'énergie électrique en gros et au détail @fr
definition: In erster Linie das Energieverteilungsnetz betreffend, aber auch den Verkauf von Energie an den Strommarkt und Verteiler. @de
definition: 送電のシステムを主な業務とするが、電力の卸売りや小売レベルの業務も行う @ja-jp
definition: Lo concerniente a los sistemas de distribución de energía, pero tambien la venta de energía eléctrica al mayor y al por menor. @es
definition: Tudo o que diz respeito ao sistema de distribuição de energia, mas também à venda de energia elétrica por atacado e no varejo. @pt-br
definition: Distribuzione di energia elettrica e varie forme di vendita di essa
note: nessuno
in scheme: Subject Code
created: 2000-10-30T12:00:00+00:00
modified: 2010-12-15T17:01:09+00:00
broader: Energia

Trattamento Rifiuti
type: Concept
preferred label: manejo de desechos y control de contaminación @es
preferred label: Schadstoff @de
preferred label: waste management and pollution control @en-gb
preferred label: gestão de resíduos e de poluição @pt-pt
preferred label: Traitement des déchets @fr
preferred label: 廃棄物処理 @ja-jp
definition: Historias acerca de negocios de desechos y control de la contaminación @es
definition: Histórias sobre o negócio da gestão de resíduos e sobre o controle da poluição. @pt-br
definition: Angelegenheiten der Abfallverwertung und Verschmutzungskontrolle. @de
definition: Trattamento e gestione dei rifiuti e controllo dell'inquinamento
definition: 廃棄物処理と汚染物質管理のビジネスについての話 @ja-jp
definition: Histórias sobre o negócio da gestão de resíduos e sobre o controlo da poluição. @pt-pt
definition: The business of waste management and pollution control @en-gb
definition: Utilisation des déchets et contrôle de la pollution @fr
note: nessuno
in scheme: Subject Code
created: 2000-10-30T12:00:00+00:00
modified: 2010-12-15T17:01:09+00:00
broader: Energia

Risorse Idriche
type: Concept
preferred label: Alimentation en eau @fr
preferred label: Wasser @de
preferred label: water supply @en-gb
preferred label: 水道 @ja-jp
preferred label: abastecimento de água @pt-pt
preferred label: suministro de agua @es
definition: Histórias sobre o negócio do fornecimento de água para uso humano. @pt-pt
definition: Angelegenheiten des Gebrauchs-und Trinkwasserschutzes. @de
definition: L'approvisionnement en eau @fr
definition: 人間が使用する水の供給ビジネスについての話 @ja-jp
definition: Historias de negocios que proveen agua para uso humano @es
definition: The business of providing water for human use @en-gb
definition: Approvigionamento idrico per uso umano, i bacini idrici
note: nessuno
in scheme: Subject Code
created: 2000-10-30T12:00:00+00:00
modified: 2010-12-15T17:01:09+00:00
broader: Energia

Risorse naturali (generico)
type: Concept
preferred label: Ressources naturelles @fr
preferred label: Rohstoff @de
preferred label: recursos naturais (geral) @pt-pt
preferred label: natural resources (general) @en-gb
preferred label: recursos naturales (general) @es
preferred label: 天然資源（一般） @ja-jp
definition: Artigos sobre o uso geral de recursos naturais para fins comerciais. @pt-br
definition: Die generelle Nutzung natürlicher Ressourcen zu wirtschaftlichen Zwecken, mit Ausnahme von einem bestimmten Bereich, wie Kohle, Öl, Gas oder Wasser. @de
definition: The general use of natural resources for business purposes, not focused on specific resources such as coal, oil, gas or water @en-gb
definition: Artículos acerca del uso general de recursos naturales con propósito empresarial, no focalizado en recursos específicos como carbón, petróleo, gas o agua. @es
definition: Generico utilizzo a fini economici o imprenditoriali delle risorse natuali
definition: L'utilisation des ressources naturelles en général @fr
definition: 石炭、石油、天然ガスあるいは水のような特定資源に焦点をあてない商業目的での天然資源の一般使用に関する記事 @ja-jp
note: nessuno
in scheme: Subject Code
created: 2000-10-30T12:00:00+00:00
modified: 2010-12-15T17:01:09+00:00
broader: Energia
broad match: http://cv.iptc.org/newscodes/mediatopic/20000256

Energia (generico)
type: Concept
preferred label: energia (geral) @pt-pt
preferred label: energy (general) @en-gb
preferred label: エネルギー（一般） @ja-jp
preferred label: Energie @de
preferred label: energía (general) @es
preferred label: énergie @fr
definition: L'industrie de l'énergie en général @fr
definition: Artigos sobre a indústria energética em geral. @pt-pt
definition: Energy industry, not focused on any specific sector @en-gb
definition: Artículos acerca de energía industrial no focalizados en ningún sector específico. @es
definition: Energiebranche, nicht auf einen bestimmten Bereich konzentriert. @de
definition: どの特定部門にも焦点をあてないエネルギー産業に関する記事 @ja-jp
definition: Industria e sistema dell'energia in generale, senza una particolare focalizzazione su un determinato settore
note: nessuno
in scheme: Subject Code
created: 2000-10-30T12:00:00+00:00
modified: 2010-12-15T17:01:09+00:00
broader: Energia
broad match: http://cv.iptc.org/newscodes/mediatopic/20000256

Gas naturali
type: Concept
preferred label: gas natural @es
preferred label: gás natural @pt-pt
preferred label: natural gas @en-gb
preferred label: Erdgas @de
preferred label: Gaz naturel @fr
preferred label: 天然ガス @ja-jp
definition: Natürlicher Rohstoff aus der Erde, meist Methan in entflammbarem gasförmigen Zustand. @de
definition: A natural resource, mainly methane in an flammable gaseous state, from the ground @en-gb
definition: Recurso natural, sobretudo metano em estado gasoso inflamável. @pt-br
definition: Ressource naturelle, principalement du méthane inflammable, extraite de gisements @fr
definition: Un recurso natural, principalmente metano en un estado gaseoso inflamable, obtenido de la tierra. @es
definition: Tutte le attività concernenti i gas estratti dalla terra, principalmente il metano
definition: 地中から採取する天然資源。主に燃えやす状態のメタンガス @ja-jp
note: nessuno
in scheme: Subject Code
created: 2004-04-22T12:00:00+00:00
modified: 2012-07-10T12:00:00+00:00
broader: Energia

Benzina
type: Concept
preferred label: gasolina @pt-br
preferred label: petrol @en-gb
preferred label: ガソリン @ja-jp
preferred label: Essence @fr
preferred label: Benzin @de
definition: Produto petrolífero destilado, usado para combustível automóvel, com ou sem aditivos. @pt-br
definition: Producto destilado del crudo, utilizado para combustible de autos, con o sin aditivos. @es
definition: Derivato del petrolio utilizzato principalmente come carburante per autotrazione, con o senza aggiunta di additivi
definition: Produit pétrolier utilisé pour les véhicules automobiles @fr
definition: 添加物の有無にか関わらず、自動車の燃料に使用される蒸留石油製品 @ja-jp
definition: Distilled petroleum product used for automotive fuel, with or without additives @en-gb
definition: Destilliertes Petroleumprodukt zur Nutzung als Brennstoff für Autos, mit oder ohne Zusätze. @de
note: nessuno
in scheme: Subject Code
created: 2004-04-22T12:00:00+00:00
modified: 2012-07-10T12:00:00+00:00
broader: Energia

Gasolio
type: Concept
preferred label: Diesel @de
preferred label: combustible diesel @es
preferred label: gasóleo @pt-pt
preferred label: Carburant diesel @fr
preferred label: diesel fuel @en-gb
preferred label: ディーゼル燃料 @ja-jp
definition: トラック、マリン・エンジンで使用されるだけでなく、ある種の家庭暖房用製品でも使用される、ガソリンより重い蒸留された石油製品 @ja-jp
definition: Produto petrolífero destilado, mais pesado do que a gasolina, utilizado para camiões, motores de barcos e certos sistemas de calefação. @pt-pt
definition: Produit pétrolier plus lourd que l'essence utilisé comme carburant et dans le chauffage @fr
definition: Produto petrolífero destilado, mais pesado do que a gasolina, utilizado para caminhões, motores de barcos e certos sistemas de calefação. @pt-br
definition: Destilliertes Petroleumprodukt schwerer als Benzin nicht nur für LKW`s, Seemotoren, sondern auch in spezieller Form zum Heizen. @de
definition: Derivato del petrolio utilizzato non soltanto come carburante ma anche per alimentazione di impianti (ad es. riscaldamento)
definition: A distilled petroleum product heavier than gasoline used not only for trucks, marine engines, but in certain forms for home heating @en-gb
definition: Un producto destilado del petróleo, más grueso que la gasolina, utilizado no sólo para camiones y motores de barcos, pero en ciertos sistemas de calefacción de edificios. @es
note: nessuno
in scheme: Subject Code
created: 2004-04-22T12:00:00+00:00
modified: 2012-07-10T12:00:00+00:00
broader: Energia

Kerosene
type: Concept
preferred label: Kerosin/Paraffin @de
preferred label: querosene/parafina @pt-pt
preferred label: kerosene/paraffin @en-gb
preferred label: Kérosène @fr
preferred label: kerosene, parafina @es
preferred label: 灯油 @ja-jp
definition: Produto derivado do petróleo, usado como combustível para cozinhas, motores de aviões, candeeiros, calefação e limpeza. @pt-br
definition: Derivato del petrolio generalmente utilizzato come propellente per motori a reazione ma anche come combustibile per cucinare o illuminare, e per impianti di riscaldamento
definition: Ein leichtes Petroleumdestillat als Kochbrennstoff genutzt, Flugzeugmotoren, Lampen, Heizung und zur Reinigung. @de
definition: Produit dérivé du pétrole utilisé notamment comme carburant dans l'aviation @fr
definition: Un destilado liviano del petróleo, utilizado como combustible para cocinas, motores de aviones, lamparas, calefacción y limpieza. @es
definition: A light petroleum distillate used for cooking fuel, aircraft jet engines, lamps, heating and cleaning @en-gb
definition: 料理用燃料、航空機ジェットエンジン、ランプ、暖房、および掃除に使用される軽油 @ja-jp
note: nessuno
in scheme: Subject Code
created: 2004-04-22T12:00:00+00:00
modified: 2012-07-10T12:00:00+00:00
broader: Energia

Contabilità, Revisione
type: Concept
preferred label: 会計監査 @ja-jp
preferred label: Comptabilité et Audit @fr
preferred label: contabilidade e auditoria @pt-br
preferred label: contabilidad y auditoría @es
preferred label: Wirtschaftsprüfer @de
preferred label: accountancy and auditing @en-gb
definition: Servicios que proveen hojas de balance, reconciliación presupuestaria, y examinar la exactitud de estados financieros. @es
definition: Serviços que fornecem balancetes, conciliações orçamentais e verificam a exatidão de relatórios financeiros. @pt-br
definition: Unternehmen die Bilanzen erstellen, Haushalte konsolidieren und die Richtigkeit von Geschäftsberichten prüfen. @de
definition: Servizi di verifica e controllo forniti per la regolare tenuta della contabilità nelle società
definition: L'audit et l'expertise comptable @fr
definition: 貸借対照表の提供、予算修正および、財務表の精度を調べるサービス @ja-jp
definition: Services provide balance sheet, budgets reconciliation and examine accuracy of financial statements @en-gb
note: nessuno
in scheme: Subject Code
created: 2000-10-30T12:00:00+00:00
modified: 2010-12-15T17:01:09+00:00
broader: Servizi finanziari

Banche
type: Concept
preferred label: Banque @fr
preferred label: banca @pt-br
preferred label: 銀行 @ja-jp
preferred label: Bank @de
preferred label: servicios bancarios @es
preferred label: banking @en-gb
definition: Servicios que mantienen, transportan, reciven y entregan dinero en efectivo. @es
definition: Les services proposés par les banques et assimilés @fr
definition: Serviços de guarda, transmissão, recepção e entrega de dinheiro. @pt-br
definition: Unternehmen, die Bargeld lagern, übermitteln, empfangen und verteilen. @de
definition: Vari tipi di servizi bancari
definition: Services for storing, transmitting, receiving and delivery of cash moneys @en-gb
definition: Serviços de guarda, transmissão, receção e entrega de dinheiro. @pt-pt
definition: 現金の貯蓄、送金、授受を行うサービス @ja-jp
note: nessuno
in scheme: Subject Code
created: 2000-10-30T12:00:00+00:00
modified: 2010-12-15T17:01:09+00:00
broader: Servizi finanziari

Consulenze
type: Concept
preferred label: Unternehmensberatung @de
preferred label: servicios de consultoría @es
preferred label: コンサルタント @ja-jp
preferred label: serviço de consultoria @pt-br
preferred label: Consultants @fr
preferred label: consultancy service @en-gb
definition: Fornecedores de conhecimentos especializados em vários domínios, geralmente com base em contratos temporários. @pt-br
definition: Providers of expert knowledge in a wide range of fields usually on a temporary, contract basis @en-gb
definition: Les services d'expertises et de conseils aux entreprises @fr
definition: Servizi a contratto e su base temporanea in grado di fornire alle imprese conoscenze tecniche in vari campi
definition: Proveedores expertos con conocimientos en un amplio campo, que regularmente trabajan por temporada o como contratistas. @es
definition: 幅広い分野において専門的知識を提供する者。通常は一時的な請負が基本 @ja-jp
definition: Anbieter von Expertenwissen in vielseitigen Wissensgebieten, meist in Form von Zeitverträgen. @de
note: nessuno
in scheme: Subject Code
created: 2000-10-30T12:00:00+00:00
modified: 2010-12-15T17:01:09+00:00
broader: Servizi finanziari

Agenzie per l'impiego
type: Concept
preferred label: agencias de empleo @es
preferred label: Arbeitsvermittlung @de
preferred label: trabalho temporário (agências) @pt-pt
preferred label: employment agency @en-gb
preferred label: Agence pour l'emploi @fr
preferred label: 人材派遣 @ja-jp
definition: 人に仕事を斡旋したり会社に人材を派遣するサービス @ja-jp
definition: Serviço que ajuda as pessoas a encontrar emprego e as empresas a encontrar empregados. @pt-pt
definition: A service helping people find jobs, and companies to find workers @en-gb
definition: Lieu où sont répertoriés et proposés des emplois aux chômeurs @fr
definition: Dienst, der Menschen unterstützt einen Arbeitsplatz zu finden und für Firmen Arbeitskräfte vermittelt. @de
definition: Un servicio que ayuda a individuos a encontrar trabajos y a las companias a econtrar empleados. @es
definition: Servizi per aiutare le persone a trovare un lavoro e le imprese a reperire lavoratori
note: nessuno
in scheme: Subject Code
created: 2000-10-30T12:00:00+00:00
modified: 2010-12-15T17:01:09+00:00
broader: Servizi finanziari

Servizi Sanitari
type: Concept
preferred label: Services de santé @fr
preferred label: healthcare provider @en-gb
preferred label: prestador de serviços de saúde @pt-pt
preferred label: prestadores de servicios de salud @es
preferred label: 医療機関 @ja-jp
preferred label: Gesundheitsdienst @de
definition: Fornecedores de serviços médicos a todos os níveis, incluindo médicos, hospitais, etc. @pt-br
definition: Anbieter von medizinischen Diensten auf allen Ebenen, inklusive Ärzte, Kliniken etc. @de
definition: Fornitori di servizi sanitari a tutti i livelli, incluso medici, ospedali, ecc...
definition: 病院、医師などを含むすべてのレベルにおける医療業務提供者 @ja-jp
definition: Proveedores de servicios médicos en todos los niveles, incluyendo doctores, hospitales, etc. @es
definition: Providers of medical services at all levels, including doctors, hospitals etc @en-gb
definition: médecins, hôpitaux et autres fournissuers de soins médicaux @fr
note: nessuno
in scheme: Subject Code
created: 2000-10-30T12:00:00+00:00
modified: 2010-12-15T17:01:09+00:00
broader: Servizi finanziari

Assicurazioni
type: Concept
preferred label: 保険 @ja-jp
preferred label: Assurances @fr
preferred label: seguros @pt-pt
preferred label: insurance @en-gb
preferred label: Versicherung @de
definition: Ein Risiko tragendes Unternehmen, das einzelnen ermöglicht regelmäßig einen kleinen Beitrag zu zahlen, um finanziell auf unvorhergesehene Ereignisse vorbereitet zu sein. @de
definition: Contrat garantissant contre les risques moyennant le paiement de primes régulières @fr
definition: Contrato por el que alguien se obliga mediante el cobro de una prima a indemnizar el daño producido ante eventos subitos. @es
definition: Società che esercitano l'attività assicurativa.
definition: 定期的に小額を支払うことによって、個人を不測の事態から経済的に保護する、リスクを伴う投機的事業 @ja-jp
definition: Contrato de assunção de risco que pressupõe que os indivíduos paguem periodicamente uma quantia para ficarem protegidos financeiramente contra eventos inesperados. @pt-pt
definition: A risk taking venture that allows individuals to pay small amounts periodically to guard financially against unexpected events @en-gb
note: nessuno
in scheme: Subject Code
created: 2000-10-30T12:00:00+00:00
modified: 2010-12-15T17:01:09+00:00
broader: Servizi finanziari

Servizi legali
type: Concept
preferred label: serviços jurídicos @pt-pt
preferred label: 法務 @ja-jp
preferred label: legal service @en-gb
preferred label: Rechtsberatung @de
preferred label: Service juridique @fr
preferred label: servicios legales @es
definition: Les cabinets et services juridiques @fr
definition: 会社や個人が州や連邦、地方の法に対処するのを手助けする弁護士など @ja-jp
definition: Advogados e outros que ajudam empresas e indivíduos a lidar com leis estatais, federais e locais. @pt-br
definition: Advogados e outros que ajudam empresas e indivíduos a lidar com leis. @pt-pt
definition: Lawyers and others who help companies and individuals deal with state, federal and local laws @en-gb
definition: Abogados y otros que ayudan a compañias e individuos a ldiar con las leyes estatales, federales y locales. @es
definition: Rechtsanwälte und andere, die Firmen und Einzelnen dabei helfen mit staatlichen, bundesstaatlichen und örtlichen Gesetzen umzugehen. @de
definition: Avvocati e servizi di tipo giuridico di ausilio a società e altri soggetti nelle questioni riguardanti le leggi e normative statali, regionali e locali
note: nessuno
in scheme: Subject Code
created: 2000-10-30T12:00:00+00:00
modified: 2010-12-15T17:01:09+00:00
broader: Servizi finanziari

Indagini Mercato
type: Concept
preferred label: 市場調査 @ja-jp
preferred label: études de marché @fr
preferred label: estudos de mercado @pt-pt
preferred label: market research @en-gb
preferred label: Marktforschung @de
preferred label: investigación de mercado @es
definition: Studi e servizi su desideri ed esigenze dei consumatori rispetto al mercato
definition: Les études et services visant à déterminer ce que les gens veulent acheter @fr
definition: Serviço que tenta determinar o que as pessoas pretendem comprar. @pt-pt
definition: 人々が何を買いたがっているかを測定しようとするサービス @ja-jp
definition: Un servicio que trata de determinar lo que la gente quiere comprar. @es
definition: A service that tries to determine what people want to buy @en-gb
definition: Dienstleister, der versucht Käuferbedürfnisse zu ermitteln. @de
note: nessuno
in scheme: Subject Code
created: 2000-10-30T12:00:00+00:00
modified: 2010-12-15T17:01:09+00:00
broader: Servizi finanziari

Negoziazioni Titoli
type: Concept
preferred label: 証券会社 @ja-jp
preferred label: stock broking @en-gb
preferred label: corretagem @pt-pt
preferred label: corretaje de acciones @es
preferred label: Börsenmakler @de
preferred label: Courtage d'actions @fr
definition: Compra e venda de ações de uma companhia, em representação de indivíduos ou entidades. @pt-br
definition: The buying and selling of company shares on behalf of individuals or other entities @en-gb
definition: 個人や団体に代わって、会社の株を売買すること @ja-jp
definition: Le courtage en bourse effectué par les agents de change pour le compte de leurs clients @fr
definition: Servizi per la compravendita di titoli in borsa da parte degli agenti di cambio per conto dei loro clienti
definition: Kaufen und Verkaufen von Firmenanteilen im Auftrag von Einzelnen oder anderen Gremien. @de
definition: La compra y venta de acciones de una compañía, que representa a individuos u entidades. @es
note: nessuno
in scheme: Subject Code
created: 2000-10-30T12:00:00+00:00
modified: 2010-12-15T17:01:09+00:00
broader: Servizi finanziari

Investimenti personali
type: Concept
preferred label: investimentos pessoais @pt-pt
preferred label: 個人投資 @ja-jp
preferred label: inversiones personales @es
preferred label: personal investing @en-gb
preferred label: Placements personnels @fr
preferred label: Private Investition @de
definition: Finanze ed investimenti personali
definition: 個人的な資産運用と投資 @ja-jp
definition: Finanças e investimentos pessoais. @pt-pt
definition: Finanzas e inversiones personales @es
definition: Les placements personnels @fr
definition: Private Finanzen und Investitionen. @de
definition: Personal finance and investment @en-gb
note: nessuno
in scheme: Subject Code
created: 2000-10-30T12:00:00+00:00
modified: 2010-12-15T17:01:09+00:00
broader: Servizi finanziari

Tendenze Mercato
type: Concept
preferred label: indicadores de consumo @pt-pt
preferred label: tendencias de mercado @es
preferred label: Tendance du marché @fr
preferred label: market trend @en-gb
preferred label: 消費動向 @ja-jp
preferred label: Marktentwicklung @de
definition: Statistisch relevantes Konsumverhalten. @de
definition: 統計的に顕著な消費者行動 @ja-jp
definition: Comportamiento de consumidores estadísticamente significativos @es
definition: Les tendances de comportement des consommateurs @fr
definition: Statistically significant consumer behaviour. @en-gb
definition: Comportamento estatisticamente significativo dos consumidores. @pt-pt
definition: Comportamento dei consumatori e tendenze, rilevati a livello statistico
note: nessuno
in scheme: Subject Code
created: 2000-10-30T12:00:00+00:00
modified: 2010-12-15T17:01:09+00:00
broader: Servizi finanziari

Spedizioni
type: Concept
preferred label: serviços de expedição @pt-pt
preferred label: shipping service @en-gb
preferred label: servicios de embarque @es
preferred label: Sociétés de tansport @fr
preferred label: Kurierdienst @de
preferred label: 配送・郵便 @ja-jp
definition: Compañías que preparan y transportan paquetes y documentos para personas o compañías, incluyendo servicios de correos. @es
definition: Empresas que preparam e transportam embalagens e documentos por vários meios, incluindo serviços postais. @pt-br
definition: Società e servizi di trasporto di documenti e/o pacchi per conto di terzi, inclusi i servizi postali
definition: Companies that prepare and transport packages and documents for individuals or companies by any means, including postal services. @en-gb
definition: Les sociétés de transport, y compris postal mais hors déménagement @fr
definition: Unternehmen, die Pakete und Dokumente für Einzelne oder Firmen verpacken und auf allen Wegen transportieren, Postdienste miteingeschlossen. @de
definition: 個人や会社のために小荷物や文書を用意して輸送する会社。郵便サービスを含む @ja-jp
note: nessuno
in scheme: Subject Code
created: 2000-10-30T12:00:00+00:00
modified: 2010-12-15T17:01:09+00:00
broader: Servizi finanziari

Servizi per la persona
type: Concept
preferred label: Körperpflegeservice @de
preferred label: Soins de beauté @fr
preferred label: serviços pessoais @pt-pt
preferred label: servicios personales @es
preferred label: サービス業 @ja-jp
preferred label: personal service @en-gb
definition: Servicios intangibles para personas, tales como cuidados de belleza o peluquería. @es
definition: Servizi particolari e non tangibili per il consumatore
definition: Sociétes de services de soins de beauté @fr
definition: Serviço ao consumidor que é intangível, como cuidados de beleza ou cabeleireiro. @pt-pt
definition: 個人向けサービスとは、例えば美しさをケアする調髪業のような、無形のもの @ja-jp
definition: Consumer service that is intangible e.g. beauty care as in hairdressing @en-gb
definition: Dienstleistung, die nicht ganz greifbar ist, z.B. Kosmetik und Haarpflege. @de
note: nessuno
in scheme: Subject Code
created: 2000-10-30T12:00:00+00:00
modified: 2010-12-15T17:01:09+00:00
broader: Servizi finanziari

Servizi Ambientali
type: Concept
preferred label: Reinigungsservice @de
preferred label: janitorial service @en-gb
preferred label: 清掃業 @ja-jp
preferred label: servicios de conserjería @es
preferred label: serviços de limpeza @pt-br
preferred label: Sociétés d'entretien @fr
definition: Compañías que proveen servicios de limpieza para hogares y empresas. @es
definition: Sociétés effectuant l'entretien de locaux @fr
definition: 家庭やビジネスに対して、清掃や、類似のサービスを提供する会社 @ja-jp
definition: Imprese che forniscono servizi di pulizia e similari per la casa, gli uffici o le aziende
definition: Empresas que fornecem serviços de limpeza e similares. @pt-br
definition: Unternehmen, die für private und geschäftliche Kunden Reinigungsdienstleistungen anbieten. @de
definition: Companies that provide cleaning and similar services for homes and businesses. @en-gb
note: nessuno
in scheme: Subject Code
created: 2000-10-30T12:00:00+00:00
modified: 2010-12-15T17:01:09+00:00
broader: Servizi finanziari

Servizi funebri
type: Concept
preferred label: agência funerária e crematório @pt-pt
preferred label: servicios funerarios y de crematorio @es
preferred label: funeral parlour and crematorium @en-gb
preferred label: 葬祭業 @ja-jp
preferred label: Beerdigungsinstitut @de
preferred label: Pompes funèbres @fr
definition: Compañías que ofrecen el servicio de eliminación de los restos @es
definition: 葬祭に関するサービスを提供する会社 @ja-jp
definition: Empresas que fornecem serviços funerários. @pt-pt
definition: Società e imprese di pompe funebri, servizi cimiteriali
definition: Sociétés de pompes funèbres, salons funéraires, crématoriums @fr
definition: Unternehmen, die Dienstleistungen anbieten im Zusammenhang mit Tod. @de
definition: Companies that provide services for disposal of the dead @en-gb
note: nessuno
in scheme: Subject Code
created: 2000-10-30T12:00:00+00:00
modified: 2010-12-15T17:01:09+00:00
broader: Servizi finanziari

Noleggi
type: Concept
preferred label: serviços de aluguer @pt-pt
preferred label: Sociétés de location @fr
preferred label: Mietservice @de
preferred label: rental service @en-gb
preferred label: servicios de arriendo @es
preferred label: serviços de locação @pt-br
preferred label: レンタル業 @ja-jp
definition: Empresas que fornecem serviços de locação, incluindo veículos, smokings, ferramentas, equipamento pesado e outros bens. @pt-br
definition: Unternehmen, die Vermietungen anbieten, Fahrzeuge, Smokings, Werkzeuge, schwere Ausrüstung und andere Angebote. @de
definition: Società di noleggio di articoli e/o servizi di vario genere: auto, motoveicoli, vestiti, apparecchiature ecc.
definition: 賃貸商品を提供する会社。自動車、タキシード、道具、重機器、その他を含む @ja-jp
definition: Companies which provide rentals, including motor vehicles, tuxedos, tools, heavy equipment, and other supplies @en-gb
definition: Compañías de arrendamiento, incluyendo vehículos motores, herramientas, equipamiento pesado y otros insumos @es
definition: Empresas que fornecem serviços de aluguer, incluindo veículos, smokings, ferramentas, equipamento pesado e outros bens. @pt-pt
definition: Sociétés de location en tous genres @fr
note: nessuno
in scheme: Subject Code
created: 2000-10-30T12:00:00+00:00
modified: 2010-12-15T17:01:09+00:00
broader: Servizi finanziari

Servizi matrimoniali
type: Concept
preferred label: 結婚サービス @ja-jp
preferred label: servicios de boda @es
preferred label: Services matrimoniaux @fr
preferred label: serviços de casamento @pt-br
preferred label: wedding service @en-gb
preferred label: Hochzeitsservice @de
definition: Dienste und Produkte rund um die Hochzeit. @de
definition: Servizi e prodotti riguardanti l'industria delle nozze: vestiti, ristorazione, addobbi ed arredi, bomboniere ecc.
definition: Serviços e produtos relacionados com a indústria do casamento. @pt-pt
definition: 冠婚に関するサービスと製品 @ja-jp
definition: Services et produits spécialisés dans les mariages @fr
definition: Services and products related to the wedding industry @en-gb
definition: Servicios y productos relativos a la industria de los matrimonios @es
definition: Serviços e produtos relacionados à indústria do casamento. @pt-br
note: nessuno
in scheme: Subject Code
created: 2000-10-30T12:00:00+00:00
modified: 2010-12-15T17:01:09+00:00
broader: Servizi finanziari

Finanze personali
type: Concept
preferred label: Privatfinanzen @de
preferred label: finanzas personales @es
preferred label: épargne personnelle @fr
preferred label: finanças pessoais @pt-br
preferred label: personal finance @en-gb
preferred label: 個人収支 @ja-jp
definition: Les réserves financières personnelles à disposition en vue de placements notamment @fr
definition: Einkommen und Ausgaben einer Privatperson. @de
definition: Gastos e ingresos individuales @es
definition: Gastos e receitas individuais. @pt-br
definition: 個人の収入と支出 @ja-jp
definition: Entrate ed uscite individuali
definition: An individual's income and expenses @en-gb
note: nessuno
in scheme: Subject Code
created: 2003-04-05T12:00:00+00:00
modified: 2012-07-10T12:00:00+00:00
broader: Servizi finanziari

Redditi personali
type: Concept
preferred label: Revenus personnels @fr
preferred label: ingresos personales @es
preferred label: rendimento individual @pt-br
preferred label: Privateinkommen @de
preferred label: personal income @en-gb
preferred label: 個人所得 @ja-jp
definition: Dinheiro que uma pessoa ganha. @pt-br
definition: 個人が稼ぎ、そして貯蓄または使うお金 @ja-jp
definition: Verdienst einer Person und was ihm/ihr davon zur Verfügung steht. @de
definition: Dinero que una persona gana @es
definition: Redditi individuali
definition: Money that a person earns and is his/hers to keep or spend @en-gb
definition: Les gains liés au travail ou au placements @fr
note: nessuno
in scheme: Subject Code
created: 2003-04-05T12:00:00+00:00
modified: 2012-07-10T12:00:00+00:00
broader: Servizi finanziari

Aste
type: Concept
preferred label: オークション @ja-jp
preferred label: leilões @pt-pt
preferred label: servicio de remates @es
preferred label: Auktion @de
preferred label: auction service @en-gb
preferred label: Ventes anx enchères @fr
definition: Sales by bidding @en-gb
definition: Käufe durch bieten. @de
definition: Venda por leilão. @pt-br
definition: 入札による販売 @ja-jp
definition: Ventas al mejor postor. @es
definition: Ventes par le biais d'enchères au plus offrant @fr
definition: Servizi di pubblica vendita al migliore offerente
note: nessuno
in scheme: Subject Code
created: 2004-10-13T12:00:00+00:00
modified: 2012-07-10T12:00:00+00:00
broader: Servizi finanziari

Servizi di stampa, promozionali
type: Concept
preferred label: 看板・ちらし @ja-jp
preferred label: serviços promocionais @pt-br
preferred label: Druckdienstleister @de
preferred label: printing/promotional service @en-gb
preferred label: impresión-servicio promocional. @es
preferred label: Reprographie @fr
definition: Produzione di materiale stampato come volantini, annunci, insegne, ecc...
definition: Production of printed matter such as flyers, ads, signs etc @en-gb
definition: Produktion von Druckmaterialien wie Flyer, Werbeplakate, Schilder etc. @de
definition: チラシ、広告、看板などのような印刷物の作成 @ja-jp
definition: Production de matériel imprimé comme des prospectus, livrets @fr
definition: Produção de material impresso como panfletos, anúncios, letreiros, etc. @pt-pt
definition: Producción de material impreso tales como panfletos, avisos, letreros, etc. @es
note: nessuno
in scheme: Subject Code
created: 2004-10-13T12:00:00+00:00
modified: 2012-07-10T12:00:00+00:00
broader: Servizi finanziari

Servizi Investimento
type: Concept
preferred label: servicio de inversiones @es
preferred label: investment service @en-gb
preferred label: Investmentdienst @de
preferred label: serviços de investimento @pt-br
preferred label: 投資顧問 @ja-jp
preferred label: Conseillers financiers @fr
definition: ストック･ディーラーやコンサルタントに対立するものとしての金融アドバイザー @ja-jp
definition: Servizi di consulenza finanziaria forniti a clienti
definition: Consejos financieros relativos a acciones, corredores de bolsa o consultores. @es
definition: Finanzberater, entgegen Börsenhändlern und -beratern. @de
definition: Conselheiros financeiros. @pt-pt
definition: Financial advisers, as opposed to stock dealers or consultants @en-gb
definition: Personnes qui conseillent des placements à leurs clients @fr
note: nessuno
in scheme: Subject Code
created: 2004-10-13T12:00:00+00:00
modified: 2012-07-10T12:00:00+00:00
broader: Servizi finanziari

Abbigliamento
type: Concept
preferred label: vestuario @es
preferred label: clothing @en-gb
preferred label: vestuário @pt-pt
preferred label: Habillement @fr
preferred label: Bekleidung @de
preferred label: 衣料 @ja-jp
definition: Artigos de vestuário. @pt-br
definition: Ensemble des vêtements que l'on porte @fr
definition: Artículo de vestir @es
definition: 身に着ける衣料品 @ja-jp
definition: Waren, die als Kleidung getragen werden. @de
definition: Articoli di vestiario da indossare
definition: Items of apparel to wear @en-gb
note: nessuno
in scheme: Subject Code
created: 2000-10-30T12:00:00+00:00
modified: 2010-12-15T17:01:09+00:00
broader: Beni Consumo

Grandi magazzini
type: Concept
preferred label: department store @en-gb
preferred label: 百貨店 @ja-jp
preferred label: lojas de departamento @pt-br
preferred label: tiendas por departamentos @es
preferred label: Warenhaus/Kaufhaus @de
preferred label: grandes armazéns @pt-pt
preferred label: Grands magasins @fr
definition: Grandes superfícies destinadas à venda ao público. @pt-pt
definition: Stores largely devoted to the sale of clothing to individuals @en-gb
definition: Große Läden, die bestimmt sind um Sachen für Einzelne anzubieten. @de
definition: Grandi strutture di vendita al consumo di articoli di vario genere
definition: Magasins comportant différents rayons sur plusieurs étages ==== Magasins à rayons multiples @fr
definition: 個人向けの衣類販売に重きを置く店舗 @ja-jp
definition: Tiendas grandes destinadas a la venta de ropa y otros artículos. @es
note: nessuno
in scheme: Subject Code
created: 2000-10-30T12:00:00+00:00
modified: 2010-12-15T17:01:09+00:00
broader: Beni Consumo

Alimenti
type: Concept
preferred label: 食品 @ja-jp
preferred label: food @en-gb
preferred label: Alimentation @fr
preferred label: alimentação @pt-br
preferred label: Nahrungsmittel @de
preferred label: alimentos procesados para la venta @es
definition: Frutas, vegetales, pan, carnes, etc, para el consumo humano. @es
definition: Fruta, vegetais, pães, carnes, etc. para consumo humano. @pt-pt
definition: Frutta, verdure, pane, carne per il consumo umano
definition: 人間が摂取すための果物や野菜、パン、肉 @ja-jp
definition: Fruits, vegetables, breads, meats for human consumption @en-gb
definition: Fruits, légumes, pains, viandes pour la consommation humaine @fr
definition: Früchte, Gemüse, Brot, Fleisch zum Verzehr für Menschen. @de
note: nessuno
in scheme: Subject Code
created: 2000-10-30T12:00:00+00:00
modified: 2010-12-15T17:01:09+00:00
broader: Beni Consumo

Vendita per corrispondenza
type: Concept
preferred label: Vente par correspondance @fr
preferred label: Versandhandel @de
preferred label: 通信販売 @ja-jp
preferred label: vendas por correio @pt-pt
preferred label: mail order @en-gb
preferred label: venta por correo @es
definition: Waren, die auf dem Postweg verkauft und versendet werden. @de
definition: Artigos vendidos e entregues por correio. @pt-br
definition: Achat/vente de produits divers par correspondance @fr
definition: Vendita e acquisti di prodotti di vario genere consegnati per posta
definition: Artículos vendidos y entregados a través del correo. @es
definition: Items sold through and delivered by mail @en-gb
definition: 郵便を通じて販売して郵便で配送する品目 @ja-jp
note: nessuno
in scheme: Subject Code
created: 2000-10-30T12:00:00+00:00
modified: 2010-12-15T17:01:09+00:00
broader: Beni Consumo

Dettaglio
type: Concept
preferred label: Commerce de détail @fr
preferred label: venta minorista @es
preferred label: varejo @pt-br
preferred label: Einzelhandel @de
preferred label: retail @en-gb
preferred label: 小売 @ja-jp
preferred label: retalho @pt-pt
definition: Vente au détail, directement au consommateur, dernier maillon de la chaîne de vente @fr
definition: A última etapa da cadeia comercial. @pt-br
definition: The last stage in the sales chain @en-gb
definition: L'ultimo anello della catena delle vendite, vendita direttamente al consumatore
definition: A última etapa da cadeia de vendas. @pt-pt
definition: 一連の販売経路における最後の段階 @ja-jp
definition: ültimo punto en la cadena de ventas. @es
definition: Die unterste Stufe in der Handelshierarchie. @de
note: nessuno
in scheme: Subject Code
created: 2000-10-30T12:00:00+00:00
modified: 2010-12-15T17:01:09+00:00
broader: Beni Consumo

Negozi specializzati
type: Concept
preferred label: tiendas de especialidades @es
preferred label: speciality store @en-gb
preferred label: Fachhandel @de
preferred label: Commerce spécialisé @fr
preferred label: lojas especializadas @pt-pt
preferred label: 専門店 @ja-jp
definition: Lojas que se especializaram na venda de produtos específicos como sapatos, casacos, ferramentas, etc. @pt-pt
definition: 靴、コート、電動工具など、ある特定のカテゴリーを専門に扱う小売店 @ja-jp
definition: Retail outlets that specialize in categories such as shoes, coats, power tools, etc @en-gb
definition: Magasin de vente au détail de produits spécialisés @fr
definition: Negocios que se especializan en la venta de un tipo de producto en particular, tales como zapatos, abrigos, herramientas, etc. @es
definition: Verkaufsstelle im Einzelhandel, die spezialisiert ist auf bestimmte Waren, wie z.B. Schuhe, Mäntel, elektronisches Werkzeug, etc. @de
definition: Esercizi di vendita al dettaglio specializzati in categorie: scarpe, cappotti, elettronica ecc.
note: nessuno
in scheme: Subject Code
created: 2000-10-30T12:00:00+00:00
modified: 2010-12-15T17:01:09+00:00
broader: Beni Consumo

Ingrosso
type: Concept
preferred label: mercado atacadista @pt-br
preferred label: Grossistes @fr
preferred label: mercado grossista @pt-pt
preferred label: Großhandel @de
preferred label: 卸売 @ja-jp
preferred label: wholesale @en-gb
preferred label: venta mayorista @es
definition: Primeiro elo da cadeia comercial após a produção. @pt-br
definition: Il primo anello della catena delle vendite dopo la produzione; Grossisti
definition: Primer punto en la cadena de ventas. @es
definition: The first link in the sales chain after production @en-gb
definition: Primeiro elo da cadeia de vendas após a produção. @pt-pt
definition: Maillon intermédiaire de la chaîne de vente situé entre le producteur et le consommateur @fr
definition: Die oberste Stufe in der Handelshierarchie im Anschluss an die Produktion. @de
definition: 生産後の販売経路における最初の段階 @ja-jp
note: nessuno
in scheme: Subject Code
created: 2000-10-30T12:00:00+00:00
modified: 2010-12-15T17:01:09+00:00
broader: Beni Consumo

Bevande
type: Concept
preferred label: bebidas @es
preferred label: beverage @en-gb
preferred label: Getränke @de
preferred label: Distribution de boissons @fr
preferred label: 飲料 @ja-jp
definition: Consumíveis líquidos, alcoólicos e não alcoólicos. @pt-br
definition: Liquid consumables, both alcoholic and non-alcoholic @en-gb
definition: 液体消費財。アルコールを含む、含まないに関わらない @ja-jp
definition: Beni di consumo liquidi, sia alcolici sia analcolici
definition: Tout élément liquide, alcoolisé ou non, que l'on peut boire @fr
definition: Liquidos consumiblesñ ambos alcohólicos y no alcohólicos. @es
definition: Konsumierbare Getränke, alkoholische und nicht-alkoholische. @de
note: nessuno
in scheme: Subject Code
created: 2000-10-30T12:00:00+00:00
modified: 2010-12-15T17:01:09+00:00
broader: Beni Consumo

Commercio elettronico
type: Concept
preferred label: comércio eletrônico @pt-br
preferred label: 電子商取引 @ja-jp
preferred label: E-Commerce @de
preferred label: Commerce électronique @fr
preferred label: comércio eletrónico @pt-pt
preferred label: comercio electrónico @es
preferred label: electronic commerce @en-gb
definition: Compravendita di articoli attraverso l'utilizzo di internet; E-commerce
definition: e-commerce, vente/achat sur internet @fr
definition: Buying and selling items through the Internet @en-gb
definition: Compra e venda de produtos pela Internet. @pt-pt
definition: Compra y venta de productos a traves de la Internet. @es
definition: インターネットを通じて品目を売買すること @ja-jp
definition: Kaufen und Verkaufen im Internet. @de
note: nessuno
in scheme: Subject Code
created: 2000-10-30T12:00:00+00:00
modified: 2010-12-15T17:01:09+00:00
broader: Beni Consumo

Beni di lusso
type: Concept
preferred label: Luxusgüter @de
preferred label: Commerce de luxe @fr
preferred label: bens de luxo @pt-br
preferred label: ブランド品 @ja-jp
preferred label: luxury good @en-gb
preferred label: suntuarios @es
definition: 革バッグ、宝石類、オートクチュール、アクセサリなど @ja-jp
definition: Prodotti di lusso: gioielleria, alta moda, accessori firmati, pelletteria, ecc...
definition: Ledertaschen, Schmuck, gehobene Mode, Accessoires etc. @de
definition: Carteiras em pele, joias, alta costura, acessórios, etc. @pt-pt
definition: Ensemble des produits de luxe @fr
definition: Bolsa de couro, joias, alta costura, acessórios, etc. @pt-br
definition: Leather bags, jewellery, haute couture, accessories etc @en-gb
definition: Carteras de cuero, joyería, alta costura, accesorios, etc. @es
note: nessuno
in scheme: Subject Code
created: 2000-10-30T12:00:00+00:00
modified: 2010-12-15T17:01:09+00:00
broader: Beni Consumo

Beni non durevoli
type: Concept
preferred label: bens não-duradouros @pt-pt
preferred label: Gebrauchsgüter @de
preferred label: 日用雑貨 @ja-jp
preferred label: bens não-duráveis @pt-br
preferred label: non-durable good @en-gb
preferred label: artículos perecibles @es
preferred label: Biens de consommation @fr
definition: Beni di consumo quali accendini, penne e articoli di cancelleria, stoviglie, orologi, ecc.
definition: ライター、文房具類、食器、腕時計、めがねなど @ja-jp
definition: Ensemble des biens de consommation @fr
definition: Lighters, pens and stationery, tableware, watches, glasses etc @en-gb
definition: Lampen, Stifte und Schreibwaren, Geschirr, Uhren, Brillen etc. @de
definition: Encendedores, lapiceras y artículos de escritorio, vajilla, relojes, lentes, etc. @es
definition: Isqueiros, canetas e artigos de escritório, loiça, relógios, óculos, etc. @pt-br
note: nessuno
in scheme: Subject Code
created: 2000-10-30T12:00:00+00:00
modified: 2010-12-15T17:01:09+00:00
broader: Beni Consumo

Giocattoli
type: Concept
preferred label: toy @en-gb
preferred label: juguete @es
preferred label: brinquedos @pt-br
preferred label: Jouets @fr
preferred label: Spielwaren @de
preferred label: 玩具 @ja-jp
definition: 子供のおもちゃ @ja-jp
definition: Objetos com os quais as crianças brincam. @pt-br
definition: Beni principalmente destinati al gioco dei bambini
definition: Spielzeug für Kinder. @de
definition: Cosas con las que juegan los niños. @es
definition: Objets avec lesquels jouent les enfants @fr
definition: Children's plaything @en-gb
note: nessuno
in scheme: Subject Code
created: 2004-10-13T12:00:00+00:00
modified: 2012-07-10T12:00:00+00:00
broader: Beni Consumo

Banche centrali
type: Concept
preferred label: banco central @pt-br
preferred label: Banques centrales @fr
preferred label: Zentralbank @de
preferred label: 中央銀行 @ja-jp
preferred label: central bank @en-gb
preferred label: bancos centrales @es
definition: 国の銀行。主な業務に金利の設定や通常の銀行との間でお金のやり取りなどがある @ja-jp
definition: Principal banco de un país, el que fija las tazas de interés y realiza la transferencia de fondos entre bancos comerciales. @es
definition: A country's major bank that sets interest rates, and provides transfer of funds between commercial banks @en-gb
definition: Die größte Bank eines Landes, die den Zinssatz festlegt und den Austausch von Geldflüssen zwischen kommerziellen Banken steuert. @de
definition: O principal banco de um país, que fixa taxas de juro e transfere fundos entre bancos comerciais. @pt-pt
definition: Etablissement, généralement public, fixant les taux d'intérêts et règlant les échanges interbancaires @fr
definition: Istituzioni bancarie al centro del sistema finanziario degli Stati, che fissano i tassi di interesse e vigilano sull'attività delle altre banche
note: nessuno
in scheme: Subject Code
created: 2000-10-30T12:00:00+00:00
modified: 2010-12-15T17:01:09+00:00
broader: Macroeconomia

Consumatori
type: Concept
preferred label: consumer issue @en-gb
preferred label: Consommation @fr
preferred label: problemas del consumidor @es
preferred label: consumo @pt-br
preferred label: Verbraucher/Konsument @de
preferred label: 消費者問題 @ja-jp
definition: Questioni come prezzi, inflazione/deflazione, qualità dei beni, considerate al livello di vendita al dettaglio
definition: 小売段階における、価格、インフレ・デフレ、商品の品質などに関する問題 @ja-jp
definition: Sachverhalte wie Preise, Inflation/Deflation, Warenqualität auf der Ebene des Einzelhandels. @de
definition: Assuntos como preços, inflação/deflação, qualidade dos bens, a nível da venda no varejo. @pt-br
definition: Assuntos como preços, inflação/deflação, qualidade dos bens, a nível da venda a retalho. @pt-pt
definition: Aquellos asuntos tales como precios, inflación/moderación, calidad de bienes, a niveles de ventas por menor. @es
definition: Those issues, such as prices, inflation/deflation, quality of goods, at the retail sales level @en-gb
definition: Tous les sujets relatifs à la consommation et aux consommateurs au niveau de la vente au détail @fr
note: nessuno
in scheme: Subject Code
created: 2000-10-30T12:00:00+00:00
modified: 2010-12-15T17:01:09+00:00
broader: Macroeconomia

Mercato emissioni obbligazionarie e titoli
type: Concept
preferred label: mercados de deuda @es
preferred label: mercado de dívida @pt-pt
preferred label: 債権市場 @ja-jp
preferred label: Kapitalmarkt @de
preferred label: Marché obligataire @fr
preferred label: debt market @en-gb
definition: Mercado para negociar instrumentos de dívida como obrigações, certificados de depósito, aprovações bancárias, obrigações do tesouro, notas, promissórias, etc. @pt-pt
definition: Markt für den Handel mit Schuldeninstrumentarien wie Wertpapiere, Banksicherheiten, Bargeld. @de
definition: 債券、CD(譲渡可能定期預金証書)、銀行引受手形、割引債、手形、IOU(借用証書)などの債務証券を売買する市場 @ja-jp
definition: Marchés pour négocier des obligations ou des bons @fr
definition: Market for trading debt instruments such as bonds, CDs, bankers acceptances, T bills, notes, IOUs etc @en-gb
definition: Mercado de intercambio para instrumentos de deuda tales como bonos, aprobaciones bancarias, depositos certificados, etc. @es
definition: Mercato riguardante strumenti di debito come obbligazioni, certificati di deposito, titoli obbligazionari a breve termine, Buoni del tesoro ecc.
note: nessuno
in scheme: Subject Code
created: 2000-10-30T12:00:00+00:00
modified: 2010-12-15T17:01:09+00:00
broader: Macroeconomia

Indici economici
type: Concept
preferred label: Indicateurs économiques @fr
preferred label: 経済指標 @ja-jp
preferred label: economic indicator @en-gb
preferred label: conjuntura @pt-br
preferred label: Konjunktur @de
preferred label: indicadores económicos @es
definition: Certos índices, tais como inventários, movimento dos preços, que indicam se a economia melhora ou piora. @pt-pt
definition: 企業の在庫量のように、経済が向上か減退であるかを示す物価動向の正確な指数 @ja-jp
definition: Certain indexes, such as company inventories, the movement of prices that show whether the economy is improving or declining @en-gb
definition: Indicateurs permettant de mesurer la santé d'une économie @fr
definition: Indici quali il movimento dei prezzi che permettono di valutare lo stato di salute dell'economia, Indicatori economici
definition: Verschiedene Indizes, wie Warenbestände von Unternehmen, Preisbewegungen, die anzeigen, ob die Wirtschaftslage sich verbessert oder verschlechtert. @de
definition: Ciertos indices tales como inventarios de compañias, y el movimiento de precios que indican si la economía mejora o declina. @es
note: nessuno
in scheme: Subject Code
created: 2000-10-30T12:00:00+00:00
modified: 2010-12-15T17:01:09+00:00
broader: Macroeconomia

Mercati emergenti
type: Concept
preferred label: Pays émergents @fr
preferred label: emerging market @en-gb
preferred label: mercados emergentes @es
preferred label: 新興国市場 @ja-jp
preferred label: Schulden/Schwellenland @de
definition: Mercados que lutam para entrar nas economias mundiais e aqueles que requerem ajuda financeira de credores internacionais. @pt-pt
definition: 世界経済に参加するように奮闘し、国際的な金融機関からの財政援助を必要とする市場 @ja-jp
definition: Aquellos mercados que luchan para entrar a las economias mundiales y aquellos que requieren de ayuda financiera de prestamistas internacionales. @es
definition: Mercati dei paesi in via di sviluppo che stanno sforzandosi per entrare nel sistema economico mondiale e di quelli che chiedono aiuti internazionali
definition: Die Märkte die kämpfen, um den weltweiten Wirtschaftsmarkt zu erreichen und die finanzielle Hilfe fordern von internationalen Kreditgebern. @de
definition: Those markets that are struggling to enter the world economies and those requiring financial help from international lenders @en-gb
definition: Pays en développement cherchant à entrer dans le commerce mondial et ceux ayant besoin de l'aide internationale @fr
note: nessuno
in scheme: Subject Code
created: 2000-10-30T12:00:00+00:00
modified: 2010-12-15T17:01:09+00:00
broader: Macroeconomia

Mercato Cambi
type: Concept
preferred label: mercado cambial @pt-br
preferred label: Marché des changes @fr
preferred label: mercados de divisas @es
preferred label: 為替 @ja-jp
preferred label: Devisenmarkt @de
preferred label: foreign exchange market @en-gb
definition: Marché des changes fixant la valeur des devises entre elles @fr
definition: Troca de divisas em todo o mundo, através de mercados regulados. @pt-br
definition: The trading of shekels, dinars, euros dollars etc around the world through regulated markets @en-gb
definition: Der Welthandel mit Schekel, Dinar, Euro, Dollar etc. auf geregelten Märkten. @de
definition: シュケル、ディナール、ユーロなど世界中のお金を、監督された資本市場を通して売買すること @ja-jp
definition: Operazioni sui cambi esteri che determinano ogni giorno il prezzo delle varie valute, ogni divisa rispetto all'altra
definition: El cambio de pesos, dinarios, euros, dólares, etc., alrededor del mundo a través de mercados regulados. @es
note: nessuno
in scheme: Subject Code
created: 2000-10-30T12:00:00+00:00
modified: 2010-12-15T17:01:09+00:00
broader: Macroeconomia

Aiuto pubblico
type: Concept
preferred label: Aide publique @fr
preferred label: government aid @en-gb
preferred label: cooperação económica @pt-pt
preferred label: ayuda estatal @es
preferred label: 政府援助 @ja-jp
preferred label: Subventionen @de
definition: ある国が、通常、他の国に対して、財政その他の支援を行うこと @ja-jp
definition: Supply of financial and other help by one government, usually to another @en-gb
definition: Finanzielle und andere Unterstützung durch eine Regierung, in der Regel Unterstützung einer anderen Regierung. @de
definition: Aide publique, généralement financière, apportée par un pays à un autre @fr
definition: Sovvenzioni, aiuti finanziari o di altro tipo da parte del governo, generalmente nei confronti di un altro
definition: Fornecimento de ajuda financeira ou de outro tipo, de um governo a outro. @pt-pt
definition: Suplir ayuda financiera o de otro tipo, normalmente de un gobierno a otro. @es
note: nessuno
in scheme: Subject Code
created: 2000-10-30T12:00:00+00:00
modified: 2010-12-15T17:01:09+00:00
broader: Macroeconomia

Debito pubblico
type: Concept
preferred label: Dette publique @fr
preferred label: government debt @en-gb
preferred label: Staatsverschuldung @de
preferred label: deuda estatal @es
preferred label: dívida pública @pt-pt
preferred label: 国債 @ja-jp
definition: Les sommes dues par les pouvoirs publics @fr
definition: Quantia que um governo deve em obrigações, serviços ou bens pelos quais não existe dinheiro efetivo. @pt-br
definition: Die Menge, die eine Regierung an festverzinslichen Wertpapieren, Dienstleistungen und Waren schuldet und Leistungen für die sie kein Bargeld zahlen kann. @de
definition: The amount a government owes on bonds, services and for goods and services for which it has no ready cash @en-gb
definition: 国が保有する債券(国債)やサービス、あらかじめお金が用意されていないモノやサービスの総計 @ja-jp
definition: L'ammontare dell'indebitamento che lo Stato ha accumulato verso i propri cittadini o verso l'estero per coprire il suo fabbisogno finanziario
definition: El monto que un gobierno adeuda en bonos, servicios o bienes por los cuales y por los cuales no existe efectivo. @es
note: nessuno
in scheme: Subject Code
created: 2000-10-30T12:00:00+00:00
modified: 2010-12-15T17:01:09+00:00
broader: Macroeconomia

Tassi interesse
type: Concept
preferred label: juros @pt-pt
preferred label: tasas de interés @es
preferred label: Taux d'intérêts @fr
preferred label: Zinsen @de
preferred label: interest rate @en-gb
preferred label: 金利 @ja-jp
definition: Montante de dinheiro que alguém deve pagar quando pede dinheiro emprestado. @pt-pt
definition: Rapporto tra l'interesse pagato ed il capitale prestato
definition: Taux d'intérêt payé par l'emprunteur ou servi au prêteur @fr
definition: The amount of money one must pay to borrow money @en-gb
definition: El monto de dinero que uno debe pagar cuando solicita dinero prestado. @es
definition: お金を借り入れた際に支払わなければならないお金の総計 @ja-jp
definition: Die Menge des Geldes, die jemand für geliehenes Geld zahlen muss. @de
note: nessuno
in scheme: Subject Code
created: 2000-10-30T12:00:00+00:00
modified: 2010-12-15T17:01:09+00:00
broader: Macroeconomia

Istituzioni economiche internazionali
type: Concept
preferred label: instituições econômicas internacionais @pt-br
preferred label: instituições económicas internacionais @pt-pt
preferred label: international economic institution @en-gb
preferred label: Institutions économiques internationales @fr
preferred label: instituciones económicas internacionales @es
preferred label: 国際経済機関 @ja-jp
preferred label: Internationale Wirtschaftsinstitution @de
definition: Institutions internationales telles que le PNUD, la Banque mondiale, l'OMC, etc. @fr
definition: Entidades como a Organização das Nações Unidas para o Desenvolvimento Industrial, o Banco Mundial, a Organização Mundial de Comércio, o Import-Export Bank, etc. @pt-pt
definition: Entities such as UNIDO, World Bank, World Trade Organization, the Import-Expert Bank etc that deals at a world level @en-gb
definition: Entidades tales como UNIDO, Banco Mundial, La Organización de Cambio Internacional, el banco Import'Export, etc,que realizan transaciones a nivel mundial. @es
definition: Organisationen wie die UNIDO, Weltbank, WTO, etc. die auf der ganzen Welt vertreten sind. @de
definition: Istituzioni internazionali quali Banca Mondiale, o WTO , operanti a livello mondiale
definition: 世界レベルで取引を行う、UNIDO(国際連合工業開発機関)、世界銀行、世界貿易機関や、輸入業務に精通した銀行などを指す @ja-jp
note: nessuno
in scheme: Subject Code
created: 2000-10-30T12:00:00+00:00
modified: 2010-12-15T17:01:09+00:00
broader: Macroeconomia

Commercio Estero
type: Concept
preferred label: comercio internacional (extranjero) @es
preferred label: 貿易 @ja-jp
preferred label: Welthandel @de
preferred label: comércio externo @pt-br
preferred label: Commerce International @fr
preferred label: international (foreign) trade @en-gb
definition: Comércio de bens e serviços entre nações. @pt-pt
definition: Handel von Gütern und Dienstleistungen zwischen Ländern. @de
definition: Intercambio de bienes y servicios entre naciones. @es
definition: 国家間のモノとサービスについての取引 @ja-jp
definition: Les échanges commerciaux entre pays @fr
definition: Trade of goods and services between nations @en-gb
definition: Scambio commerciale di beni e servizi tra le nazioni, che si concretizza in importazioni ed esportazioni; Commercio internazionale
note: nessuno
in scheme: Subject Code
created: 2000-10-30T12:00:00+00:00
modified: 2010-12-15T17:01:09+00:00
broader: Macroeconomia

Mercato monetario
type: Concept
preferred label: Financement @fr
preferred label: mercado monetário @pt-br
preferred label: Kreditmarkt @de
preferred label: 貸付市場 @ja-jp
preferred label: loan market @en-gb
preferred label: mercados crediticios @es
definition: Mercado onde o dinheiro está disponível para empréstimos, a determinadas taxas de juro. @pt-pt
definition: Le marché monétaire @fr
definition: Mercato dove la moneta viene venduta e acquistata a determinati tassi di interesse
definition: El mercado donde el dinero esta disponible para prestamos, a un nivel de interes determinado. @es
definition: 一定の利率で資金を借りることが可能な市場 @ja-jp
definition: The market where money is available to borrow, at certain rates of interest @en-gb
definition: Markt, auf dem Geld erhältlich ist zu bestimmten Leihkonditionen. @de
note: nessuno
in scheme: Subject Code
created: 2000-10-30T12:00:00+00:00
modified: 2010-12-15T17:01:09+00:00
broader: Macroeconomia

Organizzazioni economiche
type: Concept
preferred label: Wirtschaftsorganisation @de
preferred label: 経済団体 @ja-jp
preferred label: associações empresariais @pt-pt
preferred label: organizaciones económicas @es
preferred label: economic organization @en-gb
preferred label: Organisations économiques @fr
definition: Wirtschafts-, Industrie- und Handelsunternehmen, Gesellschaften oder andere Gruppen auf dem privaten Sektor. @de
definition: ビジネス、産業,貿易等の関連団体や協会、その他の民間グループ @ja-jp
definition: Associações empresariais, industriais e comerciais, sociedades e outros grupos do setor privado. @pt-br
definition: Associations privées d'entreprises industrielles, commerciales ou de services @fr
definition: Asociaciones de empresas, industriales y de comercio, sociedades y otros organismos del sector privado. @es
definition: Business, industrial and trade associations, societies and other private-sector groups. @en-gb
definition: Associazioni private delle imprese, degli industriali, commerciali o dei servizi
note: nessuno
in scheme: Subject Code
created: 2000-10-30T12:00:00+00:00
modified: 2010-12-15T17:01:09+00:00
broader: Macroeconomia

Fiducia Consumatori
type: Concept
preferred label: confianza del consumidor @es
preferred label: confiança do consumidor @pt-pt
preferred label: 消費者信頼度 @ja-jp
preferred label: Verbraucherschutz @de
preferred label: consumer confidence @en-gb
preferred label: Confiance des consommateurs @fr
definition: 消費者信頼度 @ja-jp
definition: Reports on consumer confidence in the economy. @en-gb
definition: Relatórios sobre a confiança do consumidor na economia. @pt-pt
definition: La confiance des consommateurs dans la croissance de l'économie @fr
definition: Berichte über die Zufriedenheit der Verbraucher mit der Wirtschaft. @de
definition: Studi e Resoconti sulla fiducia dei consumatori rispetto all'andamento dell'economia
definition: Reportes de la confianza del consumidor en la economía. @es
note: nessuno
in scheme: Subject Code
created: 2000-10-30T12:00:00+00:00
modified: 2010-12-15T17:01:09+00:00
broader: Macroeconomia

Dispute commerciali
type: Concept
preferred label: disputa comercial @pt-br
preferred label: 貿易摩擦 @ja-jp
preferred label: Handelsstreitigkeit @de
preferred label: trade dispute @en-gb
preferred label: Conflit commercial @fr
definition: Conflit commercial international sur les barrières douanières, la consitution de monopoles, d'ententes anti-concurrence, etc. @fr
definition: Controversie internazionali riguardanti barriere commerciali, cartelli, vendite sottocosto all'estero.
definition: Internationale Streitigkeiten über Handelsbeschränkungen, Kartelle, Dumping etc. @de
definition: Disputas internacionales sobre barreras de comercio, carteles y dumping. @es
definition: カルテル、ダンピングなど、貿易障害についての国際紛争 @ja-jp
definition: Disputas internacionais sobre barreiras ao comércio, cartéis e dumping. @pt-br
definition: International dispute over trade barriers, cartels, dumping etc. @en-gb
note: nessuno
in scheme: Subject Code
created: 2000-10-30T12:00:00+00:00
modified: 2010-12-15T17:01:09+00:00
broader: Macroeconomia

Inflazione, Deflazione
type: Concept
preferred label: インフレ・デフレ @ja-jp
preferred label: inflación y deflación @es
preferred label: Inflation und Deflation @de
preferred label: inflation and deflation @en-gb
preferred label: inflação @pt-pt
preferred label: Inflation et déflation @fr
definition: Aumento en la cantidad de dinero en circulación y por ende, genera laza en los precios. Deflación,: estrecha política monetaria que causa que los precios sean mas majos. @es
definition: An increase in the amount of money in circulation and thereby a rise in prices; deflation, tighter monetary policy causing lower prices @en-gb
definition: Die Zunahme der Geldmenge, die in Umlauf ist und die daraus resultierenden Preissteigerungen, Deflation, stärkere Geldwertpolitik, um die Preise zu senken. @de
definition: インフレーション：流通しているお金の量の増加と、それによる物価の上昇。デフレーション：物価下落を誘引している金融政策 @ja-jp
definition: *Aumento da quantidade de dinheiro em circulação e consequente subida de preços; deflação: política monetária mais estrita que provoca preços mais baixos.* @pt-pt
definition: Innalzamento o Abbassamento dei prezzi in conseguenza dell'aumento o meno della quantità di denaro in circolazione
definition: Hausse ou baisse des prix conséquence du montant élevé ou bas de l'argent en circulation @fr
note: nessuno
in scheme: Subject Code
created: 2003-04-05T12:00:00+00:00
modified: 2012-07-10T12:00:00+00:00
broader: Macroeconomia

Prezzi
type: Concept
preferred label: preços @pt-br
preferred label: Preis @de
preferred label: 物価 @ja-jp
preferred label: precios @es
preferred label: Prix @fr
preferred label: prices @en-gb
definition: Valor monetário de bens e serviços ou de ações e obrigações. @pt-pt
definition: Der Geldwert von Waren, Dienstleistungen oder festverzinslichen Wertpapiere und Aktien. @de
definition: Valor monetario de bienes, servicios, acciones y bonos. @es
definition: The monetary value of goods, services or stocks and bonds @en-gb
definition: La valeur d'un bien @fr
definition: 商品、サービスあるいは株式･債券の金額的価値 @ja-jp
definition: Valore di merci, servizi o titoli, espresso in termini monetari
note: nessuno
in scheme: Subject Code
created: 2003-04-05T12:00:00+00:00
modified: 2012-07-10T12:00:00+00:00
broader: Macroeconomia

Valute
type: Concept
preferred label: Changes @fr
preferred label: moeda @pt-pt
preferred label: valor cambiario @es
preferred label: 為替水準 @ja-jp
preferred label: currency values @en-gb
preferred label: Währung @de
definition: Valor de una moneda con respecto a otra. @es
definition: Valore di una valuta paragonata ad un'altra
definition: Der aktuelle Wert einer Währung im Verhältnis zu einer anderen. @de
definition: Le cours des monnaies entre elles @fr
definition: 他の通貨と比較して算出された通貨の価値 @ja-jp
definition: Valor de uma moeda em comparação com outra. @pt-pt
definition: The value of one currency as measured against another @en-gb
note: nessuno
in scheme: Subject Code
created: 2003-04-05T12:00:00+00:00
modified: 2012-07-10T12:00:00+00:00
broader: Macroeconomia

Bilancio
type: Concept
preferred label: orçamento @pt-br
preferred label: budgets and budgeting @en-gb
preferred label: Haushaltsplan @de
preferred label: Budget @fr
preferred label: 予算 @ja-jp
preferred label: presupuestos @es
definition: prévision des recettes et dépenses @fr
definition: A method of balancing revenues against expenses @en-gb
definition: Método para medir ingresos y egresos contra los gastos. @es
definition: Methode das Gleichgewicht zwischen Einnahmen und Ausgaben auszubalancieren. @de
definition: 出費に対して収入のバランスをとるための方法 @ja-jp
definition: Método de equilibrar receitas e despesas. @pt-br
definition: Documento riguardante l'andamento di una società fra entrate ed uscite
note: nessuno
in scheme: Subject Code
created: 2003-04-05T12:00:00+00:00
modified: 2012-07-10T12:00:00+00:00
broader: Macroeconomia

Credito, Debito
type: Concept
preferred label: créditos e débitos @pt-pt
preferred label: crédito y débito @es
preferred label: 貸付・債務 @ja-jp
preferred label: Kredit- und Schuldensumme @de
preferred label: Crédit @fr
preferred label: credit and debt @en-gb
definition: Kredit: Geldhöhe, die jemandem zur Verfügung steht, meistens als Leihgabe. Schulden, Geldhöhe, die jemand schuldig ist. @de
definition: Credit: the amount of money available to you, often by loan. Debt, the amount you owe. @en-gb
definition: Crédito: Cantidad de dinero disponible para que Ud., casi siempre como préstamo. Deuda, cantidad que debe. @es
definition: Crédit : l'argent disponible, dette : l'argent dû @fr
definition: Il primo è la somma di denaro disponibile, il secondo è la somma dovuta
definition: Crédito: dinheiro disponível. Débito: dinheiro devido. @pt-br
definition: クレジット：ローン等によって、ある人が入手可能な金額。負債：ある人が借りている金額 @ja-jp
note: nessuno
in scheme: Subject Code
created: 2003-04-05T12:00:00+00:00
modified: 2012-07-10T12:00:00+00:00
broader: Macroeconomia

Prestiti
type: Concept
preferred label: Prêts @fr
preferred label: empréstimos @pt-pt
preferred label: ローン @ja-jp
preferred label: loans @en-gb
preferred label: Kreditgewährung @de
preferred label: préstamos @es
definition: 双方が利率と返却期間について合意の上で行う、個人あるいは団体による一時的な金銭賃借契約 @ja-jp
definition: Acordo por meio do qual um indivíduo ou uma instituição emprestam dinheiro a outro, mediante uma taxa de juro e um período para a sua devolução. @pt-pt
definition: An agreement by one individual or institution to temporarily disperse money to another, with an agreed rate and time for its return @en-gb
definition: Somme erogate da una persona o da un ente ad altri per una durata limitata di tempo e dietro il pagamento di interessi
definition: Acuerdo por medio del cual un individuo o institución se disperse temporalmente dinero a otro, con un tasa acordad para su devolución. @es
definition: Eine Übereinkunft zwischen zwei Einzelpersonen oder Institutionen für einen begrenzten Zeitraum Geld zu verleihen zu einer vereinbarten Rate innerhalb eines Rückzahlungszeitraums. @de
definition: Acordo por meio do qual um indivíduo ou uma instituição emprestam dinheiro a outro, mediante uma taxa de juro e um período para sua devolução. @pt-br
definition: Les sommes prêtées par une personne où une institution pour une durée limitée dans le temps et avec paiement d'intérêts @fr
note: nessuno
in scheme: Subject Code
created: 2003-04-05T12:00:00+00:00
modified: 2012-07-10T12:00:00+00:00
broader: Macroeconomia

Ipoteca
type: Concept
preferred label: hipoteca @es
preferred label: mortgages @en-gb
preferred label: hipotecas @pt-pt
preferred label: 住宅ローン @ja-jp
preferred label: Emprunts immobiliers @fr
preferred label: Hypothek @de
definition: 土地、建物に関わらず、不動産を購入する目的で行う賃借契約。不動産所有者が生活しつつ物件の修繕を行ったり、あるいは維持するためにしばしば用いる金の貸与契約 @ja-jp
definition: Darlehen mit der Absicht Eigentum zu kaufen, sowohl Land als auch Gebäude. Oder für Hausbesitzer um den Besitz zu renovieren oder instand zu halten, meist basierend auf Eigenkapital in Form von Eigentum. @de
definition: Les emprunts immobiliers @fr
definition: Empréstimo de dinheiro para aquisição de uma propriedade, seja terreno ou edifício, ou para os proprietários fazerem a reparação ou a manutenção de propriedades. @pt-br
definition: The loan of money for the purpose of purchasing a property, whether land or building. Or, for homeowners to repair or maintain properties, often based on owner equity in a property @en-gb
definition: Garanzia sopra i beni del debitore o di terzi, che attribuisce al creditore il potere di espropriare i beni recuperando il credito in caso di inadempienza del primo; Prestito per l'acquisto di una proprietà , terreno o edificio.
definition: Garantia real que incide sobre um bem imóvel para obter um empréstimo de dinheiro. @pt-pt
definition: Préstamo de dinero para adquirir una propiedad, ya sea un terreno o edificio, o para que los dueños reparen o mantengan las propiedades, que generalmente se basan en la equidad del dueño en la propiedad @es
note: nessuno
in scheme: Subject Code
created: 2003-04-05T12:00:00+00:00
modified: 2012-07-10T12:00:00+00:00
broader: Macroeconomia

Mercati finanziari
type: Concept
preferred label: Finanzmarkt @de
preferred label: mercado financeiro @pt-pt
preferred label: 金融市場 @ja-jp
preferred label: financial markets @en-gb
preferred label: mercado financiero @es
preferred label: Marchés financiers @fr
definition: Instituições estabelecidas para negociar ações, ou outros títulos financeiros, de empresas ou organizações, podendo também incluir a comercialização de divisas. @pt-br
definition: Mercati dove vengono negoziati titoli e altri documenti finanziari di compagnie o altre società, che possono anche includere il commercio di valute
definition: Institutionen, die mit Anteilen oder anderen Finanzpapieren von Unternehmen oder anderen Organisationen handeln, kann auch Währungsgeschäfte beinhalten. @de
definition: Les marchés financiers où s'échangent les actions des sociétés côtées en bourse @fr
definition: 企業もしくは組織が発行する株式、あるいは他の有価証券を売買するために制定された制度(市場)。通貨取引を含ませることができる @ja-jp
definition: Institutions set up to trade the shares or other financial paper of companies or other organizations, can also include currency trading @en-gb
definition: Instituciones que negocian acciones o cualquier otro titulo de valor de compañías u organizaciones, puedan también incluir el intercambio de divisas. @es
note: nessuno
in scheme: Subject Code
created: 2003-04-05T12:00:00+00:00
modified: 2012-07-10T12:00:00+00:00
broader: Macroeconomia

Mercati Materie prime
type: Concept
preferred label: mercados de produtos de base @pt-pt
preferred label: mercado de materias primas @es
preferred label: commodity markets @en-gb
preferred label: 商品市場 @ja-jp
preferred label: Warenbörse @de
preferred label: Marchés des matières premières @fr
definition: Troca ou comercialização de matérias-primas como algodão, petróleo, carvão, metais, etc. @pt-br
definition: 物々交換、あるいは綿、石油、石炭、金属などの商品の取引を行う市場 @ja-jp
definition: Scambio o commercio di beni come cotone, petrolio, carbone, metalli, ecc...
definition: Tauschgeschäft und Verkauf von Waren, wie Baumwolle, Öl, Kohle, Metalle etc. @de
definition: Les marchés des matières premières @fr
definition: The bartering or trading of goods such as cotton, oil, coal, metals, etc @en-gb
definition: Intercambio de bienes como algodón, petróleo, cobre, metales, etc. @es
note: nessuno
in scheme: Subject Code
created: 2003-04-05T12:00:00+00:00
modified: 2012-07-10T12:00:00+00:00
broader: Macroeconomia

Investimenti
type: Concept
preferred label: investimentos @pt-pt
preferred label: 投機 @ja-jp
preferred label: Investition @de
preferred label: investments @en-gb
preferred label: Investissements @fr
preferred label: inversiones @es
definition: Compra especulativa de instrumentos corporativos, matérias-primas, divisas, etc. @pt-pt
definition: Acquisti a fini speculativi di strumenti societari, materie prime, valute o parti di essi
definition: Spekulative Käufe von kollektiven Maschinen, Rohstoffen, Währungen oder Teilen davon. @de
definition: Speculative purchases of corporate instruments, of commodities, currencies, or parts thereof @en-gb
definition: Les investissements spéculatifs @fr
definition: Especulativa compra de instrumentos empresariales como materias primas, divisas, etc. @es
definition: 企業の器材、商品、通貨などを投機的に購入すること @ja-jp
note: nessuno
in scheme: Subject Code
created: 2003-04-05T12:00:00+00:00
modified: 2012-07-10T12:00:00+00:00
broader: Macroeconomia

Azioni
type: Concept
preferred label: Aktien @de
preferred label: ações @pt-pt
preferred label: 株式 @ja-jp
preferred label: acciones @es
preferred label: stocks @en-gb
preferred label: Parts de société @fr
definition: Documento empresarial que otorga a un individuo un derechos de propiedad a una determinada parte de las ganancias de una empresa. @es
definition: Les parts de société @fr
definition: Certificati che rappresentano una quota di capitale sociale di una spa e danno fra l'altro al proprietario il diritto ad una quota degli utili
definition: Documento empresarial que outorga a um indivíduo os direitos de propriedade de uma determinada parte dos ganhos de uma empresa. @pt-br
definition: Corporate paper that gives an individual an ownership right to a part of a company's earnings @en-gb
definition: Firmenpapier, das einer Einzelperson das Eigentumsrecht auf einen Gewinnanteil verleiht. @de
definition: 企業の所得の一部に個人的な所有権を与える、企業が発行する有価証券 @ja-jp
note: nessuno
in scheme: Subject Code
created: 2003-04-05T12:00:00+00:00
modified: 2012-07-10T12:00:00+00:00
broader: Macroeconomia

Obbligazioni
type: Concept
preferred label: bonds @en-gb
preferred label: 債券 @ja-jp
preferred label: Anleihe @de
preferred label: Obligations @fr
preferred label: bonos @es
preferred label: obrigações @pt-pt
definition: Les obligations, emprunts à taux fixe et à durée limitée émis par l'Etat ou des entreprises @fr
definition: Firmen- oder Regierungspapier, das die Leihgabe von Geld zu einem festgelegten Preis und Zeitraum für diese Firma oder Regierung auszeichnet. @de
definition: Documento empresarial ou governamental que representa o empréstimo de dinheiro, a uma taxa de juro fixa e por determinado período de tempo, a uma empresa ou governo @pt-br
definition: Documento empresarial ou governamental que representa o empréstimo de dinheiro, a uma taxa de juro fixa e por determinado período de tempo, a uma empresa ou governo. @pt-pt
definition: Corporate or governmental paper representing the loan of money at a fixed rate and for a fixed time to that company or government @en-gb
definition: Documento empresarial o gubernamental que representa el préstamo de dinero a una tasa de interés ya acordada que se le presta a una compañía o gobierno. @es
definition: 固定利率、固定期間で企業や政府に対してお金を貸与していることを表す、企業や政府が発行する有価証券 @ja-jp
definition: Certificati societari o di governo che rappresentano il prestito di denaro ad un tasso fisso e per un dato tempo
note: nessuno
in scheme: Subject Code
created: 2003-04-05T12:00:00+00:00
modified: 2012-07-10T12:00:00+00:00
broader: Macroeconomia

Fondi mutuabili
type: Concept
preferred label: Fonds d'investissement @fr
preferred label: 投資信託 @ja-jp
preferred label: Investmentfonds @de
preferred label: fundos de investimento @pt-br
preferred label: mutual funds @en-gb
preferred label: fondos mutuales @es
definition: 成長性、収益性、安全性などを考慮した株式もしくは債券、あるいはこれらの組み合わせに対する共同出資。日本では「mutual fund(ミューチュアルファンド)」は会社型投資信託の意 @ja-jp
definition: Pools von Anteilen oder festverzinslichen Wertpapieren zum Verkauf, oft gesammelt mit Investitionsabsicht in Wachstum, Einkommen oder Sicherheit. @de
definition: Fonds mutuels d'investissement, paniers d'actions où d'obligations @fr
definition: Fondo de acciones o bonos a la venta generalmente agrupadas por la intención de invertir, tal como crecimiento de ingreso y seguridad. @es
definition: Capitali a disposizione per essere prestati, spesso raggruppati per un investimento; Fondi d'Investimento
definition: Fundo de ações ou obrigações para venda agrupadas por intenção de investimento, tal como crescimento de rendimento ou segurança. @pt-br
definition: Pools of shares or bonds for sale often grouped by investment intention, such as growth, income or security @en-gb
note: nessuno
in scheme: Subject Code
created: 2003-04-05T12:00:00+00:00
modified: 2012-07-10T12:00:00+00:00
broader: Macroeconomia

Titoli derivati
type: Concept
preferred label: 金融派生商品 @ja-jp
preferred label: derivative securities @en-gb
preferred label: Produits dérivés @fr
preferred label: derivados financeiros @pt-pt
preferred label: titulos negociables @es
preferred label: Derivate @de
definition: Instrumentos financeiros como futuros, intercâmbios e opções, usados na gestão de investimentos de risco, e cujas características e valor dependem das características e valor de um instrumento subjacente, como uma matéria-prima, obrigação ou moeda. @pt-br
definition: Instruments financiers utilisés dans la gestion à terme des investissements risqués @fr
definition: Financial instruments such as futures, swaps and options, used for risk management, whose characteristics and value depend upon the characteristics and value of an underlying instrument, such as a commodity, bond, equity or currency. @en-gb
definition: 商品、債券、資本、もしくは通貨の特性や価値を基にして創られた金融商品。先物、スワップ、オプションなどを含む。プロの投資家が扱う @ja-jp
definition: Strumenti finanziari, utilizzati nella gestione a termine di investimenti a rischio
definition: Instrumentos financieros cuyas características y valor dependen del valor de un instrumento adyacente, como una materia prima, bono o moneda . ejemplo de derivados que incluyen mercado de futuros, intercambios y opciones. Los inversionistas profesio @es
definition: Finanzinstrumente, wie Futures, Swaps und Optionen, die für das Risikomanagement genutzt werden und deren Wert sich nach den Kursschwankungen oder den Preiserwartungen von anderen Investments richten, wie Rohstoffe, festverzinsliche Wertpapiere, Dividende. @de
note: nessuno
in scheme: Subject Code
created: 2003-04-05T12:00:00+00:00
modified: 2012-07-10T12:00:00+00:00
broader: Macroeconomia

Importazioni
type: Concept
preferred label: importações @pt-pt
preferred label: importaciones @es
preferred label: Import @de
preferred label: 輸入 @ja-jp
preferred label: imports @en-gb
preferred label: Importations @fr
definition: Alles was im Ausland erworben und zum Wiederverkauf ins Land gebraucht wurde. @de
definition: What is bought abroad and brought into a country for resale @en-gb
definition: Beni e servizi comprati all'estero per poi essere commercializzati in un paese
definition: Aquilo que é comprado no estrangeiro e que é trazido para um país para ser revendido. @pt-pt
definition: 外国で買い付け、国内で再販すること @ja-jp
definition: Es lo que se compra y se trae el país para volverlo a vender. @es
definition: Les biens et services achetés à l'étranger pour être commercialisés dans un pays @fr
note: nessuno
in scheme: Subject Code
created: 2003-04-05T12:00:00+00:00
modified: 2012-07-10T12:00:00+00:00
broader: Macroeconomia

Esportazioni
type: Concept
preferred label: exportações @pt-br
preferred label: 輸出 @ja-jp
preferred label: Exportations @fr
preferred label: exports @en-gb
preferred label: Export @de
preferred label: exportaciones @es
definition: 自国で生産/製造された後、他の地域に配送し、販売すること @ja-jp
definition: Es lo que se produce y se fabrica en su propio país, y se envía y vende en otro lugar. @es
definition: Aquilo que é produzido ou manufaturado num país e é enviado para fora para ser vendido. @pt-pt
definition: Beni prodotti e/o confezionati in un paese per poi essere inviati e venduti in altri paesi; Merci nazionali destinate all'estero
definition: What is produced or manufactured in your country and sent and sold elsewhere @en-gb
definition: Aquilo que é produzido ou manufaturado em um país e é enviado para fora para ser vendido. @pt-br
definition: Alles was im eigenen Land hergestellt und produziert und überallhin verkauft und versendet wird. @de
definition: La vente et le transport à l'étranger des produits nationaux @fr
note: nessuno
in scheme: Subject Code
created: 2003-04-05T12:00:00+00:00
modified: 2012-07-10T12:00:00+00:00
broader: Macroeconomia

Accordi commerciali
type: Concept
preferred label: acordos comerciais @pt-pt
preferred label: 貿易協定 @ja-jp
preferred label: trade agreements @en-gb
preferred label: acuerdos comerciales @es
preferred label: Accords commerciaux @fr
preferred label: Handelsabkommen @de
definition: Accordi fra nazioni o gruppi di nazioni riguardanti reciproci privilegi nell'import-export
definition: Acuerdo el gobierno entre países para la compra y venta de bienes y servicios. @es
definition: 商品やサービスの販売や購入に関する政府間協定 @ja-jp
definition: Acordo governamental entre países para a compra e venda de bens e serviços. @pt-pt
definition: Verträge zwischen Ländern auf Regierungsebene für den An- und Verkauf von Gütern und Dienstleistungen. @de
definition: Les accords commerciaux entre pays pour l'achat et la vente de biens et services @fr
definition: Government level agreements between countries for the sale and purchase of goods and services @en-gb
note: nessuno
in scheme: Subject Code
created: 2003-04-05T12:00:00+00:00
modified: 2012-07-10T12:00:00+00:00
broader: Macroeconomia

Politica commerciale
type: Concept
preferred label: política comercial @pt-br
preferred label: Handelsbeschränkung / Embargo @de
preferred label: 貿易政策 @ja-jp
preferred label: Politique commerciale @fr
preferred label: trade policy @en-gb
definition: Les décicions gouvernementales sur le type de bien et services pouvant être ou non exportés et importés ainsi que sur les tarifs @fr
definition: Governmental decisions on tariffs, shipping, embargoes, and the types or kinds of goods and services to be imported and exported @en-gb
definition: Decisiones del gobierno en relación a aranceles, embarques, embargos, y clases y tipos de bienes y servicios que importan y exportan. @es
definition: Regierungsentscheidungen über Tarife, Verschiffung, Embargos und welche Güter und Dienstleistungen importiert und exportiert werden dürfen. @de
definition: Decisões governamentais em relação a tarifas, embarque, embargos e os tipos de bens e serviços que são importados e exportados. @pt-br
definition: 関税、出荷、通商停止、及び輸出入する商品やサービスの種類に関する政府決定 @ja-jp
definition: Attività di intervento dello Stato nei rapporti economici con altri stati: decisioni su tariffe, spedizioni, embarghi, ecc.
note: nessuno
in scheme: Subject Code
created: 2003-04-05T12:00:00+00:00
modified: 2012-07-10T12:00:00+00:00
broader: Macroeconomia

Imprese
type: Concept
preferred label: Unternehmen @de
preferred label: Entrepises @fr
preferred label: empresas @es
preferred label: business enterprises @en-gb
preferred label: 企業 @ja-jp
definition: Affaire ou entreprise créé dans le but de faire des bénéfices en créant ou en vendant un produit ou un service @fr
definition: Imprese con scopo di lucro creando e vendendo un prodotto o un servizio
definition: Organizaciones que generalmente están dirigidas a beneficencia creando y vendiendo un producto o servicio. @es
definition: Zusammenschlüsse, die ein Produkt oder Dienstleistung anbieten, mit der Absicht diese gewinnbringend zu verkaufen. @de
definition: Organizations set up usually for profit-making purposes by creating and selling a product or service @en-gb
definition: Organizações estabelecidas com fins lucrativos, mediante a criação e venda de um produto ou serviço. @pt-br
definition: 主に、製品やサービスを生み出したり、販売することによって利益を得ることを目的として設立された組織 @ja-jp
note: nessuno
in scheme: Subject Code
created: 2003-04-05T12:00:00+00:00
modified: 2012-07-10T12:00:00+00:00
broader: Macroeconomia

Tariffe
type: Concept
preferred label: tarifa @pt-pt
preferred label: Zoll @de
preferred label: tariff @en-gb
preferred label: Droits de douane @fr
preferred label: tarifas @es
preferred label: 関税 @ja-jp
definition: Taxes imposées aux marchandises importées ou exportées, souvent punitives @fr
definition: Gebühren, die auf importierte und exportierte Waren erhoben werden, meist strafend. @de
definition: Taxas impostas a bens importados ou exportados, muitas vezes punitivas. @pt-pt
definition: Aranceles agregados a los bienes importados o exportados, frecuentemente punible. @es
definition: Tasse imposte su beni importati o esportati
definition: Fees placed on goods imported or exported, often punitive @en-gb
definition: 輸出や輸入の際に商品に(しばしば厳しく)課せられる手数料 @ja-jp
note: nessuno
in scheme: Subject Code
created: 2004-10-13T12:00:00+00:00
modified: 2012-07-10T12:00:00+00:00
broader: Macroeconomia

Bilancia commerciale
type: Concept
preferred label: 貿易収支 @ja-jp
preferred label: Balance commerciale @fr
preferred label: balança comercial @pt-br
preferred label: trade balance @en-gb
preferred label: balanza de cambios @es
preferred label: Handelsbilanz @de
definition: la diferencia entre el valor financiero de las importaciones y exportaciones. @es
definition: Differenza in valore finanziario tra le importazioni e le esportazioni
definition: Diferença entre o valor financeiro de importações e exportações. @pt-pt
definition: Die finanzielle Differenz zwischen Import und Export in Bezug auf den Warenwert. @de
definition: Différence entre la valeur financière des importations et des exportations @fr
definition: 輸入と輸出の金融価値の差異 @ja-jp
definition: The difference between the financial value of imports and exports @en-gb
note: nessuno
in scheme: Subject Code
created: 2004-10-13T12:00:00+00:00
modified: 2012-07-10T12:00:00+00:00
broader: Macroeconomia

Energia
type: Concept
preferred label: energia @pt-pt
preferred label: Energie @de
preferred label: Marché énergie @fr
preferred label: energía @es
preferred label: energy @en-gb
preferred label: エネルギー取引所 @ja-jp
definition: Stories related to energy trading and markets @en-gb
definition: Artikel im Kontext von Energiehandel und Energiemarkt. @de
definition: Les histoires liées au marché et à la vente d'énergie @fr
definition: エネルギー貿易と市場に関連する記事 @ja-jp
definition: Histórias relativas ao comércio e mercados energéticos. @pt-br
definition: Historias relacionadas al comercio y mercados energéticos @es
definition: Mercati per il commercio dell'energia
note: nessuno
in scheme: Subject Code
created: 2000-10-30T12:00:00+00:00
modified: 2010-12-15T17:01:09+00:00
broader: Mercati, Borse

Metallo
type: Concept
preferred label: Métaux @fr
preferred label: metal @pt-br
preferred label: Metall @de
preferred label: metales @es
preferred label: 金属取引所 @ja-jp
definition: 銅、アルミ、鋼鉄、亜鉛などの卑金属の取引に関する市場 @ja-jp
definition: Markets for trading base metals such as copper, aluminium, steel, zinc etc @en-gb
definition: Mercados para comercializar metais básicos como cobre, alumínio, aço, zinco, etc. @pt-br
definition: Mercati per il commercio dei metalli come rame, alluminio, ferro, zinco, ecc...
definition: Mercados para transar metales básicos como cobre, aluminio, acero, cinc, etc. @es
definition: Les bourses aux métaux : cuivre, aluminium, fer, zinc, etc. @fr
definition: Märkte um Metalle wie Kupfer, Aluminium, Stahl und Zink etc. zu handeln. @de
note: nessuno
in scheme: Subject Code
created: 2000-10-30T12:00:00+00:00
modified: 2010-12-15T17:01:09+00:00
broader: Mercati, Borse

Titoli, Valori mobiliari
type: Concept
preferred label: bolsa @pt-br
preferred label: Wertpapier @de
preferred label: valores @es
preferred label: securities @en-gb
preferred label: 証券取引所 @ja-jp
preferred label: Bourse @fr
definition: Märkte um festverzinsliche Wertpapiere und Aktien zu handeln. @de
definition: Mercati per il commercio dei titoli
definition: Mercados para comercializar tipos de documentos como ações e obrigações. @pt-pt
definition: 株式や債券などの会社が発行する様々な種類の有価証券を取引する市場 @ja-jp
definition: Mercados para transar documentos tales como acciones y bonos. @es
definition: Markets for trading types of company paper such as stocks and bonds @en-gb
definition: Les bourses de titres où s'échangent actions et obligations @fr
note: nessuno
in scheme: Subject Code
created: 2000-10-30T12:00:00+00:00
modified: 2010-12-15T17:01:09+00:00
broader: Mercati, Borse

Beni non durevoli
type: Concept
preferred label: soft commodities @pt-pt
preferred label: Bonds und Futures/Obligation @de
preferred label: soft commodity @en-gb
preferred label: Denrées ?????????? @fr
preferred label: 商品取引所 @ja-jp
preferred label: productos textiles @es
definition: Transação de matérias-primas como algodão, açúcar, sorgo, soja, etc. @pt-pt
definition: Commercio riguardante prodotti come cotone, zucchero, sorgo, soia, ecc...
definition: Les bourses de matières premières telles que le coton, le sucre, etc. @fr
definition: Transacciones de surtidos tales como algodón, azucar, granos, legumbres, etc. @es
definition: Handel mit Rohstoffen wie Baumwolle, Zucker, Zuckerrohr, Sojabohnen etc. @de
definition: Trading in commodities such as cotton, sugar, sorghum, soybeans etc. @en-gb
definition: 綿、砂糖、もろこし、大豆など金属以外の取引 @ja-jp
note: nessuno
in scheme: Subject Code
created: 2000-10-30T12:00:00+00:00
modified: 2010-12-15T17:01:09+00:00
broader: Mercati, Borse

Pubblicità
type: Concept
preferred label: Publicité @fr
preferred label: publicidade @pt-pt
preferred label: Werbung @de
preferred label: advertising @en-gb
preferred label: publicidad @es
preferred label: 広告 @ja-jp
definition: Metodo de promoción de bienes y servicios al consumidor, a traves de videos, gráficos, textos, etc. @es
definition: Métodos de promoção de bens e serviços junto do consumidor, através de vídeos, imagens, textos, etc. @pt-br
definition: Metodi per la promozione di beni e/o servizi al consumatore attraverso video, grafici, testi stampa, ecc...
definition: 映像、グラフィック、印刷物などを通じて、消費者に対してモノとサービスの販売を促進する手段 @ja-jp
definition: Les méthodes pour promouvoir des biens et services auprès des consommateurs @fr
definition: Methods of promoting goods and service to consumers through video, graphics, print text etc @en-gb
definition: Methoden Waren und Dienstleistungen dem Kunden anzupreisen mit Hilfe von Videos, Grafiken, Text etc. @de
note: nessuno
in scheme: Subject Code
created: 2000-10-30T12:00:00+00:00
modified: 2010-12-15T17:01:09+00:00
broader: Media

Editoria
type: Concept
preferred label: mercado livreiro @pt-pt
preferred label: édition @fr
preferred label: 出版 @ja-jp
preferred label: libros @es
preferred label: Bücher/Verlag @de
preferred label: book @en-gb
definition: フィクション、ノンフィクションにかかわらず、装丁(製本)されたものを、製作したり売ったりする商売 @ja-jp
definition: La production et la vente de textes écrits qu'ils soient de fiction ou non @fr
definition: Negócio de produção e venda de publicações, seja de ficção ou de não ficção. @pt-pt
definition: The business of producing and selling bound media, whether fiction or non-fiction @en-gb
definition: Produzione e vendita di mezzi di comunicazione stampati
definition: EL negocio de producir y vender publicaciones, ya sean de ficción o no ficción. @es
definition: Das Geschäft gebundene Medien zu produzieren und zu verkaufen, sowohl Belletristik als auch Sachliteratur. @de
note: nessuno
in scheme: Subject Code
created: 2000-10-30T12:00:00+00:00
modified: 2010-12-15T17:01:09+00:00
broader: Media

Industria cinematografica
type: Concept
preferred label: cine @es
preferred label: cinema industry @en-gb
preferred label: indústria cinematográfica @pt-pt
preferred label: Filmindustrie @de
preferred label: 映画産業 @ja-jp
preferred label: Cinéma @fr
definition: Il cinema come industria
definition: Histórias relativas ao negócio do cinema. @pt-pt
definition: Film als Geschäft. @de
definition: 映画のビジネスに関連する記事 @ja-jp
definition: The business of cinema @en-gb
definition: Historias relacionadas al negocio del cine @es
definition: Les histoires liées à l'industrie du film @fr
note: nessuno
in scheme: Subject Code
created: 2000-10-30T12:00:00+00:00
modified: 2010-12-15T17:01:09+00:00
broader: Media

Agenzie di stampa
type: Concept
preferred label: Agences de presse @fr
preferred label: Nachrichtenagentur @de
preferred label: agencias noticiosas @es
preferred label: news agency @en-gb
preferred label: agências noticiosas @pt-br
preferred label: 通信社 @ja-jp
definition: Kommerzielle Agenturen, die nachrichtenrelevante Ereignisse aufbereiten und verbreiten durch Presse, Fernsehen, Video oder elektronische Medien. @de
definition: Agenzie d'informazione che producono e diffondono notizie attraverso supporti di vario genere: stampa, trasmissioni, video o mezzi elettronici, ecc.
definition: Agencias comerciales para la producción y distribución de eventos noticiosos a traves de texto, transmisión, video o medios electrónicos. @es
definition: Agências comerciais que produzem e distribuem eventos noticiosos por escrito, por rádio ou televisão, por vídeo ou por meios eletrônicos. @pt-br
definition: Commercial agencies for production and distribution of newsworthy events through print, broadcast, video or electronic media @en-gb
definition: Sociétés commerciales produisant et hiérarchisant l'information et la distribuant par écrit, par radio, par vidéo ou par média électronique @fr
definition: Agências comerciais que produzem e distribuem eventos noticiosos por escrito, por rádio ou televisão, por vídeo ou por meios eletrónicos. @pt-pt
definition: 印刷、放送、ビデオあるいは電子メディアを使って、報道価値のある出来事の著作および配布を行う商業機関 @ja-jp
note: nessuno
in scheme: Subject Code
created: 2000-10-30T12:00:00+00:00
modified: 2010-12-15T17:01:09+00:00
broader: Media

Quotidiani e periodici
type: Concept
preferred label: Presse @de
preferred label: newspaper and magazine @en-gb
preferred label: imprensa @pt-pt
preferred label: diarios y revistas @es
preferred label: Journaux et périodiques @fr
preferred label: 新聞・雑誌 @ja-jp
definition: Negócio de produção de meios escritos ou gráficos impressos para a distribuição periódica de notícias. @pt-pt
definition: Das Geschäft mit gebundenen und ungebundenen gedruckten Papiermaterial zur regelmäßigen Verbreitung von Nachrichten. @de
definition: 様々な記事を定期的に配信するために、印刷された紙製品を、製本するかどうかに関わらず、生産する商売 @ja-jp
definition: Pubblicazioni d'informazione a stampa a cadenza giornaliera o periodica
definition: El negocio de producir medios escritos o gráficos impresos, para las distribución periodica de noticias. @es
definition: Publications d'informations, imprimées et le plus souvent illustrées, à parution périodiques @fr
definition: The business of producing bound and unbound printed paper products for periodic distribution of news items @en-gb
note: nessuno
in scheme: Subject Code
created: 2000-10-30T12:00:00+00:00
modified: 2010-12-15T17:01:09+00:00
broader: Media

On line
type: Concept
preferred label: Online @de
preferred label: en línea @es
preferred label: Services en ligne @fr
preferred label: online @en-gb
preferred label: オンラインニュース @ja-jp
definition: Das Geschäft mit der Verbreitung von Nachrichten und Informationen über Computernetzwerke für den öffentlichen Gebrauch. @de
definition: The business of distributing news and information through computer networks for public consumption @en-gb
definition: Negócio de distribuição de notícias e informação através de redes de computadores, para consumo público. @pt-br
definition: El negocio de distribuir noticias e informaciones mediante una red de computadores, para el uso público. @es
definition: 一般消費者向けのコンピュータ・ネットワークを通じて、ニュースや情報を提供する商売 @ja-jp
definition: La distribution au public d'informations et de nouvelles par les réseaux informatiques @fr
definition: Distribuzione al pubblico di notizie e informazioni attraverso Internet
note: nessuno
in scheme: Subject Code
created: 2000-10-30T12:00:00+00:00
modified: 2010-12-15T17:01:09+00:00
broader: Media

Pubbliche Relazioni
type: Concept
preferred label: relações públicas @pt-br
preferred label: 広報 @ja-jp
preferred label: public relation @en-gb
preferred label: Relations publiques @fr
preferred label: relaciones públicas @es
preferred label: Öffentlichkeitsarbeit @de
definition: Tätigkeit Produkte und Dienstleistungen anzupreisen durch Werbekampagnen, und/oder Kundenkontakt oder Nachrichtenverbreitung. @de
definition: The job of promoting products and services through advertising campaigns and/or through person-to-person contact or through news releases @en-gb
definition: Trabajo en el cual se promocionan productos y servicios mediante campañas de avisos y/o a persona a persona, o a través de comunicados de prensa. @es
definition: La promotion de produits et de services par des campagnes de publicités, des contacts personnels et des communiqués de presse @fr
definition: Promoção de produtos e serviços através de campanhas publicitárias e/ou pessoa a pessoa, ou através de releases. @pt-br
definition: 広告キャンペーンや、個人対個人の接触を通じて、あるいはニュース・リリースを通じて、製品やサービスを促進する仕事 @ja-jp
definition: Attività di promozione di prodotti e servizi attraverso campagne pubblicitarie, contatti personali, comunicati stampa
definition: Promoção de produtos e serviços através de campanhas publicitárias e/ou pessoa a pessoa, ou através de comunicados de imprensa. @pt-pt
note: nessuno
in scheme: Subject Code
created: 2000-10-30T12:00:00+00:00
modified: 2010-12-15T17:01:09+00:00
broader: Media

Industria Radiofonica
type: Concept
preferred label: radio @es
preferred label: rádio @pt-pt
preferred label: Radioproduktion @de
preferred label: radio industry @en-gb
preferred label: Industrie de la Radio @fr
preferred label: ラジオ局 @ja-jp
definition: Les histoires liés à l'industrie de la radio @fr
definition: Radio als Geschäft @de
definition: Histórias relativas ao negócio da rádio. @pt-br
definition: Business of radio @en-gb
definition: ラジオのビジネスに関連する記事 @ja-jp
definition: La radio come industria
definition: Historias relacionadas al negocio de la radio @es
note: nessuno
in scheme: Subject Code
created: 2000-10-30T12:00:00+00:00
modified: 2010-12-15T17:01:09+00:00
broader: Media

Servizi via satellite e via cavo
type: Concept
preferred label: satellite and cable service @en-gb
preferred label: serviços de satélite e de cabo @pt-pt
preferred label: servicios satelitales y de cable @es
preferred label: Satellit und Kabelservice @de
preferred label: 衛星・ＣＡＴＶ局 @ja-jp
preferred label: Câble et satellite @fr
definition: Transmissão de notícias, entretenimento e informação via satélite ou serviços de televisão a cabo. @pt-br
definition: La transmission de l'information via les services de télévision par câble ou sattellite @fr
definition: Transmissão de notícias, entretenimento e informação via satélite ou serviços de televisão por cabo. @pt-pt
definition: The business of transmitting of news, entertainment and information via satellite or cable television services @en-gb
definition: El negocio de transmitir noticias, entretenimiento e información via satélite o servicio televisivo de cable. @es
definition: 衛星またはケーブルテレビのサービスを使って、ニュース、娯楽および情報を送信するビジネス @ja-jp
definition: Trasmissione delle informazioni per mezzo di servizi televisivi via cavo o via satellite
definition: Das Geschäft mit der Übertragung von Nachrichten, Unterhaltung und Informationen durch Satelliten oder Kabelfernsehen. @de
note: nessuno
in scheme: Subject Code
created: 2000-10-30T12:00:00+00:00
modified: 2010-12-15T17:01:09+00:00
broader: Media

Industria televisiva
type: Concept
preferred label: television industry @en-gb
preferred label: Fernsehproduktion @de
preferred label: テレビ局 @ja-jp
preferred label: televisão @pt-br
preferred label: Industrie de la télévision @fr
preferred label: televisión @es
definition: Business of television @en-gb
definition: Histórias relativas ao negócio da televisão. @pt-br
definition: Les histoires liées à l'industrie de la télévision @fr
definition: La televisione come industria
definition: テレビのビジネスに関連する記事 @ja-jp
definition: Historias relacionadas al negocio de la televisión @es
definition: Fernsehen als Geschäft. @de
note: nessuno
in scheme: Subject Code
created: 2000-10-30T12:00:00+00:00
modified: 2010-12-15T17:01:09+00:00
broader: Media

Industria musicale
type: Concept
preferred label: Industrie musicale @fr
preferred label: mercado discográfico @pt-pt
preferred label: 音楽産業 @ja-jp
preferred label: industria musical @es
preferred label: music industry @en-gb
preferred label: Musikindustrie @de
definition: Recording, production, marketing of music @en-gb
definition: Gravação, produção e marketing de música. @pt-br
definition: Enregistrement, production et marketing musicaux @fr
definition: La musica come industria: registrazione, produzione, commercio, ecc.
definition: 楽曲の録音、制作、マーケティング @ja-jp
definition: Aufnahme, Produktion, Marketing von Musik. @de
definition: Grabación, producción y mercadeo de música. @es
note: nessuno
in scheme: Subject Code
created: 2004-04-22T12:00:00+00:00
modified: 2012-07-10T12:00:00+00:00
broader: Media

Aerospaziale
type: Concept
preferred label: aeroespacial @es
preferred label: 航空宇宙 @ja-jp
preferred label: aerospace @en-gb
preferred label: Flug- und Raumfahrttechnik @de
preferred label: Industrie aéronautique et de l' espace @fr
definition: Companies that assemble or manufacture components for airplanes and space ships. @en-gb
definition: Companhias que montam ou fabricam componentes para aviões e naves espaciais. @pt-pt
definition: Compagnies qui assemblent ou fabriquent des composants pour des avions ou des engins spatiaux @fr
definition: Produzione o montaggio di componenti per aeroplani e/o astronavi
definition: Firmen, die Komponenten für Flugzeuge und die Raumfahrt zusammenbauen oder herstellen. @de
definition: 航空機や宇宙船の部品を組み立てたり製造したりする会社 @ja-jp
definition: Compañias que emsamblan o producen componentes para aviones o naves espaciales. @es
note: Explanation added in V 15 @fr
note: nessuno
in scheme: Subject Code
created: 2004-10-13T12:00:00+00:00
modified: 2012-07-10T12:00:00+00:00
broader: Metallurgia e Meccanica

Automobilistica
type: Concept
preferred label: automotive equipment @en-gb
preferred label: Industrie automobile @fr
preferred label: Automobilindustrie @de
preferred label: automóvel @pt-br
preferred label: 自動車部品 @ja-jp
preferred label: equipos automotrices @es
definition: Companies that produce components for automobiles @en-gb
definition: Firmen die Komponenten für Autos herstellen. @de
definition: Produzione di componenti per automobili
definition: Compañias que producen componentes para automoviles. @es
definition: 自動車用部品を生産する会社 @ja-jp
definition: Compagnies qui produisent des composants pour les automobiles @fr
definition: Companhias que fabricam peças para automóveis. @pt-br
note: Explanation added in V 15 @es
note: nessuno
in scheme: Subject Code
created: 2004-10-13T12:00:00+00:00
modified: 2012-07-10T12:00:00+00:00
broader: Metallurgia e Meccanica

Armamenti
type: Concept
preferred label: Rüstung @de
preferred label: Industrie de défense @fr
preferred label: equipos de defensa @es
preferred label: 防衛産業 @ja-jp
preferred label: indústria de defesa @pt-pt
preferred label: defence equipment @en-gb
definition: Hersteller von Gewehren, Kanonen, Panzern und Schiffen etc. für militärische und nicht-militärische Sicherheitsdienste. @de
definition: Fabricantes de armas, tanques, canhões, barcos, etc. para os serviços de proteção militar e não militar. @pt-pt
definition: Fabricantes de armas, tanques, cañones, navíos, etc, para los servicios de protección militares y no militares. @es
definition: Manufacturers of guns, tanks, cannons, ships etc for the military and non-military protection services @en-gb
definition: Fabricants d'armes et de matériel militaire ou de protection @fr
definition: Produzione di fucili, carri armati, cannoni, navi ecc., per i servizi di protezione militare e non
definition: 軍用、非軍用を問わず、防御サービス用の船、大砲、戦車、銃器などを製造するメーカー @ja-jp
note: nessuno
note: Explanation added in V 15 @es
in scheme: Subject Code
created: 2004-10-13T12:00:00+00:00
modified: 2012-07-10T12:00:00+00:00
broader: Metallurgia e Meccanica

Elettrodomestici
type: Concept
preferred label: electrical appliance @en-gb
preferred label: Elektroindustrie @de
preferred label: équipement électrique @fr
preferred label: material elétrico @pt-br
preferred label: artefactos eléctricos @es
preferred label: 電機 @ja-jp
definition: Fabricantes de produtos elétricos para uso doméstico ou industrial. @pt-br
definition: Makers of large and small electrical goods for use in homes or business @en-gb
definition: Produzione di grandi e piccoli elettrodomestici per il loro uso in casa o per aziende
definition: Fabricantes de productos eléctricos para el uso industrial o domestico. @es
definition: Fabricants de matériel électrique @fr
definition: Hersteller von großen und kleinen Elektrowaren für den privaten und geschäftlichen Gebrauch. @de
definition: 家庭または企業で使われる大小電気製品のメーカー @ja-jp
note: Explanation added in V 15 @fr
note: nessuno
in scheme: Subject Code
created: 2004-10-13T12:00:00+00:00
modified: 2012-07-10T12:00:00+00:00
broader: Metallurgia e Meccanica

Ingegneria pesante
type: Concept
preferred label: equipamentos pesados @pt-pt
preferred label: heavy engineering @en-gb
preferred label: ingeniería pesada @es
preferred label: Anlagenbau @de
preferred label: Mécanique lourde @fr
preferred label: 重工業 @ja-jp
definition: Fabricantes de gruas, buldôzeres e equipamento similar para uso em grandes projetos de construção. @pt-br
definition: 大規模な建設事業に使用するクレーン、ブルドーザやそれに準ずる重機の製造業者 @ja-jp
definition: Manufacturers of cranes, bulldozers and the like for use in major construction projects @en-gb
definition: Fabricantes de gruas, buldózeres e equipamento similar para uso em grandes projetos de construção. @pt-pt
definition: Diseñadores y manufacturadores de gruas, palas mecánicas y otros similares, que son utilizados en grandes construcciones. @es
definition: Herstellung von Krähnen, Bulldozern und ähnliches für den Gebrauch bei großen Bauprojekten. @de
definition: Fabricants de matériel lourd pour les grands projets de construction @fr
definition: Produzione di gru, bulldozer e simili per il loro uso nei grandi progetti di costruzione
note: nessuno
note: Explanation added in V 15 @fr
in scheme: Subject Code
created: 2004-10-13T12:00:00+00:00
modified: 2012-07-10T12:00:00+00:00
broader: Metallurgia e Meccanica

Componenti industriali
type: Concept
preferred label: equipamentos metalomecânicos @pt-pt
preferred label: Composants industriels @fr
preferred label: industrial component @en-gb
preferred label: 部品製造 @ja-jp
preferred label: componentes industriales @es
preferred label: Zulieferindustrie @de
definition: Manufacturers of mechanical, electrical, electronic items needed in the manufacture of other items @en-gb
definition: Hersteller von mechanischen, elektrischen und elektronischen Produkten, die zur Herstellung anderer Produkte benötigt werden. @de
definition: Fabricantes de artigos mecânicos, elétricos e eletrónicos, necessários na produção de outros equipamentos. @pt-pt
definition: Fabricants de composants mécaniques, électriques ou électroniques pour d'autres fabricants @fr
definition: Produzione di articoli meccanici, elettrici, elettronici necessari alla produzione di altri articoli
definition: Fabricantes de elementos mecánicos, electricos y electronicos, necesarios para manufacturacion de otros equipos. @es
definition: Fabricantes de artigos mecânicos, elétricos e eletrônicos, necessários na produção de outros equipamentos. @pt-br
definition: 他の製品を製造するのに必要な機械、電気、電子部品の製造業者 @ja-jp
note: Explanation added in V 15 @es
note: nessuno
in scheme: Subject Code
created: 2004-10-13T12:00:00+00:00
modified: 2012-07-10T12:00:00+00:00
broader: Metallurgia e Meccanica

Strumentazioni
type: Concept
preferred label: instrumentação @pt-br
preferred label: 計器 @ja-jp
preferred label: ingeniería de instrumentos @es
preferred label: instrument engineering @en-gb
preferred label: Gerätebau @de
preferred label: contrôle et mesure @fr
definition: Hersteller von Instrumenten zur Eichung, Messungen von Dingen wie Geschwindigkeit, Druck und Entfernung. @de
definition: Fabricants d'instruments de contrôle et de mesure @fr
definition: Fabricantes de instrumentos de calibração ou de medição de coisas como velocidade, pressão, distância, etc. @pt-br
definition: Fabricantes de instrumentos de calibración, medición de velocidad, presión, distancia, etc. @es
definition: Manufacturers of instruments for calibration, measurement of things like speed, pressure, distance @en-gb
definition: 速度や圧力、距離などの測定や調整をする装置の製造業者 @ja-jp
definition: Produzione di strumenti di calibratura e misurazione
note: nessuno
note: Explanation added in V 15 @es
in scheme: Subject Code
created: 2004-10-13T12:00:00+00:00
modified: 2012-07-10T12:00:00+00:00
broader: Metallurgia e Meccanica

Cantieri navali
type: Concept
preferred label: shipbuilding @en-gb
preferred label: construção naval @pt-pt
preferred label: 造船 @ja-jp
preferred label: astilleros @es
preferred label: Schiffbau @de
preferred label: Construction navale @fr
definition: 船、潜水艦、遊覧船の製造業者 @ja-jp
definition: Construction de bateaux, navires, sous-marins @fr
definition: Fabricantes de navíos, submarinos y bascazas. @es
definition: Produzione di barche, navi, ecc.
definition: Fabricantes de navios, submarinos, barcaças. @pt-br
definition: Hersteller von Schiffen, U-Booten oder Lastkähnen. @de
definition: Manufacturers of ships, submarines, barges. @en-gb
note: Explanation added in V 15 @es
note: nessuno
in scheme: Subject Code
created: 2004-10-13T12:00:00+00:00
modified: 2012-07-10T12:00:00+00:00
broader: Metallurgia e Meccanica

Macchinari
type: Concept
preferred label: Maschinenbau @de
preferred label: machine manufacturing @en-gb
preferred label: fabricación de máquinas @es
preferred label: 機械 @ja-jp
preferred label: maquinaria @pt-br
preferred label: Machine outil @fr
definition: Fabricantes de turbinas, motores, ventiladores, bombas e componentes para equipamentos elétricos. @pt-br
definition: Fabricants de turbines, moteurs, hélices, pompes @fr
definition: Hersteller von Turbinen, Maschinen, Pumpen, Ventilatoren, Motoren und Komponenten für schwere Ausrüstung. @de
definition: Fabricantes de turbinas, motores, ventiladores, bombas y componentes que potencian equipos. @es
definition: 動力装置用の部品や、タービン、エンジン、ファン、ポンプ、モータの製造業者 @ja-jp
definition: Manufacturers of turbines, engines, fans , pumps , motors and components for powered equipment. @en-gb
definition: Produzione di turbine, motori, ventole, pompe, macchine e componenti per motori
note: Explanation added in V 15 @fr
note: nessuno
in scheme: Subject Code
created: 2004-10-13T12:00:00+00:00
modified: 2012-07-10T12:00:00+00:00
broader: Metallurgia e Meccanica

Materiali edili
type: Concept
preferred label: Baustoff @de
preferred label: materiales de construcción @es
preferred label: material de construção @pt-br
preferred label: Matériaux de construction @fr
preferred label: 建設資材 @ja-jp
preferred label: building material @en-gb
definition: 建設業における壁材、材木、配線などの材料の製造業者 @ja-jp
definition: Fabrico de materiais para a indústria da construção. @pt-pt
definition: Manufacture of materials like wallboard, lumber wiring for the building industry @en-gb
definition: Fertigung von Materialien wie Bauplatten, Holzbefestigungen für die Bauindustrie. @de
definition: Produzione di materiali utilizzati nell'edilizia
definition: Producción de materiales tales como planchas de yeso y alambres para la industria de la construcción. @es
definition: La fabrication des matériaux utilisés par l'industrie de la construction @fr
note: nessuno
in scheme: Subject Code
created: 2000-10-30T12:00:00+00:00
modified: 2010-12-15T17:01:09+00:00
broader: Metalli, Minerali

Oro, Materiali preziosi
type: Concept
preferred label: ouro e metais preciosos @pt-pt
preferred label: oro y materiales preciosos @es
preferred label: 貴金属 @ja-jp
preferred label: Or et métaux précieux @fr
preferred label: gold and precious material @en-gb
preferred label: Gold/Edelmetall @de
definition: Gewinnung, Verfeinerung und Verkauf von Gold und anderen wertvollen Metallen. @de
definition: Mining, refining and sales of gold and other precious metals @en-gb
definition: Mineração, refinação e venda de ouro e de outros metais preciosos. @pt-pt
definition: Mineria, refinamiento y venta de oro y otros metales preciosos. @es
definition: Estrazione, raffinazione e vendita di oro e altri materiali preziosi
definition: La production, la transformation et la vente de l'or et des autres métaux précieux @fr
definition: 金やその他の貴金属の採掘、精製、販売 @ja-jp
note: nessuno
in scheme: Subject Code
created: 2000-10-30T12:00:00+00:00
modified: 2010-12-15T17:01:09+00:00
broader: Metalli, Minerali

Siderurgia
type: Concept
preferred label: Sidérurgie @fr
preferred label: iron and steel @en-gb
preferred label: ferro e aço @pt-br
preferred label: fierro y acero @es
preferred label: 鉄鋼 @ja-jp
preferred label: Eisen/Stahl @de
definition: Mineração, refinação e venda de metais ferrosos. @pt-pt
definition: Gewinnung, Verfeinerung und Verkauf von eisenhaltigen Metallen. @de
definition: La production, la transformation et la vente des métaux ferreux @fr
definition: Mineria, refinamiento y venta de metales a base de hierro. @es
definition: 鉄基金属の採掘、精製、販売 @ja-jp
definition: Mining, refining and sales of iron-based metals @en-gb
definition: Estrazione, raffinazione e vendita di metalli a base di ferro
note: nessuno
in scheme: Subject Code
created: 2000-10-30T12:00:00+00:00
modified: 2010-12-15T17:01:09+00:00
broader: Metalli, Minerali

Metalli non ferrosi
type: Concept
preferred label: Métaux non ferreux @fr
preferred label: Nichteisenmetall @de
preferred label: non ferrous metal @en-gb
preferred label: materiales no ferrosos @es
preferred label: 非鉄金属 @ja-jp
preferred label: metais não ferrosos @pt-pt
definition: Mineração, refinação e venda de cobre, zinco, alumínio e de outros metais não ferrosos. @pt-pt
definition: Gewinnung, Verfeinerung und Verkauf von Kupfer, Zink, Aluminium und anderen nicht-eisenhaltigen Metallen. @de
definition: Mining, refining and sales of copper, zinc, aluminium, and other metals not based on iron @en-gb
definition: La production, la transformation et la vente des métaux non-ferreux tels que le cuivre et l'aluminium @fr
definition: Produzione, trasformazione e vendita di metalli non a base di ferro, come rame, zinco, alluminio
definition: Mineria, refinamiento y venta de cobre, cinc, aluminio y otros metales no a base de hierro. @es
definition: 銅、亜鉛、アルミニウムおよび鉄に基づかない金属の採掘、精製、販売 @ja-jp
note: nessuno
in scheme: Subject Code
created: 2000-10-30T12:00:00+00:00
modified: 2010-12-15T17:01:09+00:00
broader: Metalli, Minerali

Miniere
type: Concept
preferred label: minas @pt-pt
preferred label: 鉱業 @ja-jp
preferred label: mining @en-gb
preferred label: Mines @fr
preferred label: Bergbau @de
preferred label: minería @es
definition: L'industrie minière et la production de matière brute @fr
definition: The industry of digging for metals, raw materials such as coal, or precious gems such as diamonds @en-gb
definition: La industria que escaba por metales y materiales brutos como carbón, o piedras preciosas como diamantes. @es
definition: Industriezweig, der nach Metallen oder Rohstoffen wie Kohle, oder wertvollen Edelsteinen wie Diamanten gräbt. @de
definition: Indústria da extração de metais, de matérias-primas como o carvão, ou de pedras preciosas como os diamantes. @pt-pt
definition: 金属、石炭のような原鉱石、ダイヤモンドのような貴金属を掘削する産業 @ja-jp
definition: Estrazioni minerarie
note: nessuno
in scheme: Subject Code
created: 2000-10-30T12:00:00+00:00
modified: 2010-12-15T17:01:09+00:00
broader: Metalli, Minerali

Distillerie, Birrerie
type: Concept
preferred label: Boissons alcoolisées @fr
preferred label: destilação e bebidas @pt-pt
preferred label: distiller and brewer @en-gb
preferred label: Alkoholische Getränke/Brauerei @de
preferred label: destilerías y cervecerías @es
preferred label: 醸造 @ja-jp
definition: Produzione di bevande alcoliche
definition: Fabrico de bebidas alcoólicas. @pt-pt
definition: Herstellung alkoholischer Getränke. @de
definition: Manufacture of alcoholic beverages @en-gb
definition: アルコール飲料の製造 @ja-jp
definition: L'industrie de fabrication de boissons alcooliques @fr
definition: Fabricación de bebidas alcoholicas. @es
note: nessuno
in scheme: Subject Code
created: 2000-10-30T12:00:00+00:00
modified: 2010-12-15T17:01:09+00:00
broader: Industria Trasformazione

Alimentare
type: Concept
preferred label: Alimentation @fr
preferred label: Nahrungsmittel @de
preferred label: 食品 @ja-jp
preferred label: alimentos @es
preferred label: alimentação @pt-br
preferred label: food @en-gb
definition: Das Geschäft mit der Erzeugung, Verteilung und dem Verkauf von Grundbedarfsmitteln. @de
definition: 人間の基礎的消費物(食品)を加工、配送、販売する仕事 @ja-jp
definition: Negócio do processamento, distribuição e venda de produtos básicos para o consumo humano. @pt-pt
definition: El negocio de procesar, distribuir y vender productos básicos para el consumo humano. @es
definition: The business of processing, distributing and selling for basic human consumption @en-gb
definition: L'industrie agro-alimentaire et le commerce de distribution et de vente des produits alimentaires de base @fr
definition: Industria agro-alimentare, commercio, distribuzione e vendita dei prodotti alimentari
note: nessuno
in scheme: Subject Code
created: 2000-10-30T12:00:00+00:00
modified: 2010-12-15T17:01:09+00:00
broader: Industria Trasformazione

Arredamento, Mobili
type: Concept
preferred label: インテリア @ja-jp
preferred label: Meubles et décoration @fr
preferred label: muebles y decoración @es
preferred label: furnishings and furniture @en-gb
preferred label: mobiliário e decoração @pt-pt
preferred label: Möbel @de
definition: インテリア装飾のための家具、壁紙、塗料、生地の製造 @ja-jp
definition: Manufacture of furniture, wallpaper, paints and fabrics for interior decoration @en-gb
definition: Fertigung von Möbeln, Tapete, Farben und Erzeugnisse zur Inneneinrichtung. @de
definition: Fabrico de móveis, papéis de parede, tintas e tecidos para decoração interior. @pt-pt
definition: Produzione di mobili, carta da parati, vernici e tessuti per la decorazione di interni
definition: L'industrie de l'ameublement, du papier peint, de la peinture et des tissus pour la décoration d'intérieur @fr
definition: Fabricación de muebles, papel mural, pinturas y telas para decoración interior. @es
note: nessuno
in scheme: Subject Code
created: 2000-10-30T12:00:00+00:00
modified: 2010-12-15T17:01:09+00:00
broader: Industria Trasformazione

Carta, Imballaggi
type: Concept
preferred label: 製紙 @ja-jp
preferred label: papel e embalagem @pt-pt
preferred label: Papier/Verpackung @de
preferred label: paper and packaging product @en-gb
preferred label: Papier et emballage @fr
preferred label: productos de papel y embalaje @es
definition: Produktion von Papiermaterial zum Schreiben, Einwickeln, Drucken oder Verpacken. @de
definition: Produção papel para escrever, embrulhar, imprimir ou embalar. @pt-pt
definition: Producción de materiales de papel para escribir, envolver, imprimir o empacar. @es
definition: Production of paper material for writing, wrapping, printing, or packaging @en-gb
definition: 書き物用、包装用、印刷用、梱包用の紙製品の生産 @ja-jp
definition: La papeterie, le papier d'imprimerie et d'emballage @fr
definition: Produzione di materiale cartaceo per scrivere, incartare, stampare o imballare
note: nessuno
in scheme: Subject Code
created: 2000-10-30T12:00:00+00:00
modified: 2010-12-15T17:01:09+00:00
broader: Industria Trasformazione

Gomma
type: Concept
preferred label: ゴム製品 @ja-jp
preferred label: productos de caucho @es
preferred label: rubber product @en-gb
preferred label: borracha @pt-pt
preferred label: Gummi @de
preferred label: Caoutchouc @fr
definition: Produzione di articoli a base di gomma per guanti, rivestimenti protettivi, manichette, ecc.
definition: Production of rubber based materials for gloves, protective coatings, hoses and the like @en-gb
definition: Herstellung von gummibasierten Materialien wie Handschuhe, Schutzmäntel, Schläuchen und Ähnliches. @de
definition: Produção de materiais de borracha para o fabrico de luvas, revestimentos protetores, mangueiras, etc. @pt-pt
definition: 手袋、保護皮膜、ホースなどのゴム製品の生産 @ja-jp
definition: Produits à base de caoutchouc tels que les gants et les revêtements protecteurs, les tuyaux, etc. @fr
definition: Producción de materiales de goma para la fabricación de guantes, trajes protectores, mangueras y otros similares. @es
note: nessuno
in scheme: Subject Code
created: 2000-10-30T12:00:00+00:00
modified: 2010-12-15T17:01:09+00:00
broader: Industria Trasformazione

Analcolici
type: Concept
preferred label: soft drinks @en-gb
preferred label: Nicht alkoholische Getränke @de
preferred label: 清涼飲料 @ja-jp
preferred label: bebidas no alcohólicas @es
preferred label: Boissons non alcoolisées @fr
preferred label: refrigerantes @pt-br
definition: Herstellung nicht-alkoholischer Getränke. @de
definition: Production of non-alcoholic drinks @en-gb
definition: Fabrico de bebidas não alcoólicas. @pt-br
definition: La production de boissons sans alcool @fr
definition: Produzione di bevande analcoliche
definition: Producción de bebidas no alcoholicas. @es
definition: アルコールが入っていない飲料の生産 @ja-jp
note: nessuno
in scheme: Subject Code
created: 2000-10-30T12:00:00+00:00
modified: 2010-12-15T17:01:09+00:00
broader: Industria Trasformazione

Tessile, Abbigliamento
type: Concept
preferred label: 繊維 @ja-jp
preferred label: textile and clothing @en-gb
preferred label: têxtil e vestuário @pt-pt
preferred label: textiles y vestuario @es
preferred label: Textil und Bekleidung @de
preferred label: Textile @fr
definition: Fabrico de tecidos para móveis, abajures e vestuário de vários tipos. @pt-br
definition: インテリア、服飾品や、様々なタイプの衣料品用生地の生産 @ja-jp
definition: L'Industrie du tissu pour l'ameublement et pour le vêtement @fr
definition: Production of fabrics for furnishings and fixtures, and for clothing of various types @en-gb
definition: Producción de telas para muebles, instalaciones, y vestuario de varios tipos. @es
definition: Industria tessile per arredamenti e rifiniture, e per vestiario di vario tipo
definition: Produktion von Materialien für Möbel und Vorhänge und für verschiedene Sorten von Bekleidung. @de
definition: Fabrico de tecidos para móveis e acessórios de vestuário de vários tipos. @pt-pt
note: nessuno
in scheme: Subject Code
created: 2000-10-30T12:00:00+00:00
modified: 2010-12-15T17:01:09+00:00
broader: Industria Trasformazione

Tabacchi
type: Concept
preferred label: Tabak @de
preferred label: tabaco @pt-pt
preferred label: Tabac @fr
preferred label: tobacco @en-gb
preferred label: たばこ @ja-jp
definition: La culture, la production et la vente des produits du tabac @fr
definition: Anbau, Produktion und Handel mit Tabakprodukten. @de
definition: Cultivo, produção e venda de produtos do tabaco. @pt-pt
definition: Growing, producing and sale of tobacco products @en-gb
definition: Coltura, produzione e vendita di prodotti del tabacco
definition: タバコの栽培と生産、およびタバコ製品の販売 @ja-jp
definition: Cultivar, producir y vender productos de tabaco. @es
note: nessuno
in scheme: Subject Code
created: 2000-10-30T12:00:00+00:00
modified: 2010-12-15T17:01:09+00:00
broader: Industria Trasformazione

Casinò, Giochi
type: Concept
preferred label: Casinos @fr
preferred label: cassinos e jogo @pt-br
preferred label: ギャンブル @ja-jp
preferred label: casinos e jogo @pt-pt
preferred label: casinos y juegos de azar @es
preferred label: casino and gambling @en-gb
preferred label: Glücksspielbetrieb @de
definition: カード、サイコロ、動物のレースに賭けるためのルーレットなどを利用する様々な「チャンスのゲーム」の販路を提供するビジネス @ja-jp
definition: Das Geschäft mit dem Angebot von verschiedenen Glücksspielen, wie Kartenspiel, Würfel, Lotto, Toto, Pferdewetten. @de
definition: Negócio do jogo, desde as instalações para vários jogos de azar, usando cartas, dados, roletas, até apostas em corridas de animais. @pt-br
definition: El negocio que provee intslaciones para juegos de azar, cartas, dados, ruletas con apuestas o carreras de animales. @es
definition: Tout ce qui va des établissements de jeux de hasard aux paris sur les courses d'animaux @fr
definition: The business of providing outlets for various games of chance using cards, dice, spinning wheels to betting on animal races @en-gb
definition: Produzione di installazioni per il gioco d'azzardo e/o le scommesse di varia natura
note: nessuno
in scheme: Subject Code
created: 2000-10-30T12:00:00+00:00
modified: 2010-12-15T17:01:09+00:00
broader: Turismo, Tempo libero

Alberghiero
type: Concept
preferred label: Gastgewerbe @de
preferred label: hotelaria e alojamentos @pt-pt
preferred label: hotel and accommodation @en-gb
preferred label: ホテル・旅館 @ja-jp
preferred label: hoteles y alojamiento @es
preferred label: Hotellerie @fr
definition: Negocio que provee comida y hospedaje a los viajeros. @es
definition: 旅行客に食物・住まいを供給するビジネス @ja-jp
definition: Negócio que fornece comida e alojamento a viajantes. @pt-br
definition: L'hébergement et la restauration des voyageurs @fr
definition: Industria alberghiera
definition: The business of providing food and shelter to travellers @en-gb
definition: Das Arbeitsfeld, Reisenden Verpflegung und Unterkunft anzubieten. @de
note: nessuno
in scheme: Subject Code
created: 2000-10-30T12:00:00+00:00
modified: 2010-12-15T17:01:09+00:00
broader: Turismo, Tempo libero

Articoli sportivi, Tempo libero
type: Concept
preferred label: artículos recreacionales y deportivos @es
preferred label: recreational and sporting goods @en-gb
preferred label: Articles de sport et plein air @fr
preferred label: produtos para desporto e lazer @pt-pt
preferred label: produtos para esporte e lazer @pt-br
preferred label: スポーツ・レジャー用品 @ja-jp
preferred label: Sport- und Freizeitartikel @de
definition: La fabrication de biens pour les activités de loisirs @fr
definition: Producción de bienes para la entretención y actividades deportivas. @es
definition: レジャー活動用品の製造 @ja-jp
definition: Fabrico de bens para atividades de lazer. @pt-pt
definition: Produzione di beni per attività legate allo sport e al tempo libero
definition: Manufacture of goods for leisure activities @en-gb
definition: Herstellung von Waren für sportliche Freizeitaktivitäten. @de
note: nessuno
in scheme: Subject Code
created: 2000-10-30T12:00:00+00:00
modified: 2010-12-15T17:01:09+00:00
broader: Turismo, Tempo libero

Ristorazione, Catering
type: Concept
preferred label: restauração @pt-pt
preferred label: restaurantes @pt-br
preferred label: restoranes y banquetería @es
preferred label: Gastronomie @de
preferred label: 外食・仕出し @ja-jp
preferred label: restaurant and catering @en-gb
preferred label: Restauration @fr
definition: Industria della ristorazione e/o della preparazione di piatti pronti per la clientela
definition: The business of providing prepared foods for customers in groups large and small @en-gb
definition: Negócio do fornecimento de comida preparada para clientes em grupos grandes ou pequenos. @pt-br
definition: 大小のグループ中の顧客に調理済みの食糧を供給するビジネス @ja-jp
definition: Negocio que prepara comida para clientes en grupos pequeños o grandes. @es
definition: Das Geschäft, zubereitete Nahrung für größere und kleinere Kundenkreise anzubieten. @de
definition: Le secteur de la restauration de groupes et des plats préparés @fr
note: nessuno
in scheme: Subject Code
created: 2000-10-30T12:00:00+00:00
modified: 2010-12-15T17:01:09+00:00
broader: Turismo, Tempo libero

Tour Operator
type: Concept
preferred label: 旅行業 @ja-jp
preferred label: Voyagistes @fr
preferred label: operadores de turismo @es
preferred label: operadores turísticos @pt-pt
preferred label: Reiseveranstalter @de
preferred label: tour operator @en-gb
definition: Operators of trips either locally, as around town, or to other countries @en-gb
definition: Agenzie e società specializzate nell'organizzazione di viaggi e soggiorni
definition: Organisateurs de circuits touristiques locaux comme à l'étranger @fr
definition: 都市周辺、または他の国々のいずれかを地理的に紹介する旅行の業者 @ja-jp
definition: Anbieter von Reisen, sowohl vor Ort, als auch in Städte oder in andere Länder. @de
definition: Operadores de viagens, seja localmente, seja em outros países. @pt-br
definition: Operador de viajes hacia cualquier lugar, en la ciudad u otros paises. @es
note: nessuno
in scheme: Subject Code
created: 2000-10-30T12:00:00+00:00
modified: 2010-12-15T17:01:09+00:00
broader: Turismo, Tempo libero

Aerei
type: Concept
preferred label: aviação @pt-br
preferred label: 空運 @ja-jp
preferred label: Luftverkehr @de
preferred label: Transport aérien @fr
preferred label: air transport @en-gb
preferred label: transporte aéreo @es
definition: 飛行機と空港の運営(運用) @ja-jp
definition: Aviones y operaciones de aeropuestos. @es
definition: Operações de aviões e de aeroportos. @pt-pt
definition: Airplane and airport operations @en-gb
definition: Les opérations aéroportuaires et de transport par air @fr
definition: Aktivitäten um Flugzeuge und Flughäfen. @de
definition: Sistema del trasporto aereo, le operazioni aeree ed aeroportuali
note: nessuno
in scheme: Subject Code
created: 2000-10-30T12:00:00+00:00
modified: 2010-12-15T17:01:09+00:00
broader: Trasporti

Ferrovie
type: Concept
preferred label: ferrocarril @es
preferred label: transporte ferroviário @pt-pt
preferred label: Bahn @de
preferred label: 鉄道 @ja-jp
preferred label: Transport ferroviaire @fr
preferred label: railway @en-gb
definition: 鉄道による人々や積荷を輸送するビジネス @ja-jp
definition: Geschäft mit dem Transport von Menschen und Ware auf der Schiene. @de
definition: negocio de transporte de pasajeros o carga, a través de tren. @es
definition: Trasporto di persone o merci su rotaie
definition: Le transport de voyageurs et de marchandises par train @fr
definition: The business of transporting people or cargo by rail @en-gb
definition: Negócio do transporte de pessoas ou carga por comboio. @pt-pt
definition: Negócio do transporte de pessoas ou carga por trem @pt-br
note: nessuno
in scheme: Subject Code
created: 2000-10-30T12:00:00+00:00
modified: 2010-12-15T17:01:09+00:00
broader: Trasporti

Stradali
type: Concept
preferred label: 陸運 @ja-jp
preferred label: transporte rodoviário @pt-pt
preferred label: transporte carretero @es
preferred label: Transport routier @fr
preferred label: Straßenverkehr @de
preferred label: road transport @en-gb
definition: トラックと公道による輸送物のビジネス @ja-jp
definition: Negocio de transporte de bienes mediante camiones, a través de las carretereas. @es
definition: Negócio do transporte de mercadorias por camião e autoestrada. @pt-pt
definition: Le transport de marchandises par camion et par route @fr
definition: Geschäft mit dem Transport von Waren durch LKW's und Straßen. @de
definition: Trasporto di merci tramite autocarri e TIR su strade ed autostrade
definition: Negócio do transporte de mercadorias por caminhão e rodovia. @pt-br
definition: The business of transport goods by trucks and highways @en-gb
note: nessuno
in scheme: Subject Code
created: 2000-10-30T12:00:00+00:00
modified: 2010-12-15T17:01:09+00:00
broader: Trasporti

Marittimi, Acque interne
type: Concept
preferred label: 水運 @ja-jp
preferred label: Transport fluvial et maritime @fr
preferred label: vías navegables y marítimo @es
preferred label: transporte marítimo e fluvial @pt-br
preferred label: waterway and maritime transport @en-gb
preferred label: Schifffahrt @de
definition: Commercial movement of people or goods via boats, ships and water @en-gb
definition: Movimento comercial de pessoas ou bens através de barcos, navios e água. @pt-br
definition: Le transport de marchandises par bateau et sur les voies navigables @fr
definition: Trasporto di persone e merci con mezzi di navigazione, traghetti, navi, ecc.
definition: ボート・船・水による人々または品物の商用移動 @ja-jp
definition: Handelsbewegung von Menschen oder Waren mit Booten und Schiffen auf dem Wasserweg. @de
definition: Movimientos comerciales de gente o bienes a través de botes, barcos en el agua. @es
note: nessuno
in scheme: Subject Code
created: 2000-10-30T12:00:00+00:00
modified: 2010-12-15T17:01:09+00:00
broader: Trasporti

Rendicontazione, Verifica
type: Concept
preferred label: Buchführung/Bilanzprüfung @de
preferred label: 会計監査 @ja-jp
preferred label: accounting and audit @en-gb
preferred label: Comptabilité et audit @fr
preferred label: contabilidade e auditoria @pt-br
preferred label: contabilidad y auditoría @es
definition: Changes in choice of auditing firm. Reports on impact of changes in GAAP. @en-gb
definition: Cambios en la forma de auditar firmas. Reportes del impacto de cambios en GAAP. @es
definition: Les changements de sociétés d'audit et les rapports sur l'impact des modifications comptables @fr
definition: Valutazione di informazioni finanziarie ed esame da parte di esperti terzi dei documenti finanziari ; Revisione contabile e certificazione
definition: 会計検査をしている企業の選択の変化。GAAPで変化のインパクトについて報告する @ja-jp
definition: Mudanças na escolha de sociedade de auditoria. Relatórios sobre o impacto de mudanças nos princípios contábeis geralmente aceitos. @pt-br
definition: Mudanças na escolha de sociedade de auditoria. Relatórios sobre o impacto de mudanças nos princípios contabilísticos geralmente aceites. @pt-pt
definition: Änderungen in der Wahl der Buchhaltungsfirma. Berichte über Auswirkungen von Änderungen in den Standards des Rechnungswesens GAAP/ IAS/ HGB. @de
note: nessuno
in scheme: Subject Code
created: 2000-10-30T12:00:00+00:00
modified: 2010-12-15T17:01:09+00:00
broader: Informazione d'impresa

Assemblee generali
type: Concept
preferred label: Assemblées générales @fr
preferred label: annual and special corporate meeting @en-gb
preferred label: assembleias gerais @pt-br
preferred label: Hauptversammlung/Generalversammlung @de
preferred label: asambleas corporativas anuales y especiales @es
preferred label: 株主総会 @ja-jp
definition: Anúncios de reuniões agendadas. Relatórios das reuniões. @pt-pt
definition: Anuncios de reuniones agendadas. Reportes de las reuniones. @es
definition: Announcements of upcoming meetings. Reports on meetings. @en-gb
definition: Convocazioni di assemblee generali e straordinarie e relativi rapporti
definition: L'annonce des assemblées générales annuelles et extraordinaires ainsi que les comptes rendus @fr
definition: 企業による決算発表、会見、総会などのお知らせと発表 @ja-jp
definition: Ankündigungen und Berichte von Versammlungen. @de
note: nessuno
in scheme: Subject Code
created: 2000-10-30T12:00:00+00:00
modified: 2010-12-15T17:01:09+00:00
broader: Informazione d'impresa

Relazioni annuali
type: Concept
preferred label: 年次報告 @ja-jp
preferred label: relatório anual @pt-pt
preferred label: Geschäftsbericht @de
preferred label: Rapports annuels @fr
preferred label: memorias anuales @es
preferred label: annual report @en-gb
definition: Histórias relativas à disponibilidade ou aos conteúdos de relatórios anuais de empresas. @pt-br
definition: Pubblicazioni e contenuti delle relazioni annuali delle società
definition: Historias informando disponibilidad de reportes anuales de las compañías o sus contenidos. @es
definition: La publication et le contenu des rapports annuels de sociétés @fr
definition: 入手可能性に関連するストーリー、あるいは年に一度の会社報告のコンテンツ @ja-jp
definition: Availability or contents of annual company reports. @en-gb
definition: Die Verwendbarkeit oder Inhalte von Jahresabschlussberichten von Firmen. @de
note: nessuno
in scheme: Subject Code
created: 2000-10-30T12:00:00+00:00
modified: 2010-12-15T17:01:09+00:00
broader: Informazione d'impresa

Antitrust
type: Concept
preferred label: antitrust issue @en-gb
preferred label: 独占禁止 @ja-jp
preferred label: Kartellfragen @de
preferred label: antitruste @pt-br
preferred label: problemas antimonopolio @es
preferred label: antitrust @pt-pt
preferred label: Problèmes de concurrence @fr
definition: Histórias relativas a atividades antitruste, regulações de monopólio, etc. @pt-br
definition: Histórias relativas a atividades antitrust, regulações de monopólio, etc. @pt-pt
definition: Kartellaktivitäten und Wettbewerbsrichtlinien. @de
definition: 独占禁止の活動、独占規制、などに関連するストーリー @ja-jp
definition: Tout ce qui concerne les activités antitrust, la législation sur les monopoles, etc. @fr
definition: Attività dell'antritrust, la legislazione sui monopoli, ecc...
definition: Historias sobre actividades antimonopólicas, regulaciones, etc. @es
definition: Antitrust activities, monopoly regulation, etc. @en-gb
note: nessuno
in scheme: Subject Code
created: 2000-10-30T12:00:00+00:00
modified: 2010-12-15T17:01:09+00:00
broader: Informazione d'impresa

Fusioni, Acquisizioni, Cambi gestione
type: Concept
preferred label: 合併・買収 @ja-jp
preferred label: fusiones, adquisiciones, absorciones @es
preferred label: Fusion @de
preferred label: fusões, aquisições e OPA @pt-pt
preferred label: Fusions-acquisitions @fr
preferred label: merger, acquisition and takeover @en-gb
definition: Notícias sobre fusões, aquisições ou ofertas públicas de aquisição. @pt-pt
definition: News on mergers, takeovers or acquisitions. @en-gb
definition: Nachrichten über Fusionen, Übernahmen und Aufkäufe. @de
definition: Informazioni riguardanti fusioni, successioni o acquisizioni
definition: 合併、吸収合併、あるいは企業買収のニュース @ja-jp
definition: Les informations sur les fusions, les acquisitions, les absorption de sociétés @fr
definition: Noticias en fusiones, absorciones o adquisiciones. @es
note: nessuno
in scheme: Subject Code
created: 2000-10-30T12:00:00+00:00
modified: 2010-12-15T17:01:09+00:00
broader: Informazione d'impresa

Commenti analisti
type: Concept
preferred label: Commentaires d'analystes @fr
preferred label: comentários de analistas @pt-br
preferred label: comentarios de analistas @es
preferred label: analysts' comment @en-gb
preferred label: アナリシス @ja-jp
preferred label: Analysten @de
definition: Histórias relativas a comentários de analistas da bolsa, análises e recomendações. @pt-pt
definition: 株式アナリスト･コメント、分析、および推薦..を含むストーリー @ja-jp
definition: Les analyses, commentaires et recommandations des analystes boursiers @fr
definition: Osservazioni, analisi e raccomandazioni da parte di analisti ed esperti di finanza aziendale
definition: Historias de comentarios de analistas de la bolsa, análisis y recomendaciones. @es
definition: Kommentare, Analysen und Empfehlungen von Aktienanalysten. @de
definition: Stock analyst comments, analysis and recommendations. @en-gb
note: nessuno
in scheme: Subject Code
created: 2000-10-30T12:00:00+00:00
modified: 2010-12-15T17:01:09+00:00
broader: Informazione d'impresa

Fallimenti
type: Concept
preferred label: quiebra @es
preferred label: Konkurs @de
preferred label: 倒産 @ja-jp
preferred label: falência @pt-pt
preferred label: bankruptcy @en-gb
preferred label: Défaillances d'entreprise @fr
definition: Noticias sobre quiebras actuales. @es
definition: Actual bankruptcy filings. @en-gb
definition: Notícias sobre declarações de bancarrota. @pt-pt
definition: Aktuelle Einreichungen von Zahlungsunfähigkeit @de
definition: Informazioni sulla bancarotta
definition: Les informations sur les banqueroutes @fr
definition: 実際の破産ファイリングについてのニュース @ja-jp
note: nessuno
in scheme: Subject Code
created: 2000-10-30T12:00:00+00:00
modified: 2010-12-15T17:01:09+00:00
broader: Informazione d'impresa

Consigli Amministrazione
type: Concept
preferred label: board of directors (appointment and change) @en-gb
preferred label: directorio - cambios y designaciones @es
preferred label: Carnet des entreprises @fr
preferred label: conselhos de administração @pt-br
preferred label: Geschäftsführung/Vorstand @de
preferred label: 役員人事 @ja-jp
definition: Appointments to or changes in the board of directors for a company. @en-gb
definition: Notícias sobre nomeações ou mudanças no conselho de administração de uma companhia. @pt-pt
definition: Nomine o sostituzioni nei consigli d'amministrazione delle società
definition: 企業取締役会の任命、変更に関するニュース @ja-jp
definition: Absprachen oder Wechsel in der Geschäftsführung eines Unternehmens. @de
definition: Noticias sobre reuniones o cambios en los directorios de compañías. @es
definition: Les informations sur les nominations et les changements au sein des conseils d'administration de sociétés @fr
note: nessuno
in scheme: Subject Code
created: 2000-10-30T12:00:00+00:00
modified: 2010-12-15T17:01:09+00:00
broader: Informazione d'impresa

Riacquisto Azioni
type: Concept
preferred label: recompra @pt-br
preferred label: recompras @es
preferred label: Aktienrückkauf @de
preferred label: 株買い戻し @ja-jp
preferred label: buyback @en-gb
preferred label: Rachats d'actions @fr
definition: Notícias sobre programas de recompra de ações. Deve ser mantido distinto de atividade bolsista (ver abaixo). @pt-pt
definition: Les informations relatives aux programmes de rachat d'actions @fr
definition: 株買戻しに関する情報。一般的な株取引とは違う @ja-jp
definition: Stock buyback programs. This should be kept distinct from Stock Activity (see below). @en-gb
definition: Aktienrückkaufprogramme. Dies sollte getrennt geführt werden von Aktienbewegung (s.u). @de
definition: Informazioni sui programmi per il riacquisto di azioni, da distinguere dall'attività azionaria
definition: Noticias sobre programas de recompra de acciones. Debe guardar distinción con Actividad Accionaria (ver más abajo) @es
note: nessuno
in scheme: Subject Code
created: 2000-10-30T12:00:00+00:00
modified: 2010-12-15T17:01:09+00:00
broader: Informazione d'impresa

Interviste Dirigenti
type: Concept
preferred label: Interviews de dirigeants @fr
preferred label: 経営者インタビュー @ja-jp
preferred label: C.E.O. interview @en-gb
preferred label: CEO entrevistas / perfis @pt-pt
preferred label: entrevistas con gerentes generales @es
preferred label: Stellungnahme @de
definition: Entrevistas com diretores executivos. @pt-br
definition: Interviste con direttori generali delle società
definition: 最高経営責任者との会見 @ja-jp
definition: Interviews with Chief Executive Officers. @en-gb
definition: Les entretiens avec les dirigeants d'entreprises @fr
definition: Interviews mit Geschäftsführern/Vorständen. @de
definition: Entrevistas con gerentes generales de compañías @es
note: nessuno
in scheme: Subject Code
created: 2000-10-30T12:00:00+00:00
modified: 2010-12-15T17:01:09+00:00
broader: Informazione d'impresa
broad match: http://cv.iptc.org/newscodes/mediatopic/20000170

Funzionari aziendali
type: Concept
preferred label: ejecutivos de empresas @es
preferred label: administradores @pt-pt
preferred label: 幹部人事 @ja-jp
preferred label: Dirigeants @fr
preferred label: corporate officer @en-gb
preferred label: Vorstand @de
definition: Appointments or changes in corporate officers. @en-gb
definition: Citas o cambios en ejecutivos de empresas. @es
definition: 会社役員の任命または変更 @ja-jp
definition: Nomination ou changement dans l'organigramme de direction des sociétés @fr
definition: Nomeações ou mudanças de executivos de empresas. @pt-br
definition: Einstellungen und Veränderungen in den Vorständen der Geschäftsführung. @de
definition: Nomine o sostituzioni nell'organigramma delle società
note: nessuno
in scheme: Subject Code
created: 2000-10-30T12:00:00+00:00
modified: 2010-12-15T17:01:09+00:00
broader: Informazione d'impresa
broad match: http://cv.iptc.org/newscodes/mediatopic/20000190

Profili aziendali
type: Concept
preferred label: corporate profile @en-gb
preferred label: 企業概要 @ja-jp
preferred label: perfiles corporativos @es
preferred label: perfil corporativo @pt-br
preferred label: Portraits d'entreprises @fr
preferred label: Firmenporträt @de
definition: Profili descrittivi delle aziende, informazioni sulla loro attività
definition: Histórias que contêm informação sobre o perfil de empresas. @pt-br
definition: Historias que contengan descripción de perfiles de compañías. @es
definition: Umfassende Beschreibungen von Unternehmen @de
definition: 会社の記述的なプロファイルを含むストーリー @ja-jp
definition: Les informations sur les activités des sociétés @fr
definition: Descriptive profiles of companies. @en-gb
note: nessuno
in scheme: Subject Code
created: 2000-10-30T12:00:00+00:00
modified: 2010-12-15T17:01:09+00:00
broader: Informazione d'impresa
broad match: http://cv.iptc.org/newscodes/mediatopic/20000170

Contratti
type: Concept
preferred label: 契約 @ja-jp
preferred label: Vertrag @de
preferred label: contrato @pt-br
preferred label: contratos @es
preferred label: Contrats @fr
preferred label: contract @en-gb
definition: Vertragliche Vereinbarungen. @de
definition: Notícias sobre contratos comerciais. @pt-pt
definition: Les informations sur les contrats commerciaux @fr
definition: Informazioni sui contratti commerciali
definition: Commercial contracts. @en-gb
definition: 商業上の契約についてのニュース @ja-jp
definition: Noticias acerca de contratos comerciales. @es
note: nessuno
in scheme: Subject Code
created: 2000-10-30T12:00:00+00:00
modified: 2010-12-15T17:01:09+00:00
broader: Informazione d'impresa

Contratti militari
type: Concept
preferred label: contrato de defesa @pt-br
preferred label: defence contract @en-gb
preferred label: 防衛契約 @ja-jp
preferred label: contratos de defensa @es
preferred label: Contrats militaires @fr
preferred label: Rüstungsvertrag @de
definition: Atribuição de contratos governamentais relativos a atividades de defesa. @pt-pt
definition: Les contrats publics relevant de l'industrie de défense @fr
definition: ディフェンスに関する活動のための政府契約の賞 @ja-jp
definition: Contratti pubblici e appalti riguardanti l'industria della Difesa
definition: The award of government contracts for defence related activity. @en-gb
definition: Zusage von Regierungsverträgen in bezug auf Verteidigungsaktivitäten. @de
definition: Adjudicación de contratos gubernamentales relativos a actividades de defensa. @es
note: nessuno
in scheme: Subject Code
created: 2000-10-30T12:00:00+00:00
modified: 2010-12-15T17:01:09+00:00
broader: Informazione d'impresa
broad match: http://cv.iptc.org/newscodes/mediatopic/20000196

Comunicazioni dividendi
type: Concept
preferred label: anuncios de dividendos @es
preferred label: Dividendes @fr
preferred label: 配当 @ja-jp
preferred label: anúncio de dividendos @pt-pt
preferred label: dividend announcement @en-gb
preferred label: Dividende @de
definition: Zusage von Regierungsverträgen in bezug auf Verteidigungsaktivitäten. @de
definition: Anúncios relativos à distribuição de dividendos. @pt-pt
definition: Anuncios relacionados con distribución de dividendos. @es
definition: Announcements regarding the disbursement of dividends. @en-gb
definition: 配当支払いに関するアナウンス @ja-jp
definition: Comunicazioni riguardanti il pagamento di dividendi
definition: Les annonces de versement de dividendes @fr
note: nessuno
in scheme: Subject Code
created: 2000-10-30T12:00:00+00:00
modified: 2010-12-15T17:01:09+00:00
broader: Informazione d'impresa

Previsioni profitti
type: Concept
preferred label: Gewinnprognose @de
preferred label: Prévisions de résultats @fr
preferred label: pronóstico de utilidades @es
preferred label: 収益見通し @ja-jp
preferred label: previsão de lucros @pt-pt
preferred label: earnings forecast @en-gb
definition: Analyst prediction of company earnings. @en-gb
definition: Previsões dos analistas sobre os lucros de empresas. @pt-pt
definition: Les prévisions ou estimations sur les revenus des sociétés @fr
definition: Predicciones de analistas sobre utilidades de compañías. @es
definition: 会社事業所得のアナリスト予測 @ja-jp
definition: Previsioni o stime riguardanti gli utili delle società
definition: Vorhersage von Firmenumsätzen durch Analysten. @de
note: nessuno
in scheme: Subject Code
created: 2000-10-30T12:00:00+00:00
modified: 2010-12-15T17:01:09+00:00
broader: Informazione d'impresa

Aziende depresse
type: Concept
preferred label: empresa com dificuldades financeiras @pt-br
preferred label: Unternehmenskrise @de
preferred label: Entreprise en difficulté @fr
preferred label: empresas con problemas financieros @es
preferred label: 経営不振 @ja-jp
preferred label: financially distressed company @en-gb
definition: Noticias de empresas penalizadas financieramente, no llegando aún a la quiebra. @es
definition: Notícias sobre empresas com dificuldades financeiras mas que ainda não declararam falência. @pt-br
definition: Les Informations sur les sociétés en difficulté mais pas encore en faillitte déclarée @fr
definition: 会社が財政的に苦しめられるというニュース-まだ破産を登録しなかったこと @ja-jp
definition: Ein ist Unternehmen finanziell in Bedrängnis, hat aber noch nicht Konkurs angemeldet. @de
definition: Informazioni riguardanti società finanziariamente in difficoltà ma non ancora fallite
definition: Aa company is financially distressed - not yet having filed for bankruptcy. @en-gb
note: nessuno
in scheme: Subject Code
created: 2000-10-30T12:00:00+00:00
modified: 2010-12-15T17:01:09+00:00
broader: Informazione d'impresa

Profitti
type: Concept
preferred label: earnings @en-gb
preferred label: 収益 @ja-jp
preferred label: lucros @pt-br
preferred label: Résultats @fr
preferred label: Gewinn @de
preferred label: utilidades @es
definition: Toutes informations sur les résultats d'une entreprise @fr
definition: 損益のいくらかの(どんな)リリース @ja-jp
definition: Any increase of earnings results. @en-gb
definition: Informazioni riguardanti gli utili conseguiti
definition: Qualquer comunicado sobre os lucros de uma empresa. @pt-pt
definition: Jede Steigerung des Umsatzergebnisses. @de
definition: Todo comunicado sobre os lucros de uma empresa. @pt-br
definition: Cualquier novedad sobre resultados de utilidades. @es
note: nessuno
in scheme: Subject Code
created: 2000-10-30T12:00:00+00:00
modified: 2010-12-15T17:01:09+00:00
broader: Informazione d'impresa

Finanziamenti, Offerte azionarie
type: Concept
preferred label: Aktien/Börsengang @de
preferred label: financing and stock offering @en-gb
preferred label: Introduction en bourse @fr
preferred label: financiamento e oferta de ações @pt-br
preferred label: 株式公開 @ja-jp
preferred label: financiamiento, ofertas de acciones @es
definition: Histórias sobre novas oferta de ações, incluindo ofertas públicas iniciais. @pt-pt
definition: Neue Wertpapierangebote, inklusive öffentliche Erstangebote. @de
definition: Nuove aperture di capitale, Offerte pubbliche
definition: IPOを含む株の買い付け条件 @ja-jp
definition: Historias sobre nuevas ofertas de patrimonio, incluyendo ofertas públicas. @es
definition: Informations concernant les ouvertures de capital et les introductions en bourse @fr
definition: New offerings of equity including initial public offerings. @en-gb
note: nessuno
in scheme: Subject Code
created: 2000-10-30T12:00:00+00:00
modified: 2010-12-15T17:01:09+00:00
broader: Informazione d'impresa

Contratti pubblici
type: Concept
preferred label: 政府契約 @ja-jp
preferred label: contratos gubernamentales @es
preferred label: Contrats publics @fr
preferred label: contratos c/ o Estado (exclui Defesa) @pt-br
preferred label: Öffentlicher Auftrag @de
preferred label: government contract @en-gb
definition: Zusage von Regierungsverträgen ohne Bezug zu Verteidigungsaktivitäten. @de
definition: L'attribution de contrats publics sauf les activités de défense @fr
definition: Attribuzioni di contratti pubblici, esclusi quelli riguardanti la Difesa
definition: Atribuição de contratos governamentais não relacionados com atividades de defesa. @pt-pt
definition: ディフェンス活動に関連しない政府契約の賞 @ja-jp
definition: Atribuição de contratos governamentais não relacionados a atividades de defesa. @pt-br
definition: The award of government contracts not related to defence activity @en-gb
definition: Adjudicación de contratos gubernamentales no relacionados con actividades de defensa. @es
note: nessuno
in scheme: Subject Code
created: 2000-10-30T12:00:00+00:00
modified: 2010-12-15T17:01:09+00:00
broader: Informazione d'impresa
broad match: http://cv.iptc.org/newscodes/mediatopic/20000196

Espansione globale
type: Concept
preferred label: Globale Erweiterung @de
preferred label: expansión global @es
preferred label: 海外進出 @ja-jp
preferred label: expansão internacional @pt-pt
preferred label: global expansion @en-gb
preferred label: Développement international @fr
definition: Apertura o previsione d'apertura di uffici o rappresentanze in altri paesi
definition: Abertura ou previsão de abertura pela primeira vez de uma representação ou de um escritório no estrangeiro. @pt-pt
definition: Planned or actual openings of offices in countries for the first time. @en-gb
definition: Ouvertures (ou prévsion d'ouverture) d'une représentation ou de bureaux dans un pays @fr
definition: 各国における最初のオフィスの計画的なあるいは実際のオープニング @ja-jp
definition: Apertura de oficinas en el extranjero por primera vez, planificadas o actuales @es
definition: Geplante oder aktuell durchgeführte Ersteröffnung von Filialen in mehreren Ländern. @de
note: nessuno
in scheme: Subject Code
created: 2000-10-30T12:00:00+00:00
modified: 2010-12-15T17:01:09+00:00
broader: Informazione d'impresa
broad match: http://cv.iptc.org/newscodes/mediatopic/20000170

Insider Trading
type: Concept
preferred label: informação privilegiada @pt-pt
preferred label: インサイダー取引 @ja-jp
preferred label: Délits d'initiés @fr
preferred label: transacciones de allegados @es
preferred label: Insiderhandel @de
preferred label: insider trading @en-gb
definition: Relatórios de compra ou venda de ações por dirigentes ou administradores de empresas. @pt-br
definition: Handelsaktivitäten von Insidern, die auf deren Wissensvorsprung basieren und eine Reaktion des Marktes auf diese Information vorwegnehmen. @de
definition: 会社役人、あるいはボードメンバーによる株の購入、あるいはセールの報告 @ja-jp
definition: Acquisto o vendita di azioni da parte di funzionari o dirigenti di società
definition: The purchase or sales of stock by corporate officers or board members. @en-gb
definition: Reportes de compra o venta de acciones por ejecutivos o directores de empresas. @es
definition: Informations sur l'achat ou la vente d'actions par des cadres dirigeants ou des administrateurs d'entreprises @fr
note: nessuno
in scheme: Subject Code
created: 2000-10-30T12:00:00+00:00
modified: 2010-12-15T17:01:09+00:00
broader: Informazione d'impresa

Joint Venture
type: Concept
preferred label: operaciones conjuntas @es
preferred label: 合弁事業 @ja-jp
preferred label: joint venture @en-gb
preferred label: Entreprise en participation @fr
preferred label: Joint Ventures @de
definition: Notícias sobre joint ventures entre companhias (não relacionadas ao marketing - ver Marketing). @pt-br
definition: Noticias sobre negocios conjuntos entre compañías (no relacionadas con Marketing - ver marketing) @es
definition: Notícias sobre joint ventures entre companhias (não relacionadas com marketing - ver Marketing). @pt-pt
definition: Kooperationsvereinbarung über den gemeinsamen Betrieb von Unternehmen, die einzubringenden Kapitalien, das zu liefernde Know-how, die aufzuteilenden Gewinne. Nicht in bezug auf Marketing. @de
definition: Accordi di collaborazione da cui derivano società controllate congiuntamente dalle imprese che li hanno conclusi
definition: 会社間のジョイントヴェンチャーに関するニュース(マーケティングとは関連しませんが-マーケティングを見て下さい) @ja-jp
definition: Joint ventures between companies. (Not marketing related - see Marketing.) @en-gb
definition: Informations relatives aux joint ventures (sauf celles liées au marketing) @fr
note: nessuno
in scheme: Subject Code
created: 2000-10-30T12:00:00+00:00
modified: 2010-12-15T17:01:09+00:00
broader: Informazione d'impresa

Leveraged buy out
type: Concept
preferred label: leveraged buyout @en-gb
preferred label: Rachats d'entreprises @fr
preferred label: ＬＢＯ @ja-jp
preferred label: compras apalancadas @es
preferred label: Übernahme @de
preferred label: aquisição alavancada @pt-pt
definition: Notícias sobre aquisições alavancadas (operações de recompra de ações de uma empresa, por membros da própria empresa, financiados por empréstimos). @pt-pt
definition: Einflussreiche Aufkäufe. @de
definition: Acquisto di pacchetti azionari da parte dei dirigenti offrendo in garanzia le attività dell'azienda
definition: Noticias acerca de compras apalancadas @es
definition: Informations sur les rachats d'entreprise par des dirigeants @fr
definition: Leveraged buyouts. @en-gb
definition: レバレッジドバイアウトについてのニュース @ja-jp
note: nessuno
in scheme: Subject Code
created: 2000-10-30T12:00:00+00:00
modified: 2010-12-15T17:01:09+00:00
broader: Informazione d'impresa

Licenziamenti, Ridimensionamenti
type: Concept
preferred label: despidos y reducciones de tamaño @es
preferred label: 人員削減 @ja-jp
preferred label: Entlassung und Rationalisierung @de
preferred label: redução de efetivos @pt-pt
preferred label: Restructurations @fr
preferred label: layoffs and downsizing @en-gb
definition: Riduzioni programmate o attuate della forza lavoro all'interno delle aziende
definition: 計画的なあるいは実際の労働力の減少 @ja-jp
definition: Geplante oder aktuell durchgeführte Minimierung der Arbeitskräfte/Ressourcen. @de
definition: Reducciones actuales o planificadas en la fuerza laboral de empresas. @es
definition: Planned or actual reductions in the labour force. @en-gb
definition: Licenciements et plans sociaux @fr
definition: Reduções reais ou previstas da força de trabalho de uma empresa. @pt-pt
note: nessuno
in scheme: Subject Code
created: 2000-10-30T12:00:00+00:00
modified: 2010-12-15T17:01:09+00:00
broader: Informazione d'impresa

Accordi di licenza
type: Concept
preferred label: contratos de concesión de licencia @es
preferred label: Lizenz @de
preferred label: ライセンス契約 @ja-jp
preferred label: contrato de licença @pt-br
preferred label: licensing agreement @en-gb
preferred label: Accords de licence @fr
definition: ライセンスしている会社の合意についてのストーリー @ja-jp
definition: Lizenzvereinbarungen zwischen zwei Vertragspartnern. @de
definition: Accordi tra le società per concessioni di licenze
definition: Licensing agreements between companies. @en-gb
definition: Histórias sobre contratos de licença entre companhias. @pt-pt
definition: Accords de licence entre les sociétés @fr
definition: Historias acuerdos en la concesión de licencias entre compañías. @es
note: nessuno
in scheme: Subject Code
created: 2000-10-30T12:00:00+00:00
modified: 2010-12-15T17:01:09+00:00
broader: Informazione d'impresa

Contenziosi, Regolamenti
type: Concept
preferred label: Unternehmensrecht @de
preferred label: litigation and regulation @en-gb
preferred label: litigios y reglamentaciones @es
preferred label: 企業訴訟 @ja-jp
preferred label: litígios e regulamentações @pt-br
preferred label: Contentieux @fr
definition: Corporate law including litigation and regulations. @en-gb
definition: Informations relatives au droit des sociétés y compris les litiges et les réglementations @fr
definition: Histórias sobre direito empresarial, incluindo litígios e regulações. @pt-br
definition: 訴訟、および規制を含む会社法律をみなすストーリー @ja-jp
definition: Historias sobre leyes corporativas, incluyendo litigios y regulaciones. @es
definition: Firmengesetze inklusive Rechtsstreitigkeiten und Regelungen. @de
definition: Il diritto societario, i regolamenti e le controversie legali
note: nessuno
in scheme: Subject Code
created: 2000-10-30T12:00:00+00:00
modified: 2010-12-15T17:01:09+00:00
broader: Informazione d'impresa

Cambi Management
type: Concept
preferred label: Führungswechsel @de
preferred label: mudanças de gestores @pt-pt
preferred label: 人事異動 @ja-jp
preferred label: cambios en la gerencia @es
preferred label: Modification de l'organigramme @fr
preferred label: management change @en-gb
definition: 会社役員レベル以下のマネージメントの主要な任命、または変更 @ja-jp
definition: Cambios en la administración bajo el nivel de gerente general @es
definition: Nomeações e mudanças importantes na administração, abaixo do nível dos quadros superiores. @pt-br
definition: Nominations et changements importants dans l'encadrement hors cadres supérieurs @fr
definition: Größere Anstellungen oder Wechsel in der Ebene unterhalb der Geschäftsführung. @de
definition: Nomine o sostituzioni nel management
definition: Major appointments or changes in management below the level of corporate officer. @en-gb
note: nessuno
in scheme: Subject Code
created: 2000-10-30T12:00:00+00:00
modified: 2010-12-15T17:01:09+00:00
broader: Informazione d'impresa

marketing
type: Concept
preferred label: Marketing
preferred label: 新事業 @ja-jp
preferred label: comercialización @es
definition: Accordi di commercio congiunto tra società, adozioni di strategie per il lancio di nuovi prodotti, ecc.
definition: Notícias relativas a acordos de marketing conjunto entre empresas, adoção de novas estratégias de marketing, etc. @pt-br
definition: Informations concernant les accords conjoints de marketing, l'adoption de stratégies pour le lancement de nouveaux produits, etc. @fr
definition: Beinhaltet Nachrichten über Zusammenschlüsse von Unternehmen in Bezug auf das Marketing, Marketingstrategien für neue Produkte etc. @de
definition: Includes news regarding joint marketing agreements between companies, adoption of new product marketing strategies, etc. @en-gb
definition: Incluye noticias de acuerdos de marketing entre empresas, marketing de nuevos productos. @es
definition: 会社間、新製品マーケティング戦略の採用などにおける共同マーケティング協定に関するニュースを含む @ja-jp
note: nessuno
in scheme: Subject Code
created: 2000-10-30T12:00:00+00:00
modified: 2010-12-15T17:01:09+00:00
broader: Informazione d'impresa

Nuovi prodotti
type: Concept
preferred label: Nouveaux produits @fr
preferred label: new product @en-gb
preferred label: novo produto @pt-pt
preferred label: 新製品 @ja-jp
preferred label: nuevos productos @es
preferred label: Neue Produkte @de
definition: Ankündigung neuer Produkte. @de
definition: Anuncios de nuevos productos @es
definition: Announcements of new products. @en-gb
definition: Annunci di nuovi prodotti
definition: Anúncios de produtos novos. @pt-pt
definition: L'annonce de nouveaux produits @fr
definition: 新しい製品のアナウンス @ja-jp
note: nessuno
in scheme: Subject Code
created: 2000-10-30T12:00:00+00:00
modified: 2010-12-15T17:01:09+00:00
broader: Informazione d'impresa

Brevetti, Copyright
type: Concept
preferred label: patent, copyright and trademark @en-gb
preferred label: 知的所有権 @ja-jp
preferred label: Patent, Copyright und Warenzeichen @de
preferred label: Patentes et brevets @fr
preferred label: patente, direitos de autor e marca registada @pt-pt
preferred label: patentes, propiedad intelectual, marcas registradas @es
preferred label: patente, direitos de autor e marca registrada @pt-br
definition: News related to patents, copyright and trademarks. @en-gb
definition: Artikel über Patente, Copyright und Warenzeichen. @de
definition: Licenze, riproduzioni vietate, marchi di fabbrica
definition: 特許、著作権、およびトレードマークに関するニュース @ja-jp
definition: Notícias relativas a patentes, direitos de autor e marcas registadas. @pt-pt
definition: Notícias relativas a patentes, direitos de autor e marcas registradas. @pt-br
definition: Noticias relacionadas con patentes, propiedad intelectual y marcas comerciales. @es
definition: Informations relatives aux brevets, copyrights et marques déposées @fr
note: nessuno
in scheme: Subject Code
created: 2000-10-30T12:00:00+00:00
modified: 2010-12-15T17:01:09+00:00
broader: Informazione d'impresa

Chiusure Stabilimenti
type: Concept
preferred label: fecho de fábrica @pt-br
preferred label: plant closing @en-gb
preferred label: cierres de plantas @es
preferred label: Betriebsschlieung @de
preferred label: 工場閉鎖 @ja-jp
preferred label: Fermetures d'usines @fr
definition: Anuncios de cierres actuales o planificados de plantas. @es
definition: L'annonce de fermetures d'usines présentes ou à venir @fr
definition: Anúncios de encerramento ou de previsão de encerramento de fábricas. @pt-pt
definition: Annunci riguardanti progettate o attuate chiusure di impianti o fabbriche
definition: 計画的なあるいは実際のプラント大引けのアナウンス @ja-jp
definition: Announcements of planned or actual plant closings. @en-gb
definition: Ankündigung geplanter oder aktueller Schließungen von Betrieben. @de
note: nessuno
in scheme: Subject Code
created: 2000-10-30T12:00:00+00:00
modified: 2010-12-15T17:01:09+00:00
broader: Informazione d'impresa
broad match: http://cv.iptc.org/newscodes/mediatopic/20000170

Aperture Stabilimenti
type: Concept
preferred label: abertura de fábrica @pt-pt
preferred label: Ouvertures d'usines @fr
preferred label: plant opening @en-gb
preferred label: Betriebseröffnung @de
preferred label: 工場新設 @ja-jp
preferred label: aperturas de plantas @es
definition: Anuncios de apertura de plantas actuales o planificados. @es
definition: Anúncios de abertura ou de previsão de abertura de fábricas. @pt-pt
definition: L'annonce d'ouverture d'usines présentes ou à venir @fr
definition: Ankündigung geplanter oder aktueller Eröffnungen von Betrieben. @de
definition: Announcements of planned or actual plant openings. @en-gb
definition: Annunci riguardanti progettate o attuate aperture di impianti o fabbriche
definition: 計画的なあるいは実際のプラント･オープニングのアナウンス @ja-jp
note: nessuno
in scheme: Subject Code
created: 2000-10-30T12:00:00+00:00
modified: 2010-12-15T17:01:09+00:00
broader: Informazione d'impresa
broad match: http://cv.iptc.org/newscodes/mediatopic/20000170

Privatizzazioni
type: Concept
preferred label: privatizaciones @es
preferred label: privatização @pt-pt
preferred label: 民営化 @ja-jp
preferred label: Privatisations @fr
preferred label: privatisation @en-gb
preferred label: Privatisierung @de
definition: Les histoires concernant la privatisation d'entreprises publiques @fr
definition: Privatisation (privatisation) of state run companies. @en-gb
definition: Privatizzazione di imprese pubbliche
definition: Privatisierung von staatlich geführten Unternehmen. @de
definition: Histórias relativas à privatização de empresas estatais. @pt-pt
definition: 政府が運営する企業の民営化(民営化)に関するストーリー @ja-jp
definition: Historias de privatizaciones de compañías estatales. @es
note: nessuno
in scheme: Subject Code
created: 2000-10-30T12:00:00+00:00
modified: 2010-12-15T17:01:09+00:00
broader: Informazione d'impresa

Deleghe
type: Concept
preferred label: proxy filing @en-gb
preferred label: procurações @pt-pt
preferred label: registros por apoderados @es
preferred label: 委任状勧誘 @ja-jp
preferred label: Procurations @fr
preferred label: Anmeldung von Stimmrechtsvollmacht @de
definition: 次期株主投票での代理声明を規制する機関のファイリング @ja-jp
definition: Raccolta di deleghe di voto in vista dell'assemblea generale degli azionisti
definition: Les déclarations de procuration en vue de l'assemblée générale des actionnaires @fr
definition: Declarações de procurações junto de agências reguladoras para futuras votações de acionistas. @pt-pt
definition: Registros de poderes en organismos reguladores en relación con votos de accionistas. @es
definition: Filings with regulatory agencies of proxy statements for upcoming shareholder votes. @en-gb
definition: Anmeldungen von Stimmrechtsanteilen von Aktionären bei Aufsichtsbehörden. @de
note: nessuno
in scheme: Subject Code
created: 2000-10-30T12:00:00+00:00
modified: 2010-12-15T17:01:09+00:00
broader: Informazione d'impresa

Rating
type: Concept
preferred label: 格付け @ja-jp
preferred label: rating @pt-pt
preferred label: clasificaciones @es
preferred label: Indice et classement @fr
preferred label: Kreditwürdigkeit @de
definition: Classificações de dívida e de crédito corporativos e soberanos (e.g. S&P ou Moody's). @pt-br
definition: Clasificaciones de deuda y solvencia corporativa y soberana (Ej.: StandP o Moody's). @es
definition: Kollektive und individuelle Schulden und Kredit-Ratings (z.B SandP oder Moody's). @de
definition: Corporate and sovereign debt and credit ratings (e.g. SandP or Moody's) @en-gb
definition: 法人の、また主権がある負債、および債券格付け(例えばSandP、あるいはムーディーの) @ja-jp
definition: La notation des entreprises (ex: Standard and Poors ou Moody) @fr
definition: Classificazione e valutazione secondo determinati indici della qualità dei titoli o della solidità finanziaria (ad es. S&P o Moody's)
note: nessuno
in scheme: Subject Code
created: 2000-10-30T12:00:00+00:00
modified: 2010-12-15T17:01:09+00:00
broader: Informazione d'impresa

Ricerche, Sviluppo
type: Concept
preferred label: Forschung und Entwicklung @de
preferred label: Recherche et developpement @fr
preferred label: pesquisa e desenvolvimento @pt-br
preferred label: research and development @en-gb
preferred label: 研究・開発 @ja-jp
preferred label: investigación y desarrollo @es
definition: Notícias sobre investigação e despesas relativas ao desenvolvimento de novos produtos. @pt-pt
definition: Forschung und Ausgaben für die Entwicklung neuer Produkte. @de
definition: Research and expenditure on new product development. @en-gb
definition: Noticias sobre investigación e inversión en desarrollo de nuevos productos. @es
definition: Informazioni sulla ricerca e lo sviluppo di nuovi prodotti
definition: 新しい製品開発の支出と研究に関してのニュース @ja-jp
definition: Informations sur la recherche et le développement de nouveaux produits @fr
note: nessuno
in scheme: Subject Code
created: 2000-10-30T12:00:00+00:00
modified: 2010-12-15T17:01:09+00:00
broader: Informazione d'impresa

Comunicazioni finanziarie trimestrali, semestrali
type: Concept
preferred label: situação financeira trimestral ou semestral @pt-pt
preferred label: quarterly or semiannual financial statement @en-gb
preferred label: Quartals- und Halbjahresbilanz @de
preferred label: estados financieros trimestrales o semestrales @es
preferred label: 決算 @ja-jp
preferred label: Comptes trimestriels et semestriels @fr
definition: 入手可能性に関連するストーリー、あるいは季別のあるいは半年毎の企業レポートのコンテンツ @ja-jp
definition: Historias sobre la disponibilidad o contenido de memorias corporativas trimestrales o semestrales. @es
definition: Pubblicazione dei rapporti o del contenuto dei rapporti trimestrali o semestrali delle imprese
definition: Availability or contents of quarterly or semi-annual corporate reports. @en-gb
definition: Histórias relativas à disponibilidade ou aos conteúdos de relatórios trimestrais ou semestrais de empresas. @pt-pt
definition: La publication des rapports trimestriels ou semestriels des entreprises @fr
definition: Verfügbarkeit oder Inhalt von Quartals- oder Halbjahresbilanzen von Firmen. @de
note: nessuno
in scheme: Subject Code
created: 2000-10-30T12:00:00+00:00
modified: 2010-12-15T17:01:09+00:00
broader: Informazione d'impresa

Ricapitalizzazioni
type: Concept
preferred label: reestruturação e recapitalização @pt-br
preferred label: reestructuración, recapitalización @es
preferred label: リストラ @ja-jp
preferred label: Recapitalisation @fr
preferred label: Neufinanzierung und Umstrukturierung @de
preferred label: restructuring and recapitalisation @en-gb
definition: Sale of company units, splits of existing companies into units under a holding company, etc. @en-gb
definition: Les histoires relatives à la restructuration des entreprises, vente par appartement, création de holdings, etc. @fr
definition: Histórias relativas à venda de unidades de negócio, à separação de empresas existentes em unidades de negócio de holdings, etc. @pt-br
definition: Verkauf von Unternehmensteilen, Aufsplittung von bestehenden Unternehmen in Teile einer Holding etc. @de
definition: Historias sobre la venta de unidades de negocio o compras de compañías como unidades de negocio de holdings, etc. @es
definition: Ristrutturazioni attraverso la vendita di unità produttive, divisione delle società sotto una holding, ecc.
definition: 企業単位、持ち株会社下の既存企業の分割単位の売上を含むストーリー @ja-jp
note: nessuno
in scheme: Subject Code
created: 2000-10-30T12:00:00+00:00
modified: 2010-12-15T17:01:09+00:00
broader: Informazione d'impresa

Spin-Off
type: Concept
preferred label: Essaimage @fr
preferred label: spin-off @en-gb
preferred label: escisiones @es
preferred label: 分離独立 @ja-jp
preferred label: Ausgründung @de
definition: Creazione di nuove società dallo scorporo di compagnie preesistenti
definition: Historias sobre la creación de nuevas compañías a partir de divisiones de compañías existentes. @es
definition: 既存企業から分離されて新しいカンパニーの創設に関するストーリー @ja-jp
definition: Histórias relativas à criação de empresas novas a partir de divisões de empresas existentes. @pt-pt
definition: Les histoires concernant la création d'entreprises nouvelles issues de sociétés existantes @fr
definition: Gründung neuer Firmen, die sich aus bestehenden Firmen ausgegliedert haben. @de
definition: Creation of new companies being spun off from existing companies. @en-gb
note: nessuno
in scheme: Subject Code
created: 2000-10-30T12:00:00+00:00
modified: 2010-12-15T17:01:09+00:00
broader: Informazione d'impresa

Attività Titoli
type: Concept
preferred label: Activité du titre @fr
preferred label: atividade bolsista @pt-pt
preferred label: 株式動向 @ja-jp
preferred label: stock activity @en-gb
preferred label: Aktienbewegung @de
preferred label: actividad accionaria @es
definition: Anúncios de eventos bolsistas importantes: divisões, grandes transações, novos máximos e mínimos, etc. @pt-br
definition: 主要な株イベントのアナウンス:分割、大口売買、新高低値 @ja-jp
definition: Annunci importanti riguardanti il movimento dei titoli: vendite in blocco, nuovi cali o rialzi, ecc.
definition: Announcements of major stock events: splits, block trades, new highs or lows, etc. @en-gb
definition: Les annonces importantes concernant les mouvements d'actions. Ex : plus haut, plus bas, achat ou cession par blocs, division d'actions, etc. @fr
definition: Anuncios de eventos accionarios importantes: particiones, comercio de bloques, nuevas alzas o caídas, etc. @es
definition: Ankündigungen von großen Aktienereignissen: Splits, Blockverkäufe, neue Kurshöhen und Tiefen etc. @de
note: nessuno
in scheme: Subject Code
created: 2000-10-30T12:00:00+00:00
modified: 2010-12-15T17:01:09+00:00
broader: Informazione d'impresa

Produzione industriale
type: Concept
preferred label: Industrieproduktion @de
preferred label: produção industrial @pt-pt
preferred label: Production industrielle @fr
preferred label: industrial production @en-gb
preferred label: 鉱工業生産 @ja-jp
preferred label: producción industrial @es
definition: Fabbricazione di beni durevoli e non durevoli
definition: Industrielle Produktion von haltbaren und nicht haltbaren Waren. @de
definition: Fabricación de bienes durables y no durables. @es
definition: Fabrico de bens duradouros e não-duradouros. @pt-pt
definition: Manufacture of durable and non-durable goods @en-gb
definition: 耐久消費財と非耐久財の製造 @ja-jp
definition: Fabrico de bens duráveis e não duráveis. @pt-br
definition: Ce qui concerne la fabrication de biens durables et non-durables @fr
note: nessuno
in scheme: Subject Code
created: 2003-04-05T12:00:00+00:00
modified: 2012-07-10T12:00:00+00:00
broader: Informazione d'impresa

Produttività
type: Concept
preferred label: produtividade @pt-br
preferred label: Produktivität @de
preferred label: 生産性 @ja-jp
preferred label: productivity @en-gb
preferred label: producción @es
preferred label: Productivité @fr
definition: Custo de produção de um item de valor, geralmente medido como o rendimento por hora e por pessoa. @pt-pt
definition: Custo de produção um item de valor, geralmente medido como o rendimento por hora e por pessoa. @pt-br
definition: The cost of labour to produce an item of value, often measured as output per hour per person @en-gb
definition: ひとつの価値あるものを生み出すための労働コスト。しばしば、一人の人間の一時間の生産高で計られる @ja-jp
definition: Costo de trabajo para producir un ítem de valor, generalmente medido como el rendimiento por hora y por persona. @es
definition: Le coût du travail par rapport au coût de production d'un bien @fr
definition: Die Arbeitskosten etwas zu produzieren, meist berechnet durch die Leistung pro Stunde pro Person. @de
definition: Costo del lavoro per la produzione di un bene di un determinato valore, spesso misurato come rendimento orario per persona
note: nessuno
in scheme: Subject Code
created: 2003-04-05T12:00:00+00:00
modified: 2012-07-10T12:00:00+00:00
broader: Informazione d'impresa

Inventari
type: Concept
preferred label: inventários @pt-pt
preferred label: inventories @en-gb
preferred label: Inventur @de
preferred label: Stocks @fr
preferred label: 在庫 @ja-jp
preferred label: inventarios @es
definition: Bens que não foram vendidos e que permanecem no produtor, grossista ou retalhista. @pt-pt
definition: L'ensemble des marchandises en stock @fr
definition: Goods not sold and held by the producer, wholesaler or retailer @en-gb
definition: 生産者、卸売業者あるいは小売り業者によって、売られずに保管されている商品 @ja-jp
definition: Bens que não foram vendidos e que permanecem no produtor, atacadista ou varejista. @pt-br
definition: Insieme dei beni non venduti e tenuti dal produttore, grossista o dettagliante
definition: Bienes que el productor, vendedor en mayoría y minorista no vende ni tiene. @es
definition: Waren, die unverkauft in der Produktion, beim Verteiler oder im Großhandel bleiben. @de
note: nessuno
in scheme: Subject Code
created: 2003-04-05T12:00:00+00:00
modified: 2012-07-10T12:00:00+00:00
broader: Informazione d'impresa

Vendite
type: Concept
preferred label: Ventes @fr
preferred label: 特売 @ja-jp
preferred label: ventas @es
preferred label: sales @en-gb
preferred label: vendas @pt-br
preferred label: Absatz @de
definition: Sowohl der Austausch von Waren gegen Geld, als auch die Praxis Preise zu drücken, um den Warenverkauf zu erhöhen oder um abgelaufene Waren loszuwerden. @de
definition: Intercambio de bienes por dinero o practica de descontar precios para aumentar la cantidad de bienes que se venden, o deshacerse de mercadería vieja. @es
definition: La vente de marchandises y compris en solde @fr
definition: お金と商品を交換すること。または、商品の販売量を増やすためや旧式の商品を処分するために割り引きすること @ja-jp
definition: Troca de bens por dinheiro ou a prática de baixar os preços para aumentar a quantidade de bens vendidos ou para escoar mercadoria. @pt-br
definition: Either the exchange of goods for money, or the practice of discounting prices to increase the amount of goods sold, or to get rid of outdated merchandise @en-gb
definition: Cessioni di beni, merci o servizi in cambio di un corrispettivo in denaro
note: nessuno
in scheme: Subject Code
created: 2003-04-05T12:00:00+00:00
modified: 2012-07-10T12:00:00+00:00
broader: Informazione d'impresa

Società
type: Concept
preferred label: 会社 @ja-jp
preferred label: grandes empresas @pt-pt
preferred label: Personne morale @fr
preferred label: corporaciones @es
preferred label: Gesellschafter @de
preferred label: corporations @en-gb
definition: Companhias de negócios formalmente autorizadas com conselhos de administração e estruturas hierárquicas. @pt-br
definition: Business enterprises formally licensed with boards of directors and hierarchical structures of governance @en-gb
definition: Entreprises formellement constituées avec un conseil d'administration et des structures hiérarchiques de gouvernement @fr
definition: Empresas formalmente autorizadas con juntas de directores y estructuras de jerarquía de mando. @es
definition: Imprese formalmente costituite con consigli di amministrazione e strutture di direzione; Società di capitali; Società per azioni
definition: 取締役会や階層的な統治する機構から形式的に認められた商業的な事業体 @ja-jp
definition: Wirtschaftsunternehmen, die formal durch eine Geschäftsführungsbenene und eine hierarchische Führungsstruktur genehmigt sind. @de
note: nessuno
in scheme: Subject Code
created: 2003-04-05T12:00:00+00:00
modified: 2012-07-10T12:00:00+00:00
broader: Informazione d'impresa

Azionisti
type: Concept
preferred label: acionistas @pt-br
preferred label: 株主 @ja-jp
preferred label: shareholders @en-gb
preferred label: accionistas @es
preferred label: Aktionär @de
preferred label: Actionnaire @fr
definition: 会社によって支給された1枚の有価証券を持っている人。価値は変化し、会社の業績による配当に対する権利を与えられる @ja-jp
definition: Coloro i quali possiedono azioni emesse da una società, titoli di credito che rappresentano una quota del capitale nominale e che garantiscono loro diritto ai dividendi
definition: Toute personne possédant une action émise par une société et lui donnant droit de percevoir des dividendes @fr
definition: Jeder Inhaber von Aktien einer Aktiengesellschaft (AG) und somit Miteigentümer an einem Unternehmen. @de
definition: Qualquer titular de documento emitido por uma empresa, que tem valor variável e que lhe dá direito a dividendos consoante o desempenho da empresa. @pt-pt
definition: Todo titular de documento emitido por uma empresa, que tem valor variável e que lhe dá direito a dividendos consoante o desempenho da empresa. @pt-br
definition: Cualquier portador que tenga un documento emitido por una empresa el cual les de valor y les de el derecho a dividendos dependiendo del desempeño de su empresa. @es
definition: Anyone holding a piece of paper issued by a company which changes in value and entitles them to dividends depending on the performance of the company @en-gb
note: nessuno
in scheme: Subject Code
created: 2003-04-05T12:00:00+00:00
modified: 2012-07-10T12:00:00+00:00
broader: Informazione d'impresa

Risultati aziendali
type: Concept
preferred label: Unternehmensergebnis @de
preferred label: desempenho corporativo @pt-pt
preferred label: desempeño corporativo @es
preferred label: corporate performance @en-gb
preferred label: Performance des entreprises @fr
preferred label: 企業業績 @ja-jp
definition: How well a company performs, measured by its net earnings, its dividends its earnings per share and price/earnings ratio @en-gb
definition: Wie gut ein Unternehmen geführt ist, gemessen an dem Nettoeinkommen, den Dividenden, Anteilseinkommen und dem Preis-Leistungsverhältnis. @de
definition: Qual o comportamento de uma empresa, medido por seus ganhos líquidos, dividendos, ganhos por ação e relação preço/ganhos. @pt-br
definition: La mesure des performances des entreprises : revenus nets, revenu par action, dividendes, ratio coûts/revenus @fr
definition: Performance di società in base ai guadagni netti, dividendi, guadagni per azione e rapporto prezzo/guadagni
definition: 会社の業績は、その純所得、その配当によってその1株あたり収益と株価収益率を測る @ja-jp
definition: Como se desempeña una empresa , medida en sus ganancias netas, dividendos, ganancias por acción y en proporción de precio ganancia. @es
definition: Qual o comportamento de uma empresa, medido pelos seus ganhos líquidos, dividendos, ganhos por ação e relação preço/ganhos. @pt-pt
note: nessuno
in scheme: Subject Code
created: 2003-04-05T12:00:00+00:00
modified: 2012-07-10T12:00:00+00:00
broader: Informazione d'impresa
broad match: http://cv.iptc.org/newscodes/mediatopic/20000170

Perdite
type: Concept
preferred label: Pertes @fr
preferred label: losses @en-gb
preferred label: perdas @pt-pt
preferred label: 損失 @ja-jp
preferred label: Verlust @de
preferred label: perdidas @es
definition: Quand les dépenses dépasse les revenus @fr
definition: Quando as despesas excedem os lucros. @pt-pt
definition: Wenn Ausgaben die Einnahmen übersteigen. @de
definition: When expenses exceed revenue @en-gb
definition: Cuando los gastos exceden los ingresos. @es
definition: Situazioni in cui le spese superano i profitti
definition: 経費が収入を超えること @ja-jp
note: nessuno
in scheme: Subject Code
created: 2003-04-05T12:00:00+00:00
modified: 2012-07-10T12:00:00+00:00
broader: Informazione d'impresa
broad match: http://cv.iptc.org/newscodes/mediatopic/20000170

Affidabilità creditizia
type: Concept
preferred label: clasificaciones de riesgo @es
preferred label: notação de risco @pt-br
preferred label: credit ratings @en-gb
preferred label: Kreditrating @de
preferred label: Degré de solvabilité @fr
preferred label: 信用度 @ja-jp
definition: 会社、国あるいは企業に対する投資リスクにおいて、スタンダード･アンド･プアーズのようなある格付け機関から出された公式な報告 @ja-jp
definition: Evaluation effectuée par certaines agences de notation (Standard and Poor's par ex.) sur le niveau de risque à l'investissement dans une entreprise, un groupe ou un pays @fr
definition: Declarações formais feitas por certas agências, como a Standard & Poor's, sobre o risco de investimento de uma companhia, país ou empresa. @pt-pt
definition: Formelle Stellungnahmen von verschiedenen Agenturen, die Ratings durchführen, Standrad and Poor's über das Investitionsrisiko einer Firma, eines Landes oder eines Unternehmens. @de
definition: Formal statements by certain rating agencies such as Standard and Poor's on the investment risk of a company, a country or enterprise @en-gb
definition: Valutazioni compiute da agenzie di categoria (ad es. S&P) sul livello di rischio di investimento da parte di una società, un paese o impresa
definition: Declaraciones formales hechas por ciertas agencias acerca de el riesgo de inversión de una compañía , país o empresa. @es
note: nessuno
in scheme: Subject Code
created: 2003-04-05T12:00:00+00:00
modified: 2012-07-10T12:00:00+00:00
broader: Informazione d'impresa

Frazionamenti azionari
type: Concept
preferred label: distribución de acciones @es
preferred label: Aktiensplitting @de
preferred label: 株式分割 @ja-jp
preferred label: desdobramento de ações @pt-pt
preferred label: échanges d'actions @fr
preferred label: stock splits @en-gb
definition: Emitir múltiples acciones de una. Generalmente ocurre cuando el precio de una acción ha aumentado tanto que su precio de compra ya no resulta atractiva. Lo contrario sucede cuando se emite una acción para generar múltiples acciones, para elevar el valor @es
definition: Bei einem Aktiensplit wird der aktuelle Aktienbestand einer AG in mehr Aktien aufgeteilt, weil. Dadurch werden Aktien mit sehr hohem Kursniveau optisch günstiger und attraktiver. @de
definition: Emissão de ações múltiplas. Ocorre quando o preço de uma ação aumentou tanto que o seu preço de compra deixou ser atrativo. O contrário sucede quando uma ação é emitida para troca de múltiplas ações, para aumentar o valor por ação se for muito baixo. @pt-pt
definition: Issuing multiple shares for one share of stock. Usually occurs when the price of a stock has increased so much that its purchase price is not attractive. A reverse split is when one share is issued for multiple shares, to raise the per share value. @en-gb
definition: Emissão de ações múltiplas. Ocorre quando o preço de uma ação aumentou tanto que seu preço de compra deixou ser atrativo. O contrário sucede quando uma ação é emitida para troca de múltiplas ações, para aumentar o valor por ação se for muito baixo. @pt-br
definition: Frammentazioni di azioni uniche in varie azioni, con l'emissione di esse. Di solito si verifica quando il prezzo di un'azione aumenta a tal punto che che il suo valore d'acquisto non è attraente.
definition: Emission de nouvelles actions échangeables contre une ancienne (quand le prix de l'action est trop haut pour être attractif) et inversement, émission d'une nouvelle action échangeable contre X anciennes (pour faire monter le prix s'il est trop bas) @fr
definition: 一株を分割し、多数の株式を発行することを言う。普通はその株の購入価格が魅力的ではなく、株価が高値の時に発生する。その逆に統合は一株あたりの株価を上げるために多数の株式を一つにまとめる @ja-jp
note: nessuno
in scheme: Subject Code
created: 2003-04-05T12:00:00+00:00
modified: 2012-07-10T12:00:00+00:00
broader: Informazione d'impresa

Stock Options
type: Concept
preferred label: ストックオプション @ja-jp
preferred label: stock options @en-gb
preferred label: opções de compra de ações @pt-pt
preferred label: Options sur titres @fr
preferred label: opciones sobre acciones @es
preferred label: Aktienoptionen @de
definition: Acordo para compra ou venda de uma ação quando atinge determinado preço. @pt-br
definition: 株をある価格で売り買いする合意 @ja-jp
definition: Eine beiderseitige Vereinbarung Aktien zu kaufen oder zu verkaufen, wenn diese einen bestimmten Preis erreicht haben. @de
definition: An agreement to either buy or sell a stock when it meets a certain price @en-gb
definition: Accord pour acheter ou vendre un titre quand il atteint un niveau prédeterminé @fr
definition: Acuerdo para comprar o vender una acción cuando llegue a un determinado precio. @es
definition: Accordi per comprare o vendere un'azione quando raggiunge un certo prezzo
note: nessuno
in scheme: Subject Code
created: 2003-04-05T12:00:00+00:00
modified: 2012-07-10T12:00:00+00:00
broader: Informazione d'impresa

Richiamo Prodotti
type: Concept
preferred label: Reklamation @de
preferred label: recolha de produtos @pt-pt
preferred label: 製品リコール @ja-jp
preferred label: retiro de productos @es
preferred label: Echanges de marchandises @fr
preferred label: recalls (products) @en-gb
definition: Die Entscheidung eines Unternehmens ein defektes Produkt zurückzunehmen oder zu reparieren. @de
definition: Decisión que hace una empresa para retirar o reparar un producto defectuoso. @es
definition: 欠陥製品を回収するか、あるいは修理する会社の決定 @ja-jp
definition: Richiamo di prodotti o parti di essi da parte di una società per ripararli o ritirarli del tutto
definition: A decision by a company to take back or repair a defective product @en-gb
definition: Decisão de uma empresa de recolher ou reparar um produto com defeito. @pt-pt
definition: Le rappel de marchandises où pièces défectueuses pour les réparer où les reprendre @fr
note: nessuno
in scheme: Subject Code
created: 2003-04-05T12:00:00+00:00
modified: 2012-07-10T12:00:00+00:00
broader: Informazione d'impresa

Globalizzazione
type: Concept
preferred label: 経済の国際化 @ja-jp
preferred label: globalization @en-gb
preferred label: globalización @es
preferred label: Mondialisation @fr
preferred label: globalização @pt-br
preferred label: Globalisierung @de
definition: Fazer negócios pelo mundo inteiro. @pt-br
definition: Hacer negocios en todo el mundo. @es
definition: Expansion du commerce mondial @fr
definition: Espansione commerciale ed imprenditoriale in tutto il mondo
definition: 世界中でビジネスすること @ja-jp
definition: Doing business around the world @en-gb
definition: Weltweite Geschäftstätigkeit. @de
note: nessuno
in scheme: Subject Code
created: 2003-04-05T12:00:00+00:00
modified: 2012-07-10T12:00:00+00:00
broader: Informazione d'impresa

Consumatori
type: Concept
preferred label: Verbraucher @de
preferred label: Consommateurs @fr
preferred label: 消費者 @ja-jp
preferred label: consumidores @pt-br
preferred label: consumers @en-gb
definition: Buyers of goods and services @en-gb
definition: Käufer von Waren und Dienstleistungen. @de
definition: Chi compra beni e/o servizi
definition: Comprador de bens e serviços. @pt-br
definition: 商品およびサービスの買手 @ja-jp
definition: Compradores de bienes y servicios @es
definition: Les acheteurs de biens et de services @fr
note: nessuno
in scheme: Subject Code
created: 2003-04-05T12:00:00+00:00
modified: 2012-07-10T12:00:00+00:00
broader: Informazione d'impresa

Acquisti
type: Concept
preferred label: compras @pt-br
preferred label: 仕入れ @ja-jp
preferred label: purchase @en-gb
preferred label: Einkauf @de
preferred label: Achat @fr
definition: Cosas que compañias compran, tales como materia prima, {utiles de oficina, etc. @es
definition: 原料、事務用品のような、企業が購入する品目 @ja-jp
definition: Items that companies buy, such as raw materials, office supplies etc. @en-gb
definition: Artigos que as empresas compram, como matérias-primas, material de escritório, etc. @pt-pt
definition: Dinge, die Firmen kaufen, wie Rohmaterial, Bürozubehör etc. @de
definition: Beni e articoli comprati dalle società, ad es. materie prime ma anche forniture per ufficio, ecc...
definition: Articles que les compagnies achètent @fr
note: nessuno
in scheme: Subject Code
created: 2004-10-13T12:00:00+00:00
modified: 2012-07-10T12:00:00+00:00
broader: Informazione d'impresa

Nuovi Servizi
type: Concept
preferred label: new service @en-gb
preferred label: serviço novo @pt-pt
preferred label: nuevo servicio @es
preferred label: 新サービス @ja-jp
preferred label: Nouvelle activité @fr
preferred label: Neuangebot @de
definition: Nuevos servicios agregados por una compañía, tales como nuevas rutas de vuelo, etc. @es
definition: Novos serviços criados por uma companhia, como novas rotas de voo, etc. @pt-pt
definition: Nuovi servizi introdotti da una compagnia o società, ad es. nuove rotte aeree, ecc...
definition: Neues Angebot eines Unternehmens, wie neue Flugrouten etc. @de
definition: New services added by a company, such as new flight routes, etc. @en-gb
definition: Nouveaux services créés par une compagnie comme de nouvelles routes aériennes @fr
definition: 例えば、新しい航空路のように、会社が追加した新しいサービス @ja-jp
note: nessuno
in scheme: Subject Code
created: 2004-10-13T12:00:00+00:00
modified: 2012-07-10T12:00:00+00:00
broader: Informazione d'impresa

Politica economica
type: Concept
preferred label: economic policy @en-gb
preferred label: política económica @es
preferred label: Politique économique @fr
preferred label: política econômica @pt-br
preferred label: 経済政策 @ja-jp
preferred label: Wirtschaftspolitik @de
definition: Política governamental relativamente à produção, impostos, tarifas e outros assuntos que afetem a direção e saúde da economia. @pt-br
definition: Política de gobierno sobre la producción, impuestos, aranceles, y cosas que afecten la dirección y salud de la economía. @es
definition: Politica del governo riferita a produzione, tasse, tariffe e sui temi che hanno un effetto sullo stato dell'economia
definition: Government directed policy on production, taxes, tariffs and things that affect the direction and health of the economy @en-gb
definition: Regierungsgesteuerte Politik in Bezug auf die Produktionen, Steuern, Tarife und alles, was mit der Ausrichtung und Gesundheit der Wirtschaft zusammenhängt. @de
definition: 生産、税金、経済、関税そして経済の方向性や健全性に影響を与える事柄に関しての政府の決定 @ja-jp
definition: La politique gouvernementale en matière de production, taxes, prix et autres ayant un effet sur la santé de l'économie @fr
note: nessuno
in scheme: Subject Code
created: 2003-04-05T12:00:00+00:00
modified: 2012-07-10T12:00:00+00:00
broader: Economia (generico)

Istituzioni
type: Concept
preferred label: instituições @pt-br
preferred label: Institution @de
preferred label: institution @en-gb
preferred label: institución @es
preferred label: 制度・機関 @ja-jp
definition: una ley establecida, práctica o sistema o una organización que tiene un proposito social, religioso, educacional o proposito similar, tales como hospital, escuela o prisión. @es
definition: Lei estabelecida, prática, sistema ou organização com propósitos sociais, religiosos, educativos ou similares, como hospitais, escolas, prisões. @pt-br
definition: 確立された法律、業務、体制、あるいは病院、学校、刑務所のように、社会的/宗教的/教育的に同じ目的を持っている組織 @ja-jp
definition: Either an established law, practice or system or an organization having a social, religious, educational or similar purpose such as hospital, school, prison @en-gb
definition: Système ou organisation légalement établie @fr
definition: Legge, pratica, sistema o organizzazione avente scopo sociale, religioso, educativo o simili, ad es. ospedali, scuole, prigioni
definition: Jedes bestehende Gesetz, jede Praxis, System oder Organisation, die eine soziale, religiöse, erzieherische oder ähnliche Absicht hat, wie Krankenhaus, Schule oder Gefängnis. @de
note: era 01018001
note: code changed, was 01018001 @en-gb
note: was 01018001 @es
in scheme: Subject Code
created: 2004-08-27T12:00:00+00:00
modified: 2012-07-10T12:00:00+00:00
broader: Affari (generico)
broad match: http://cv.iptc.org/newscodes/mediatopic/04000000

Politica monetaria
type: Concept
preferred label: política monetaria y fiscal @es
preferred label: Geld- und Finanzpolitik @de
preferred label: money and monetary policy @en-gb
preferred label: 金融政策 @ja-jp
preferred label: Politique monétaire @fr
preferred label: dinheiro e política monetária @pt-br
definition: La politique monétaire des banques centrales et notamment la fixation des taux d'intérêts @fr
definition: Política bancaria del gobierno sobre la cantidad de dinero en circulación y la tasa de interés en que se puede hacer prestamos. @es
definition: Politica monetaria delle banche centrali in riferimento al denaro in circolazione e ai tassi
definition: Durch die Regierungsbank (Bundesbank) gesteuerte Politik über die Höhe des sich im Umlauf befindenden Geldes und die Zinsraten zu denen es verliehen wird. @de
definition: Política monetária governamental sobre a quantidade de dinheiro em circulação e a taxa de juro a que pode ser emprestado. @pt-br
definition: Government bank directed policy on the amount of money in circulation and the rate at which it can be loaned @en-gb
definition: 通貨の流通量と貸し出しのできるお金の歩合に関して中央銀行が出した政策 @ja-jp
note: nessuno
in scheme: Subject Code
created: 2003-04-05T12:00:00+00:00
modified: 2012-07-10T12:00:00+00:00
broader: Finanza (generico)

Istruzione
type: Concept
preferred label: educação @pt-pt
preferred label: 教育 @ja-jp
preferred label: education @en-gb
preferred label: Education @fr
preferred label: Erziehung, Ausbildung @de
preferred label: educación @es
definition: All aspects of furthering knowledge of human individuals from birth to death. @en-gb
definition: Acquisizione della conoscenza e apprendimento tramite la formazione in tutte le sue caratteristiche
definition: Tudo o que contribui para o alargamento do conhecimento dos indivíduos, desde o nascimento até a morte. @pt-br
definition: Ce qui contribue à l'accroissement des connaissances tout au long de la vie @fr
definition: Alle Aspekte der Förderung von Wissen für den Menschen von der Geburt bis zum Tod. @de
definition: Tudo o que contribui para o alargamento do conhecimento dos indivíduos, desde o nascimento até à morte. @pt-pt
definition: Todos las formas de lograr conocimiento desde el nacimiento a la muerte de las personas. @es
definition: 人が生まれてから死ぬまでの知識の総局面 @ja-jp
note: nessuno
in scheme: Subject Code
created: 2000-10-30T12:00:00+00:00
modified: 2010-12-15T17:01:09+00:00
narrower: Adulti
narrower: Post-Scolare
narrower: Comitati genitori
narrower: Scuola Infanzia
narrower: Scuola
narrower: Sindacati Scuola
narrower: Università
narrower: Educazione
narrower: Esame Ammissione
narrower: Insegnamento, Apprendimento
narrower: Istruzione religiosa

Adulti
type: Concept
preferred label: Formation permanente @fr
preferred label: Erwachsenenbildung @de
preferred label: educación de adultos @es
preferred label: 成人教育 @ja-jp
preferred label: adult education @en-gb
preferred label: educação de adultos @pt-br
definition: L'enseignement aux plus de 25 ans @fr
definition: Educação fornecida a estudantes mais velhos do que o grupo usual entre os 5 e os 25 anos. @pt-pt
definition: Education provided for older students outside the usual age groups of 5-25 @en-gb
definition: Ausbildung für ältere Lernende außerhalb der gewöhnlichen Altersgruppe der 5-25-jährigen. @de
definition: 通常教育を受ける5才から25才より上の世代へ提供される教育 @ja-jp
definition: Educacion brindada a estudiantes mayres fuera del grupo usual de entre 5 y 25 años. @es
definition: Istruzione riguardante individui di età generalmente superiore ai 25 anni
note: nessuno
in scheme: Subject Code
created: 2000-10-30T12:00:00+00:00
modified: 2010-12-15T17:01:09+00:00
broader: Istruzione

Post-Scolare
type: Concept
preferred label: educação permanente @pt-br
preferred label: Enseignement post-scolaire @fr
preferred label: Weiterbildung @de
preferred label: estudios adicionales @es
preferred label: 生涯教育 @ja-jp
preferred label: further education @en-gb
definition: Qualquer forma de educação que vai além da educação básica. @pt-pt
definition: Toda forma de educação que vai além da educação básica. @pt-br
definition: Any form of education beyond basic education of several levels @en-gb
definition: Ogni forma di istruzione oltre quella di base
definition: 色々な水準の基礎教育を超えて行われる様々な形の教育 @ja-jp
definition: Jede Form der Ausbildung auf verschiedenen Ebenen, neben der Grundausbildung. @de
definition: Tout enseignement au-delà de celui de base @fr
definition: Cualquier forma de educación que va más allá de la educación basica o varios niveles. @es
note: nessuno
in scheme: Subject Code
created: 2000-10-30T12:00:00+00:00
modified: 2010-12-15T17:01:09+00:00
broader: Istruzione

Comitati genitori
type: Concept
preferred label: associações de pais @pt-pt
preferred label: Eltern @de
preferred label: parent organisation @en-gb
preferred label: Parents d'élèves @fr
preferred label: 保護者会 @ja-jp
preferred label: asociaciones de apoderados @es
definition: Grupos de pais organizados para apoiar escolas. @pt-pt
definition: 学校をサポートするため設立された保護者のグループ @ja-jp
definition: Grupos de padres organizados para apoyar las escuelas. @es
definition: Groupe de parents d'élèves réunis en association @fr
definition: Elterngruppen, die sich für die Schule engagieren. @de
definition: Gruppi di genitori istituiti per collaborare con l'attività scolastica
definition: Groups of parents set up to support schools @en-gb
note: nessuno
in scheme: Subject Code
created: 2000-10-30T12:00:00+00:00
modified: 2010-12-15T17:01:09+00:00
broader: Istruzione

Scuola Infanzia
type: Concept
preferred label: Vorschule/Kindergarten @de
preferred label: 幼児教育 @ja-jp
preferred label: pré-escolar @pt-pt
preferred label: preescolar @es
preferred label: preschool @en-gb
preferred label: Préscolaire @fr
definition: Erziehung für Kinder unterhalb des nationalen regulären Schulalters. @de
definition: Educação para crianças abaixo da idade da escolaridade obrigatória. @pt-pt
definition: Education for children under the national compulsory education age @en-gb
definition: Istruzione dei bambini al di sotto dell'età scolare; Scuola Materna
definition: Educación para niños bajo el sistema escolar. @es
definition: L'enseignement en maternelle, avant l'âge de l'école obligatoire @fr
definition: 国の義務教育を受ける年齢に満たない子供たちのための教育 @ja-jp
note: nessuno
in scheme: Subject Code
created: 2000-10-30T12:00:00+00:00
modified: 2010-12-15T17:01:09+00:00
broader: Istruzione

Scuola
type: Concept
preferred label: écoles, collèges, lycées @fr
preferred label: 学校 @ja-jp
preferred label: escolas @pt-pt
preferred label: Schule @de
preferred label: escuelas @es
preferred label: school @en-gb
definition: Un inmueble o institución donde educación de distintas clases es brindada. @es
definition: Edifício ou instituição onde educação de vários níveis é fornecida. @pt-pt
definition: Istituzione che garantisce formazione e istruzione a vari livelli
definition: A building or institution in which education of various sorts is provided @en-gb
definition: L'endroit où est dispensé l'enseignement aux élèves @fr
definition: 様々な形の教育を提供する建物や団体 @ja-jp
definition: Gebäude oder Einrichtung, wo verschiedenartige Ausbildung angeboten wird. @de
note: nessuno
in scheme: Subject Code
created: 2000-10-30T12:00:00+00:00
modified: 2010-12-15T17:01:09+00:00
broader: Istruzione
narrower: Primarie, Elementari
narrower: Secondarie di 1.grado, Medie
narrower: Medie superiori

Sindacati Scuola
type: Concept
preferred label: Syndicats d'enseignants @fr
preferred label: 教員組合 @ja-jp
preferred label: Lehrer @de
preferred label: sindicatos de professores @pt-br
preferred label: sindicatos de docentes @es
preferred label: teachers union @en-gb
definition: Organizzazioni sindacali dei lavoratori della scuola
definition: Organização de professores para negociações coletivas e outros propósitos relativos à profissão. @pt-br
definition: Organisation der Lehrenden für gemeinsame Vereinbarungen und andere Zwecke. @de
definition: Organizaciones gremiales de profesores para la negociación y otros propositos. @es
definition: Le syndicat des professeurs @fr
definition: 団体交渉および他の目的のための教師の組織 @ja-jp
definition: Organization of teachers for collective bargaining and other purposes @en-gb
note: nessuno
in scheme: Subject Code
created: 2000-10-30T12:00:00+00:00
modified: 2010-12-15T17:01:09+00:00
broader: Istruzione
broad match: http://cv.iptc.org/newscodes/mediatopic/20000536

Università
type: Concept
preferred label: Université @fr
preferred label: universidades @pt-pt
preferred label: Hochschule @de
preferred label: universidad @es
preferred label: 大学 @ja-jp
preferred label: university @en-gb
definition: Institutions of higher learning capable of providing doctorate degrees @en-gb
definition: Institución de enseñanza superior capaz de proveer grados en doctorado. @es
definition: Instituições de ensino superior capazes de atribuir grau de doutoramento. @pt-pt
definition: Instituições de ensino superior capazes de atribuir grau de doutorado. @pt-br
definition: L'enseignement supérieur jusqu'au doctorat @fr
definition: 博士号を提供することができる高度の教育施設 @ja-jp
definition: Livello di istruzione superiore per il conseguimento di diplomi di laurea e dottorati; Accademie; Conservatori
definition: Institutionen der Lehre auf höherer Ebene, geeignet um Doktoren- und Professorentitel etc. zu verleihen. @de
note: nessuno
in scheme: Subject Code
created: 2000-10-30T12:00:00+00:00
modified: 2010-12-15T17:01:09+00:00
broader: Istruzione

Educazione
type: Concept
preferred label: educação informal @pt-pt
preferred label: Erziehung @de
preferred label: crianza @es
preferred label: éducation en général @fr
preferred label: upbringing @en-gb
preferred label: しつけ @ja-jp
definition: Dinge, die Eltern und andere vermitteln, während man heranwächst. @de
definition: Les leçons tirées de l'expérience des autres @fr
definition: Lecciones aprendidas de los padres y otros, a media que uno crece. @es
definition: Formazione costruita durante la crescita dall'insegnamento familiare e dall'esperienza
definition: Lições aprendidas da experiência dos pais e dos outros, à medida que cada um vai crescendo. @pt-br
definition: Lessons learned from parents and others as one grows up @en-gb
definition: 人が成長する上で親または自分以外の人から教えられること @ja-jp
note: nessuno
in scheme: Subject Code
created: 2000-10-30T12:00:00+00:00
modified: 2010-12-15T17:01:09+00:00
broader: Istruzione

Esame Ammissione
type: Concept
preferred label: exame de admissão @pt-br
preferred label: entrance examination @en-gb
preferred label: examen de admisión @es
preferred label: Aufnahmeprüfung/Abschluss @de
preferred label: 入試 @ja-jp
preferred label: Examen ou concours d'entrée @fr
definition: Les examens d'entrée du collège à l'université et l'enseignement préparatoire à l'entrée aux grandes écoles @fr
definition: Exames de admissão para universidades, institutos superiores e outras instituições de ensino. @pt-pt
definition: 名門学校の入学のための試験に準備している学生を援助する塾を含み、大学、高校、中学、そしてすべての他の高級または低級の教育機関に入学するための試験 @ja-jp
definition: Exams for entering colleges, universities, junior and senior high schools, and all other higher and lower education institutes, including cram schools, which help students prepare for exams for entry to prestigious schools. @en-gb
definition: Exámenes de admisión a colegios, universidades, institutos y a todas las instituciones de educación escolar y técnico profesional, incluyendo institutos de preparación para entrar a mejores universidades. @es
definition: Prüfungen für die Aufnahme ins Gymnasium, zur Universität, Fachhochschulen und allen anderen höheren und niedrigen Bildungseinrichtungen, inklusive Vorbereitungseinrichtungen, die den Schülern bei der Examensvorbereitung helfen oder bei anderen Prüfungen. @de
definition: Esame necessario per essere ammessi alla frequenza di corsi di istruzione di vario livello, incluso l'insegnamento preparatorio per l'ingresso in scuole prestigiose
note: nessuno
in scheme: Subject Code
created: 2000-10-30T12:00:00+00:00
modified: 2010-12-15T17:01:09+00:00
broader: Istruzione

Insegnamento, Apprendimento
type: Concept
preferred label: Pédagogie @fr
preferred label: 授業・学習 @ja-jp
preferred label: ensino @pt-pt
preferred label: Lehren und Lernen @de
preferred label: teaching and learning @en-gb
preferred label: enseñanza y aprendizaje @es
definition: Les deux bouts de l'équation scolaire : enseigner et apprendre @fr
definition: Either end of the education equation @en-gb
definition: Beide Eckpfeiler des Gleichgewichts in der Ausbildung. @de
definition: Os dois objetivos da equação escolar: ensinar e aprender. @pt-br
definition: どちらも教育上同一視するという目的(学習指導法) @ja-jp
definition: Entrambi i termini di riferimento dell'Istruzione
definition: Finalizar la Educación @es
note: nessuno
in scheme: Subject Code
created: 2003-04-05T12:00:00+00:00
modified: 2012-07-10T12:00:00+00:00
broader: Istruzione
narrower: Studente
narrower: Insegnante
narrower: Curriculum
narrower: Esami, Test

Istruzione religiosa
type: Concept
preferred label: educação religiosa @pt-pt
preferred label: Educação religiosa @pt-br
preferred label: religious education @en-gb
preferred label: educación religiosa @es
preferred label: Education religieuse @fr
preferred label: Religionserziehung @de
preferred label: 宗教教育 @ja-jp
definition: Einführung durch Gläubige in eine bestimmte oder andere Glaubensrichtungen, oft aber nicht immer in Schulen durch religiöse Institutionen. @de
definition: Instruction religieuse ou à propos des religions habituellement dispensées par les diverses confessions @fr
definition: Instruction by any faith, in that faith or about other faiths, usually, but not always, conducted in schools run by religious bodies @en-gb
definition: 宗教団体が運営する学校で教えられるもの(とは限らないが)という意味での信仰に基づく教育 @ja-jp
definition: Instrução religiosa ou a propósito de religiões, geralmente, mas não sempre, ministrada em escolas dirigidas por religiosos. @pt-br
definition: instrucción dada por una fé, sobre esa fé o cualquier otra fé, usualmente, pero no siempre, realizada en escuelas dirigidas por religiosos. @es
definition: Istruzione e formazione di tipo religioso, generalmente trasmessa in scuole gestite da corpi religiosi
note: nessuno
in scheme: Subject Code
created: 2004-04-22T12:00:00+00:00
modified: 2012-07-10T12:00:00+00:00
broader: Istruzione
narrower: Scuole Cattoliche
narrower: Seminari
narrower: Scuole Talmudiche
narrower: Scuole coraniche

Primarie, Elementari
type: Concept
preferred label: escuela básica @es
preferred label: Grundschule @de
preferred label: escolas de ensino fundamental, 1ª à 5ª série @pt-br
preferred label: elementary schools @en-gb
preferred label: école primaire @fr
preferred label: escolas de 1.º ciclo @pt-pt
preferred label: 小学校 @ja-jp
definition: Schools usually of a level from kindergarten through 11 or 12 years of age @en-gb
definition: Escola a partir dos 5-6 anos até os 10 anos. @pt-br
definition: L'école à partir de 5 ou 6 ans jusqu'à 11 ou 12 ans @fr
definition: 幼稚園から11歳あるいは12歳までの水準の学校 @ja-jp
definition: Escola a partir dos 5-6 anos até aos 10 anos. @pt-pt
definition: Schulen für die Altersgruppe vom Kindergartenalter bis zu den 9 oder 10-jährigen. @de
definition: Livello di istruzione scolastica che generalmente va dalla scuola dell'infanzia fino agli 11 anni di età
definition: Escuelas que generalmente son de un nivel de kinder hasta los 12 años de edad. @es
note: nessuno
in scheme: Subject Code
created: 2003-04-05T12:00:00+00:00
modified: 2012-07-10T12:00:00+00:00
broader: Scuola

Secondarie di 1.grado, Medie
type: Concept
preferred label: Collège @fr
preferred label: escuela intermedia @es
preferred label: escolas de ensino fundamental, 6ª à 9ª série @pt-br
preferred label: Haupt- und Realschule @de
preferred label: escolas de 2.º ciclo e 3.º ciclo @pt-pt
preferred label: middle schools @en-gb
preferred label: 中学校 @ja-jp
definition: Le collège (élèves entre l'école primaire et le lycée, entre 11 et 14 ans en général) @fr
definition: Schule für die Altersgruppe der 11 bis 15-jährigen. @de
definition: Escola de transição, anterior à escola de ensino médio, entre 10 e 15 anos. @pt-br
definition: Escola de transição, entre as escolas de 1.º ciclo e as escolas secundárias, entre 10 e 15 anos. @pt-pt
definition: Escuela entre básica, intermedia y liceo, 12 hasta 13 años. @es
definition: Transitional school between elementary and high school, 12 through 13 years of age @en-gb
definition: Livello di istruzione scolastica tra le elementari e le medie superiori, generalmente tra gli 11 e i 14 anni di età
definition: 12歳から13歳までの年齢の時に小学校と高校の間に通う過渡的な学校 @ja-jp
note: nessuno
in scheme: Subject Code
created: 2003-04-05T12:00:00+00:00
modified: 2012-07-10T12:00:00+00:00
broader: Scuola

Medie superiori
type: Concept
preferred label: liceo o secundaria @es
preferred label: Gymnasium @de
preferred label: 高校 @ja-jp
preferred label: escolas secundárias @pt-pt
preferred label: Lycées @fr
preferred label: escolas de ensino médio @pt-br
preferred label: high schools @en-gb
definition: Educação pré-universitária, entre 15 e 17-18 anos. @pt-br
definition: Pre-college/ university level education, 14 to 17 or 18 years of age, called freshman, sophomore, junior and senior @en-gb
definition: Nivel de educación universitaria y preuniversitaria de 14, 17 o 18 años de edad, llamados estudiantes de primer año, estudiantes de segundo año, medio y avanzada. @es
definition: Le lycée, 14-18 ans @fr
definition: Livello di istruzione scolastica superiore generalmente tra i 14 e i 17-18 anni di età ; Istituti professionali; Istituti tecnici ; Licei;
definition: 14歳から17もしくは18歳の年齢まで通う単科、総合大学前の水準がある教育で、新入生、2年生、3年生、最上級生と呼ばれる @ja-jp
definition: Universitätsvorbereitung für die 16 bis 18 oder 19-jährigen mit Abiturabschluss. @de
note: nessuno
in scheme: Subject Code
created: 2003-04-05T12:00:00+00:00
modified: 2012-07-10T12:00:00+00:00
broader: Scuola

Studente
type: Concept
preferred label: alunos @pt-br
preferred label: 学生 @ja-jp
preferred label: Student @de
preferred label: students @en-gb
preferred label: étudiants @fr
preferred label: estudiantes @es
definition: Pessoas de todas as idades em ambiente estruturado, não necessariamente uma sala de aula, para aprender alguma coisa. @pt-br
definition: Gente de cualquier edad en un entorno estructurado, no necesariamente en una sala de clases, para aprender algo. @es
definition: Chi riceve un insegnamento da una istituzione e secondo un determinato programma
definition: Menschen jeden Alters die sich in einer strukturellen Umgebung befinden, nicht notwendigerweise ein Klassenraum, um etwas zu lernen. @de
definition: 必ずしも教室は必要ではなく、何かを学ぶために組織だった環境にいる様々な年代の人々 @ja-jp
definition: Les gens de tous âges qui recoivent un enseignement @fr
definition: People of any age in a structured environment, not necessarily a classroom, in order to learn something @en-gb
note: nessuno
in scheme: Subject Code
created: 2003-04-05T12:00:00+00:00
modified: 2012-07-10T12:00:00+00:00
broader: Insegnamento, Apprendimento

Insegnante
type: Concept
preferred label: Lehrender @de
preferred label: Enseignants @fr
preferred label: teachers @en-gb
preferred label: professores @pt-br
preferred label: 教師 @ja-jp
preferred label: profesores @es
definition: Menschen, die ihr Wissen anderen vermitteln. @de
definition: Pessoas dotadas de conhecimento e de meios e técnicas para o transmitir a outros. @pt-pt
definition: People with knowledge who can impart that knowledge to others @en-gb
definition: Chi trasmette una conoscenza agli studenti
definition: 知識をもち、その知識を他の人に伝えることができる人々 @ja-jp
definition: Personas con conocimiento que pueden impartir conocimiento a otros. @es
definition: Les gens chargés de transmettre leur savoir aux élèves @fr
note: nessuno
in scheme: Subject Code
created: 2003-04-05T12:00:00+00:00
modified: 2012-07-10T12:00:00+00:00
broader: Insegnamento, Apprendimento

Curriculum
type: Concept
preferred label: Programmes d'étude @fr
preferred label: Curriculum/Lehrplan @de
preferred label: currículo @pt-pt
preferred label: malla curricular @es
preferred label: カリキュラム @ja-jp
preferred label: curriculum @en-gb
definition: Cursos oferecidos por uma instituição de ensino e regulamentação desses cursos. @pt-br
definition: Piano di studi proposto da un istituto di istruzione e sua programmazione
definition: Cursos que ofrece una institución de aprendizaje con ciertas reglas. @es
definition: 学習制度とそれらのコースの規則によって提供されるコース @ja-jp
definition: The courses offered by a learning institution and the regulation of those courses @en-gb
definition: Les enseignements (contenu et forme) proposés par une institution scolaire @fr
definition: Unterrichtseinheit einer Bildungseinrichtung und deren Regularien. @de
note: nessuno
in scheme: Subject Code
created: 2003-04-05T12:00:00+00:00
modified: 2012-07-10T12:00:00+00:00
broader: Insegnamento, Apprendimento

Esami, Test
type: Concept
preferred label: Examen @fr
preferred label: exames @pt-br
preferred label: 試験 @ja-jp
preferred label: test/examination @en-gb
preferred label: prueba-exámen @es
preferred label: Prüfung @de
definition: A measurement of student accomplishment @en-gb
definition: 生徒の達成度を測るもの @ja-jp
definition: Contrôle du niveau des étudiants @fr
definition: Forma de medir a aprendizagem de um estudante. @pt-pt
definition: forma de medir el aprendizaje de un estudiante. @es
definition: Verifiche attuate per valutare lo stato di apprendimento da parte di uno studente
definition: Messung und Bewertung der Fertigkeiten von Schülern. @de
note: nessuno
in scheme: Subject Code
created: 2004-04-22T12:00:00+00:00
modified: 2012-07-10T12:00:00+00:00
broader: Insegnamento, Apprendimento

Scuole Cattoliche
type: Concept
preferred label: Ecole catholique @fr
preferred label: カトリック校 @ja-jp
preferred label: escola paroquial @pt-pt
preferred label: escuela parroquial @es
preferred label: parochial school @en-gb
preferred label: Gemeindeschule @de
definition: Ecole dirigée par l'Eglise catholique @fr
definition: Escola dirigida pela igreja católica romana. @pt-pt
definition: Una escuela administrada por la fé Católica Romana. @es
definition: Scuole gestite da istituzioni religiose cattoliche
definition: A school run by the Roman Catholic faith @en-gb
definition: ローマカトリック教によって経営されている学校 @ja-jp
definition: Schule, die durch den römisch-katholischen Glauben bestimmt ist. @de
note: nessuno
in scheme: Subject Code
created: 2004-04-22T12:00:00+00:00
modified: 2012-07-10T12:00:00+00:00
broader: Istruzione religiosa
broad match: http://cv.iptc.org/newscodes/mediatopic/20000399

Seminari
type: Concept
preferred label: seminario @es
preferred label: 神学校 @ja-jp
preferred label: seminário @pt-pt
preferred label: Seminar @de
preferred label: Séminaire @fr
preferred label: seminary @en-gb
definition: Ecole de toute confession servant à former des hommes d'Eglise @fr
definition: Escola de qualquer fé, especialmente destinada à formação de ministros da igreja. @pt-pt
definition: 何らかの宗教の、特に牧師を養成するための学校 @ja-jp
definition: Schule jeden Glaubens, die ausgerichtet ist Priester auszubilden. @de
definition: A school of any faith specifically designed to train ministers @en-gb
definition: Istituti di formazione di ministri del culto
definition: Una escuela de cualquier fé, destinada al entrenamiento de misnitros. @es
note: nessuno
in scheme: Subject Code
created: 2004-04-22T12:00:00+00:00
modified: 2012-07-10T12:00:00+00:00
broader: Istruzione religiosa
broad match: http://cv.iptc.org/newscodes/mediatopic/20000399

Scuole Talmudiche
type: Concept
preferred label: yeshiva @en-gb
preferred label: yeshivá @pt-pt
preferred label: Yeshiva @fr
preferred label: ユダヤ神学校 @ja-jp
preferred label: Jeschiva @de
definition: Schule die ausgerichtet ist Rabbis auszubilden. @de
definition: Istituti di formazione rabbinica
definition: ラビ(ユダヤ教の聖職者)を養成するための学校 @ja-jp
definition: A school for training rabbis @en-gb
definition: Es una escuela que forma Rabinos. @es
definition: Escola que forma rabinos. @pt-pt
definition: Ecole pour former des rabbins @fr
note: nessuno
in scheme: Subject Code
created: 2004-04-22T12:00:00+00:00
modified: 2012-07-10T12:00:00+00:00
broader: Istruzione religiosa
broad match: http://cv.iptc.org/newscodes/mediatopic/20000399

Scuole coraniche
type: Concept
preferred label: madrasa @es
preferred label: madraça @pt-pt
preferred label: イスラム神学校 @ja-jp
preferred label: Madrasa @de
preferred label: Ecole coranique @fr
preferred label: madraçal @pt-br
definition: Ecole pour enseigner l'Islam @fr
definition: Schule, die den Islam unterrichtet. @de
definition: Es una escuela que enseña el Islam. @es
definition: Istituti di formazione islamica
definition: Escola que ensina o islão. @pt-pt
definition: A school for teaching Islam @en-gb
definition: Escola que ensina o islã. @pt-br
definition: イスラム教を教えるための学校 @ja-jp
note: nessuno
in scheme: Subject Code
created: 2004-04-22T12:00:00+00:00
modified: 2012-07-10T12:00:00+00:00
broader: Istruzione religiosa
broad match: http://cv.iptc.org/newscodes/mediatopic/20000399

Ambiente
type: Concept
preferred label: Environnement @fr
preferred label: 環境 @ja-jp
preferred label: ambiente @pt-pt
preferred label: medio ambiente @es
preferred label: Umwelt @de
preferred label: environmental issue @en-gb
definition: Condizione dell'ecosistema del pianeta, protezione e danni
definition: Todos os aspectos relativos a proteção, estragos e preservação do ecossistema do planeta Terra e de seu ambiente. @pt-br
definition: 惑星地球、およびその環境の生態系の保護、損害、および状態の全ての面 @ja-jp
definition: Tous les aspects de la protection et de la préservation de l'écosystème et de son environnement @fr
definition: All aspects of protection, damage, and condition of the ecosystem of the planet earth and its surroundings. @en-gb
definition: Alle Aspekte des Schutzes, der Zerstörung und die Bedingungen des Ökosystems der Erde und ihrer Umgebung. @de
definition: Todos os aspetos relativos a proteção, estragos e preservação do ecossistema do planeta Terra e do seu ambiente. @pt-pt
definition: Todos los aspectos de protección, daño y condiciones del ecosistema del planeta tierra y sus alrededores. @es
note: nessuno
in scheme: Subject Code
created: 2000-10-30T12:00:00+00:00
modified: 2010-12-15T17:01:09+00:00
narrower: Energia rinnovabile
narrower: Conservazione
narrower: Risparmio energetico
narrower: Politica ambientale
narrower: Inquinamento
narrower: Risorse naturali
narrower: Natura
narrower: Popolazione
narrower: Rifiuti
narrower: Acqua
narrower: Effetto serra
narrower: Materie pericolose
narrower: Disinquinamento

Energia rinnovabile
type: Concept
preferred label: energía alternativa @es
preferred label: renewable energy @en-gb
preferred label: énergies alternatives @fr
preferred label: energias renováveis @pt-br
preferred label: エネルギー再利用 @ja-jp
preferred label: Alternative Energie @de
definition: Impatto ambientale delle energie alternative e rinnovabili: sole, vento, acqua, biomasse, geotermia, ecc.
definition: Historias sobre el impacto ambiental de la energía renovable, incluyendo energía solar, de viento, hydro, biomasa y geotermal. @es
definition: Environmental impact of renewable energy, including solar, wind, hydro, biomass and geothermal @en-gb
definition: Histórias sobre o impacto ambiental das energias renováveis, incluindo energia solar, eólica, hidroenergia, biomassa e energia geotérmica. @pt-pt
definition: Les histoires concernant l'impact sur l'environnement des énergies renouvelables, y compris le soleil, le vent, l'eau, la biomasse et la géothermie @fr
definition: Das Vorkommen von erneuerbaren Energien in der Umwelt, wie Solar, Wind, Wasser, Biomasse und Erdwärme. @de
definition: 代替可能なエネルギーの環境への影響について歴史的に名高いものは、太陽、風、水力、生物、そして地熱が存在する @ja-jp
note: nessuno
in scheme: Subject Code
created: 2000-10-30T12:00:00+00:00
modified: 2010-12-15T17:01:09+00:00
broader: Ambiente

Conservazione
type: Concept
preferred label: Naturschutz @de
preferred label: 環境保護 @ja-jp
preferred label: Protection de la nature @fr
preferred label: preservación @es
preferred label: conservação @pt-br
preferred label: conservation @en-gb
definition: Preservazione delle aree naturali vergini, della loro flora e fauna, e delle specie in via di estinzione
definition: Die Erhaltung der Wildnis, Flora und Fauna, inklusive aussterbender Arten. @de
definition: 種の絶滅を含む、自然保護地域や動植物の保護に関する話 @ja-jp
definition: Histórias sobre a preservação de reservas naturais, flora e fauna, incluindo espécies em extinção. @pt-br
definition: Preservation of wilderness areas, flora and fauna, including species extinction @en-gb
definition: La préservation de la nature, flore et faune sauvages, et les espèces en voie d'extinction @fr
definition: Historias sobre preservación de áreas silvestres, flora y fauna, incluyendo especies en extinción. @es
definition: Histórias sobre a preservação de reservas naturais, flora e fauna, incluindo espécies em vias de extinção. @pt-pt
note: nessuno
in scheme: Subject Code
created: 2000-10-30T12:00:00+00:00
modified: 2010-12-15T17:01:09+00:00
broader: Ambiente
narrower: Specie a rischio
narrower: Ecosistema

Risparmio energetico
type: Concept
preferred label: 省エネ @ja-jp
preferred label: économies d'énergie @fr
preferred label: poupança de energia @pt-br
preferred label: energy saving @en-gb
preferred label: ahorro de energía @es
preferred label: Energieeinsparung @de
definition: Conservación de electricidad y otras fuentes de poder. @es
definition: La conservation des sources d'énergie (dont l'électricité) @fr
definition: Conservazione delle varie fonti di energia
definition: Erhaltung elektronischer und anderer Energiequellen. @de
definition: Conservação da eletricidade e de outras fontes de energia. @pt-br
definition: Conservation of electrical, and other power sources @en-gb
definition: 電気やその他の動力源の管理 @ja-jp
note: nessuno
in scheme: Subject Code
created: 2000-10-30T12:00:00+00:00
modified: 2010-12-15T17:01:09+00:00
broader: Ambiente

Politica ambientale
type: Concept
preferred label: environmental politics @en-gb
preferred label: políticas ambientais @pt-br
preferred label: política ambiental @es
preferred label: Umweltpolitik @de
preferred label: 環境政策 @ja-jp
preferred label: Politique de l'environnement @fr
definition: Dibattito sulla politica per le varie forme di tutela dell'ambiente
definition: el debate en politicas ambientales. @es
definition: The debate on environmental policy @en-gb
definition: Le débat sur la politique de l'environnement @fr
definition: 環境政策についての議論 @ja-jp
definition: Debate sobre política ambiental. @pt-pt
definition: Die Debatte um umweltpolitische Fragen. @de
note: nessuno
in scheme: Subject Code
created: 2000-10-30T12:00:00+00:00
modified: 2010-12-15T17:01:09+00:00
broader: Ambiente

Inquinamento
type: Concept
preferred label: contaminación ambiental @es
preferred label: poluição ambiental @pt-pt
preferred label: Umweltverschmutzung @de
preferred label: Pollution de l'environnement @fr
preferred label: environmental pollution @en-gb
preferred label: 環境汚染 @ja-jp
definition: 有害物質による、大気、水、土地などの汚染 @ja-jp
definition: Verschmutzung von Luft, Wasser, Land etc. durch schädliche Stoffe. @de
definition: Corruption of air, water, land etc. by harmful substances @en-gb
definition: Contaminação de ar, águas, terra, etc., por substâncias nocivas. @pt-br
definition: Contaminazione di aria, acqua, terra, ecc... da parte di sostanze dannose
definition: La pollution de l'air, de l'eau, du sol, etc. par des substances toxiques @fr
definition: Contaminación del aire, aguas, tierra, etc., por sustancias dañinas.. @es
note: nessuno
in scheme: Subject Code
created: 2000-10-30T12:00:00+00:00
modified: 2010-12-15T17:01:09+00:00
broader: Ambiente
narrower: Aria
narrower: Acqua

Risorse naturali
type: Concept
preferred label: Ressourcen @de
preferred label: recursos naturales @es
preferred label: recursos naturais @pt-pt
preferred label: natural resources @en-gb
preferred label: 資源枯渇 @ja-jp
preferred label: Ressources naturelles @fr
definition: Artikel über Umweltangelegenheiten bezogen auf die Ausbeutung der natürlichen Ressourcen durch die menschliche Verwertung. @de
definition: Stories about the environmental issues related to the exploitation of natural resources for human use @en-gb
definition: Histórias sobre questões ambientais relativas à exploração de recursos naturais para uso humano. @pt-br
definition: Les histoires liées à l'exploitation des ressources naturelles à usage de l'humanité @fr
definition: 人間の使用で天然資源の搾取と関係がある環境問題についての話 @ja-jp
definition: Sfruttamento delle risorse naturali per l'uso umano
definition: Historias sobre temas medioambientales, relacionados a la explotación de recursos naturales para uso humano. @es
note: nessuno
in scheme: Subject Code
created: 2000-10-30T12:00:00+00:00
modified: 2010-12-15T17:01:09+00:00
broader: Ambiente
narrower: Risorse Terra
narrower: Parchi
narrower: Foreste
narrower: Zone Umide
narrower: Montagne
narrower: Corsi d'acqua
narrower: Mari, Oceani, Laghi
narrower: Fauna Selvatica
narrower: Risorse Energetiche

Natura
type: Concept
preferred label: naturaleza @es
preferred label: natureza @pt-pt
preferred label: 自然 @ja-jp
preferred label: nature @en-gb
preferred label: Natur @de
preferred label: Nature @fr
definition: 植物相、動物相から成る全ての自然環境 @ja-jp
definition: O ambiente natural da flora e da fauna, tomado como um todo. @pt-br
definition: Que incluye toda el medioambiente natural de la flora y fauna. @es
definition: L'environnement naturel, le monde à la fois physique et biologique : éléments, faune, flore, etc. @fr
definition: Taken as a whole the natural environment of flora and fauna @en-gb
definition: Ambiente naturale di flora e fauna nel suo insieme complessivo
definition: Gesamtheit von Flora und Fauna. @de
note: nessuno
in scheme: Subject Code
created: 2000-10-30T12:00:00+00:00
modified: 2010-12-15T17:01:09+00:00
broader: Ambiente
narrower: Specie invasive

Popolazione
type: Concept
preferred label: Bevölkerung @de
preferred label: population @en-gb
preferred label: população @pt-br
preferred label: Population @fr
preferred label: población @es
preferred label: 人口問題 @ja-jp
definition: Ensemble des habitants d'un pays, d'une même région, d'une ville,... @fr
definition: As pessoas, seu crescimento e desenvolvimento dentro de seu ambiente natural. @pt-br
definition: People and their growth and development within a natural setting @en-gb
definition: 自然状態での、人口の増加や発展 @ja-jp
definition: La gente, su crecimiento y desarrollo dentro de su ambiente. @es
definition: Insieme delle persone, loro crescita e sviluppo in un ambiente naturale
definition: Wachstum und Entwicklung der Menschen innerhalb einer natürlichen Umgebung. @de
definition: As pessoas, seu crescimento e desenvolvimento dentro do seu ambiente natural. @pt-pt
note: nessuno
in scheme: Subject Code
created: 2000-10-30T12:00:00+00:00
modified: 2010-12-15T17:01:09+00:00
broader: Ambiente

Rifiuti
type: Concept
preferred label: desechos @es
preferred label: Abfall @de
preferred label: lixo @pt-pt
preferred label: 廃棄物・再利用 @ja-jp
preferred label: waste @en-gb
preferred label: Déchets @fr
definition: Les histoires concernant l'impact sur l'environnement des déchets, y compris le recyclage @fr
definition: Histórias sobre o impacto ambiental do lixo, incluindo esforços de reciclagem. @pt-br
definition: Umweltbelastung durch Müll, inklusive Wiederverwertung. @de
definition: Environmental impact of waste, including recycling efforts @en-gb
definition: Historias sobre el impacto ambiental de los desechos, incluyendo esfuerzos por reciclaje. @es
definition: 再生利用の試みなど、廃棄物の環境に対する影響についての記事 @ja-jp
definition: Impatto dei rifiuti sull'ambiente, comprese le iniziative volte al loro riciclaggio
note: nessuno
in scheme: Subject Code
created: 2000-10-30T12:00:00+00:00
modified: 2010-12-15T17:01:09+00:00
broader: Ambiente

Acqua
type: Concept
preferred label: Distribution de l'eau @fr
preferred label: água @pt-pt
preferred label: Wasser @de
preferred label: suministro de agua @es
preferred label: 水資源 @ja-jp
preferred label: water @en-gb
definition: Environmental issues about bodies of water, including oceans, lakes, streams and reservoirs, as well as ice, glaciers and forms of precipitation @en-gb
definition: 大洋、湖、小川、貯水池や、氷、氷河、降雨の形態などの、水の環境問題に関する記事 @ja-jp
definition: Histórias relativas a questões ambientais sobre massas de água, incluindo oceanos, lagos, ribeiros e reservatórios, mas também gelo, geleiras e formas de precipitação. @pt-br
definition: Historias sobre el medioambiente acuático, incluyendo océanos, lagos, tormentas, reservas, así como hielo, glaciares y todo tipo de precipitaciones. @es
definition: Problemi dell'ambiente che implicano l'acqua: dagli oceani e mari allo scioglimento dei ghiacciai alle precipitazioni ecc.
definition: Histórias relativas a questões ambientais sobre massas de água, incluindo oceanos, lagos, ribeiros e reservatórios, mas também gelo, glaciares e formas de precipitação. @pt-pt
definition: Umweltprobleme von Wassereinheiten, inklusive Meere, Seen, Flüsse und Reservoire, sowie Eis, Gletscher und Formen des Niederschlags. @de
definition: Les problèmes d'environnement impliquant l'eau, y compris les océans, les lacs, les cours d'eau, les barrages réservoirs mais aussi la glace et les glaciers et les formes de précipitation @fr
note: nessuno
in scheme: Subject Code
created: 2000-10-30T12:00:00+00:00
modified: 2010-12-15T17:01:09+00:00
broader: Ambiente

Effetto serra
type: Concept
preferred label: aquecimento global @pt-pt
preferred label: 温暖化 @ja-jp
preferred label: Globale Erwärmung @de
preferred label: global warming @en-gb
preferred label: calentamiento global @es
preferred label: Alerte à la pollution @fr
definition: Esta categoría incluye todos los aspectos relacionados al calentamiento global, incluyendo investigación de temperaturas, seguimiento remoto a tendencias de temperatura, debate sobre calentamiento global, vías de reducción a la emisión y comercio de carbó @es
definition: Esta categoria inclui todos os assuntos relativos ao aquecimento global, incluindo investigação de temperaturas, sensoriamento remoto de temperaturas, debate sobre o aquecimento global, formas de reduzir emissões e comércio de carbono. @pt-br
definition: Riscaldamento globale della terra, ricerche sulla temperatura e sulle sue modifiche, dibattito sulla riduzione delle emissioni
definition: Alle Probleme, in Bezug auf die globale Erwärmung, inklusive Klimaforschung, Ferndiagnose von Temperaturentwicklungen, Debatten um die Erderwärmung und Wege die Schadstoffemission und den Kohlenstoffgehalt zu verringern. @de
definition: All issues relating to global warming including temperature research, remote sensing on temperature trends, debate on global warming, ways to reduce emissions and carbon trading. @en-gb
definition: Les questions relatives à l'alerte environnementale y compris les températures et les moyens pour réduire les émissions de CO2 @fr
definition: このカテゴリーは気温研究、気温傾向に関する遠隔検知や、地球温暖化現象に関する議論、排出量削減方法、排出権取引といった、地球温暖化現象に関連するすべての問題を含む @ja-jp
definition: Esta categoria inclui todos os assuntos relativos ao aquecimento global, incluindo investigação de temperaturas, deteção remota de temperaturas, debate sobre o aquecimento global, formas de reduzir emissões e comércio de carbono. @pt-pt
note: nessuno
in scheme: Subject Code
created: 2000-10-30T12:00:00+00:00
modified: 2010-12-15T17:01:09+00:00
broader: Ambiente

Materie pericolose
type: Concept
preferred label: materiales tóxicos @es
preferred label: resíduos perigosos @pt-pt
preferred label: Giftstoff @de
preferred label: Matières dangereuses @fr
preferred label: 有害物質 @ja-jp
preferred label: hazardous materials @en-gb
definition: 人間または動物にさらされる場合、有害となる物質。放射線、毒ガス、化学薬品、重金属、PCBおよびあるプラント製品を含む @ja-jp
definition: Materialien, die für Mensch und Tier gefährlich sind, wenn diese mit ihnen in Kontakt kommen. Umfasst Radioaktivität, giftige Gase, Chemikalien, Schwermetalle, PCBs, und bestimmte pflanzliche Produkte. @de
definition: Materials that are harmful to humans or animals if they are exposed to them. Includes radiation, poison gases, chemicals, heavy metals, PCBs, and certain plant products @en-gb
definition: Materiali tossici o pericolosi per gli esseri viventi che vi siano esposti. Radiazioni, gas velenosi, prodotti chimici, metalli pesanti, ecc.
definition: Matières dangereuses pour les êtres vivants s'ils y sont exposés : radiations, gaz toxiques, produits chimiques, métaux lourds, PCB, etc. @fr
definition: Materiais perigosos para o homem e para os animais quando expostos a eles. Inclui radiação, gases venenosos, químicos, metais pesados, PCBs, certos produtos vegetais, etc. @pt-pt
definition: Materiales que son dañinos para los humanos si se exponen a estos, como la radiación, gases venenosos, químicos, metales pesados, PCB (bifenilos policlorados), y ciertos productos hechos en plantas industriales. @es
note: nessuno
in scheme: Subject Code
created: 2003-04-05T12:00:00+00:00
modified: 2012-07-10T12:00:00+00:00
broader: Ambiente

Disinquinamento
type: Concept
preferred label: 汚染除去 @ja-jp
preferred label: limpieza ambiental @es
preferred label: Dépollution @fr
preferred label: Umweltsäuberung @de
preferred label: environmental cleanup @en-gb
preferred label: limpeza ambiental @pt-br
definition: 人々あるいは動物が再び居住できるように、汚染地域から危険性物質をきれいに片づけるプロセス @ja-jp
definition: Processos através dos quais áreas contaminadas são limpas de materiais perigosos, para que possam ser novamente habitadas por pessoas ou animais. @pt-pt
definition: Procesos por los cuales las áreas contaminadas se limpian quitándoles materiales peligrosos para que así puedan volver a ser habitados por personas o por animales. @es
definition: Processi attuati per la pulizia e la decontaminazione di aree da materiale tossico
definition: Prozess bei dem verseuchte Gebiete von schädlichem Material gereinigt werden, sodass diese wieder bewohnbar sind für Menschen und Tiere. @de
definition: moyens de nettoyage et de décontamination @fr
definition: Processes whereby contaminated areas are cleaned of hazardous materials so they can be inhabited again by either people or animals. @en-gb
note: nessuno
in scheme: Subject Code
created: 2003-04-05T12:00:00+00:00
modified: 2012-07-10T12:00:00+00:00
broader: Ambiente

Specie a rischio
type: Concept
preferred label: Espèce menacée @fr
preferred label: espécies ameaçadas @pt-br
preferred label: endangered species @en-gb
preferred label: Artenschutz @de
preferred label: 絶滅危惧種 @ja-jp
preferred label: especies en peligro @es
definition: 主に環境、狩猟あるいは天候の変化のために姿を消す危険にある野生生物の種類 @ja-jp
definition: Les espèces sauvages en voie de disparition, en raison particulièrement de changements dans l'environnement, de la chasse ou de l'évolution du climat @fr
definition: Espécies selvagens em risco de extinção, em grande parte devido a mudanças no habitat, à caça ou ao clima. @pt-br
definition: Those species of wildlife in danger of disappearing, largely because of changes in environment, hunting, or weather @en-gb
definition: Specie di animali selvaggi considerati a rischio di estinzione, soprattutto a causa di cambiamenti ambientali, caccia, o modificazioni climatiche
definition: Diejenigen Arten der Wildnis, die vom Aussterben bedroht sind, meist aufgrund sich ändernder Umweltbedingungen, Jagd oder Wetter. @de
definition: Especies de la fauna en peligro de extinción, en gran parte debido a cambios en el hábitat, cacería, o clima. @es
note: nessuno
in scheme: Subject Code
created: 2003-04-05T12:00:00+00:00
modified: 2012-07-10T12:00:00+00:00
broader: Conservazione

Ecosistema
type: Concept
preferred label: ecossistema @pt-br
preferred label: Ökosystem @de
preferred label: 生態系 @ja-jp
preferred label: ecosystem @en-gb
preferred label: ecosistema @es
preferred label: Ecosystème @fr
definition: Ein geschlossenes System von Pflanzen, Tieren und Bakterien zusammenhängend in physikalischer und chemischer Umgebung. @de
definition: Un sistema de plantas, animales y bacteria. @es
definition: Sistema de plantas, animais e bactérias inter-relacionados no seu ambiente físico e químico. @pt-pt
definition: A system of plants, animals and bacteria interrelated in its physical/chemical environment @en-gb
definition: Sistema naturale e relazioni nell'ambiente fra gli organismi che vi vivono
definition: Sistema de plantas, animais e bactérias inter-relacionados em seu ambiente físico e químico. @pt-br
definition: 物理的/化学的環境で相互関係を持つ植物、動物、バクテリアの体系 @ja-jp
definition: Système relationnel des plantes, animaux et bactéries dans leur environnement physique et chimique @fr
note: nessuno
in scheme: Subject Code
created: 2004-10-13T12:00:00+00:00
modified: 2012-07-10T12:00:00+00:00
broader: Conservazione

Aria
type: Concept
preferred label: Smog/Luftverschmutzung @de
preferred label: poluição atmosférica @pt-pt
preferred label: contaminación del aire @es
preferred label: Pollution de l'air @fr
preferred label: 大気汚染 @ja-jp
preferred label: air pollution @en-gb
definition: 呼吸する空気の質に影響を与えている、固体かガスの物質 @ja-jp
definition: Matéria sólida ou gasosa que afeta a qualidade do ar que respiramos. @pt-pt
definition: Tout ce qui affecte la qualité de l'air que l'on respire @fr
definition: Inquinamento dell'aria a causa di sostanze che ne alterano la qualità
definition: Solid or gaseous matter affecting the quality of air that we breathe @en-gb
definition: Materia sólida o gaseosa que afecta la calidad del aire que respiramos. @es
definition: Feste und gasförmige Stoffe, die die Qualität der Luft, die wir atmen beeinflusst. @de
note: nessuno
in scheme: Subject Code
created: 2003-04-05T12:00:00+00:00
modified: 2012-07-10T12:00:00+00:00
broader: Inquinamento

Acqua
type: Concept
preferred label: 水質汚染 @ja-jp
preferred label: Pollution de l'eau @fr
preferred label: Wasserverschmutzung @de
preferred label: contaminación del agua @es
preferred label: water pollution @en-gb
preferred label: poluição da água @pt-br
definition: Feste und flüssige Stoffe, die die Qualität des Wassers verschlechtern, was als Trinkwasser oder zur Bewässerung genutzt werden könnte. @de
definition: 飲用あるいは潅漑のために使われる水の質を改悪する固体あるいは液体 @ja-jp
definition: Sólidos ou líquidos que contaminam a qualidade da água que podia ser usada para beber ou regar. @pt-pt
definition: Solids or liquids that corrupt the quality of water that could be used for drinking or irrigation @en-gb
definition: Sólidos o líquidos que corrompen la calidad del agua que podría ser usada para beberse o riego. @es
definition: Inquinamento dell'acqua provocato da sostanze che ne alterano la qualità
definition: Tout ce qui affecte la qualité de l'eau utilisée pour boire ou irriguer @fr
note: nessuno
in scheme: Subject Code
created: 2003-04-05T12:00:00+00:00
modified: 2012-07-10T12:00:00+00:00
broader: Inquinamento

Risorse Terra
type: Concept
preferred label: Réserve naturelle @fr
preferred label: Land @de
preferred label: recursos terrestres @pt-pt
preferred label: 土地資源 @ja-jp
preferred label: land resources @en-gb
definition: Porción de un estado o país que esta sobre el agua y disponible para el desarrollo de ganancias, bienes en general o para el bien publico en general. @es
definition: That portion of a nation or state that is above water and available for development either for profit or for the general good of the public @en-gb
definition: Der Teil eines Landes oder Staates, der oberhalb des Wassers liegt und zur Verfügung steht, sowohl für Profitzwecke als auch zur öffentlichen Nutzung. @de
definition: 陸上にある国あるいは州などの一部。一般的には役に立つもの、または利益を得るためか公の利益のためのものである @ja-jp
definition: Porção de uma nação ou estado que está acima do nível da água e disponível para o desenvolvimento de lucros ou para o bem geral do público. @pt-pt
definition: La partie d'une nation ou d'un état situé au dessus du niveau de la mer et disponible pour le développement qu'il soit pour le profit ou pour le bien général @fr
definition: Quella parte di un paese al di sopra del livello del mare fruibile per lo sviluppo, o il profitto o il bene generale del pubblico
note: nessuno
in scheme: Subject Code
created: 2003-04-05T12:00:00+00:00
modified: 2012-07-10T12:00:00+00:00
broader: Risorse naturali

Parchi
type: Concept
preferred label: 公園 @ja-jp
preferred label: Parcs naturels @fr
preferred label: parks @en-gb
preferred label: parques @pt-pt
preferred label: Park @de
definition: Zonas apartadas y desarrolladas para la recreación del publico, incluyendo el desarrollo comercial tales como parque de atracciones. @es
definition: Spazi naturali protetti, sviluppati per visite e svago da parte del pubblico, ma anche lo sviluppo commerciale collegato ai parchi a tema
definition: テーマパークのような商業開発を含む公共の楽しみとレクリエーションのために開発された特定の区域 @ja-jp
definition: Abseits gelegenen Gebiete, die zur öffentlichen Erholung und Unterhaltung genutzt werden, umfasst auch die kommerzielle Nutzung, wie z.B. Themenparks. @de
definition: Espaces protégés et développés pour les loisirs du public, y compris les parcs d'attractions thématiques @fr
definition: Areas set aside and developed for public enjoyment and recreation, including commercial development such as theme parks @en-gb
definition: Zonas delimitadas e desenvolvidas para divertimento público, incluindo desenvolvimento comercial como parques temáticos. @pt-pt
note: nessuno
in scheme: Subject Code
created: 2003-04-05T12:00:00+00:00
modified: 2012-07-10T12:00:00+00:00
broader: Risorse naturali

Foreste
type: Concept
preferred label: bosques @es
preferred label: Forêts @fr
preferred label: florestas @pt-pt
preferred label: forests @en-gb
preferred label: 森林 @ja-jp
preferred label: Wald @de
definition: Espaces arborés pour les loisirs du public ou dans un but commercial @fr
definition: Zonas abertas e arborizadas para divertimento público ou fins comerciais. @pt-br
definition: Aree verdi, boschi, foreste, giardini, utilizzabili per il piacere pubblico o per scopi commerciali
definition: Öffentliche Baumgebiete, die sowohl zur Erholung oder für kommerzielle Zwecke genutzt werden. @de
definition: Open areas of trees either available for public enjoyment, or for commercial purposes @en-gb
definition: 公共の楽しみ、または商業目的のために利用できる木々のオープンな区域 @ja-jp
definition: Áreas abiertas con árboles disponibles para la entretención del publico ,o para propósitos comerciales. @es
note: nessuno
in scheme: Subject Code
created: 2003-04-05T12:00:00+00:00
modified: 2012-07-10T12:00:00+00:00
broader: Risorse naturali

Zone Umide
type: Concept
preferred label: Feuchtgebiet @de
preferred label: 湿地 @ja-jp
preferred label: zonas úmidas @pt-br
preferred label: wetlands @en-gb
preferred label: Marais @fr
preferred label: pantanos @es
preferred label: zonas húmidas @pt-pt
definition: Zonas geralmente pantanosas ou com água pouco profunda, com grande diversidade de fauna e flora, sobretudo aquáticas. @pt-pt
definition: Areas generally marshy and not either under water or dry land. Often related to aquifers for water quality and/or wildlife @en-gb
definition: Áreas generalmente pantanosas o no. A menudo relacionadas con la calidad del agua y la fauna. @es
definition: Gebiete die im allgemeinen feucht sind und weder unter Wasser liegen, noch trockenes Land sind. Oft wasserfühend für die Wasserqualität oder Wildnis. @de
definition: 一般的には沼地のような場所を指し、水面下でも乾いた陸地でもない。しばしば水質や野生生物の点から帯水層の話しと関連付けられる @ja-jp
definition: Etendue d'eau dormante peu profonde envahie par la végétation aquatique @fr
definition: Aree generalmente paludose o acquitrini con presenza di flora e fauna selvatiche
note: nessuno
in scheme: Subject Code
created: 2003-04-05T12:00:00+00:00
modified: 2012-07-10T12:00:00+00:00
broader: Risorse naturali

Montagne
type: Concept
preferred label: montanhas @pt-pt
preferred label: Berg @de
preferred label: Montagnes @fr
preferred label: 山 @ja-jp
preferred label: mountains @en-gb
preferred label: montañas @es
definition: Rilievi importanti del suolo formatisi nel corso delle ere. Monti, Colline, Catene montuose ecc.
definition: Relief important du sol s'élevant à une grande hauteur @fr
definition: Erhöhte Landmassen, die sich über die Jahre durch Erosion, Vulkanausbrüche, oder aus der Bewegung massiver geografischer Formationen, Platten genannt, gebildet haben. @de
definition: Elevação de terreno, formada ao longo dos tempos por erosão, erupção vulcânica ou movimento de grandes formações geográficas chamadas placas. @pt-pt
definition: 浸食と火山性噴火、またはプレートと呼ばれる巨大な地層の移動によって長年かかって形成された高地 @ja-jp
definition: Elevated land masses formed over the ages either by erosion, volcanic eruption, or movement of massive geographical formations called plates @en-gb
definition: Elevadas masas de tierra formas con en el tiempo ya sea por erosión, erupción volcánica, o movimientos de grandes formaciones geográficas llamadas placas subterráneas. @es
note: nessuno
in scheme: Subject Code
created: 2003-04-05T12:00:00+00:00
modified: 2012-07-10T12:00:00+00:00
broader: Risorse naturali

Corsi d'acqua
type: Concept
preferred label: 河川 @ja-jp
preferred label: rios @pt-pt
preferred label: Rivières @fr
preferred label: Fluss @de
preferred label: rivers @en-gb
preferred label: ríos @es
definition: Água corrente limitada por terra, que se estende das nascentes e serpenteia por terra até se unir a outras massas de água. Inclui formas menores, como enseadas, regatos, ribeiros, etc. @pt-br
definition: Agua en movimiento cercada por tierra que se extiende desde fuentes en la tierras serpenteando por el terreno para unirse con otras zonas en donde haya agua. De maneras mas pequeñas hay riachuelos y vertientes. @es
definition: Cours d'eau de moyenne importance prenant sa source au milieu des terres et affluent d'un fleuve qui lui se jette dans la mer @fr
definition: Fließende Wassergebiete, die von Land umgeben sind, aus Erdquellen entspringen und sich durch Landgebiete schlängelnd mit anderen Wassergebieten verbinden. In kleineren Formen sind es Bäche, Wasserläufe, Rinnsale. @de
definition: Torrenti, Ruscelli Fiumi ecc. che si estendono dalle loro sorgenti per unirsi ad altri corsi d'acqua o sboccare in laghi o mari
definition: 陸地に境界づけられた、水源から他の水域と合流するまで曲がりくねって流れる流水域。より小さい形態では、それらは小川(creeks,rivulets,streams)である @ja-jp
definition: Moving water areas bounded by land that extend from earth sources and meander through land areas to join with other water areas. In smaller forms they are creeks, rivulets, streams etc @en-gb
definition: Água corrente limitada por terra, que se estende das nascentes e serpenteia por terra até se unir a outras massas de água. Inclui formas mais pequenas, como enseadas, regatos, ribeiros, etc. @pt-pt
note: nessuno
in scheme: Subject Code
created: 2003-04-05T12:00:00+00:00
modified: 2012-07-10T12:00:00+00:00
broader: Risorse naturali

Mari, Oceani, Laghi
type: Concept
preferred label: Océans @fr
preferred label: océanos @es
preferred label: Ozean @de
preferred label: oceans @en-gb
preferred label: 海 @ja-jp
preferred label: oceanos @pt-br
definition: Massas de água salgada que separam continentes ou outras massas geográficas grandes. Inclui formas mais pequenas como mares, lagos. @pt-br
definition: Grandes masas de agua salada que separan continentes u otras masas geográficas. De menor tamaño hay mares, lagos. @es
definition: Vaste distese d'acqua che separano i continenti o le terre, ma anche i mari interni e i laghi
definition: Vaste étendue d'eau salée baignant une grande partie de la terre @fr
definition: Salzwassermassen, die Kontinente oder andere große geografische Landmassen trennen. Kleinere Formen sind, Meere, Seen und Teiche. @de
definition: Salt water masses separating continents or other major geographical masses. smaller forms are seas or lakes or ponds @en-gb
definition: 大陸、あるいは他の主要な地理的なかたまりを分けている塩水のかたまり。より小さな形態は海あるいは湖あるいは池である @ja-jp
note: nessuno
in scheme: Subject Code
created: 2003-04-05T12:00:00+00:00
modified: 2012-07-10T12:00:00+00:00
broader: Risorse naturali

Fauna Selvatica
type: Concept
preferred label: vida selvagem @pt-br
preferred label: vida salvaje @es
preferred label: Wildtier @de
preferred label: 野生生物 @ja-jp
preferred label: wildlife @en-gb
preferred label: Animaux sauvages @fr
definition: Todas as formas de vida animal que não foram domesticadas. @pt-br
definition: 飼い慣らされていない動物生命のすべての形態 @ja-jp
definition: Alle Lebensformen von wilden, noch nicht gezähmten Tieren. @de
definition: Les animaux qui n'ont pas été domestiqués @fr
definition: Toda forma de vida animal que no haya sido domesticado. @es
definition: All forms of animal life that have not been domesticated @en-gb
definition: Forme di vita animale non addomesticate
note: nessuno
in scheme: Subject Code
created: 2003-04-05T12:00:00+00:00
modified: 2012-07-10T12:00:00+00:00
broader: Risorse naturali

Risorse Energetiche
type: Concept
preferred label: Rohstoff @de
preferred label: recursos energéticos @pt-pt
preferred label: Energie @fr
preferred label: energy resources @en-gb
preferred label: エネルギー資源 @ja-jp
definition: Such resources as coal, gas, wind, sunlight etc., used to generate heat, electricity and power @en-gb
definition: Recursos como carvão, gás, vento, luz solar, etc., usados para produzir calor, eletricidade e energia. @pt-br
definition: 石炭、ガス、風力、太陽光など、熱、電力、動力を生成する資源 @ja-jp
definition: L'ensemble des ressources énergétiques @fr
definition: Insieme delle risorse utilizzate per generare calore, elettricità, energia: carbone, gas, vento, luce solare, ecc...
definition: Rohstoffe wie Kohle, Gas, Wind, Sonne, die genutzt werden um Wärme, Elektrizität und Strom zu erzeugen. @de
definition: Recursos como carbón, gas, viento, luz solar, etc., que se usan para generar calor, electricidad y energía. @es
note: nessuno
in scheme: Subject Code
created: 2003-04-05T12:00:00+00:00
modified: 2012-07-10T12:00:00+00:00
broader: Risorse naturali

Specie invasive
type: Concept
preferred label: Invasive Arten @de
preferred label: 外来種 @ja-jp
preferred label: Espèces envahissantes @fr
preferred label: espécie invasora @pt-br
preferred label: especies invasoras. @es
preferred label: invasive species @en-gb
definition: Plantas no nativas, animales u otros organizmos que tienden a sobreponerse a las especies nativas. @es
definition: Non-native plants, animals and other organisms that tend to take over native species @en-gb
definition: Plantes, animaux ou organismes non autochtones qui supplantent les espèces autochtones @fr
definition: Piante, animali e altri organismi non autoctoni ma che tendono a soppiantare specie del luogo
definition: Plantas, animais ou outros organismos não nativos que tendem a suplantar as espécies nativas. @pt-pt
definition: Nicht-einheimische Pflanzen, Tiere und andere Organismen, die einheimische Arten oft vertreiben. @de
definition: 在来種にとってかわる可能性のある、外来の植物、動物、他の生命体 @ja-jp
note: nessuno
in scheme: Subject Code
created: 2004-10-13T12:00:00+00:00
modified: 2012-07-10T12:00:00+00:00
broader: Natura

Salute
type: Concept
preferred label: salud @es
preferred label: Medizin, Gesundheit @de
preferred label: saúde @pt-pt
preferred label: Santé @fr
preferred label: health @en-gb
preferred label: 健康 @ja-jp
definition: Todos os aspetos relativos ao bem-estar físico e mental dos seres humanos. @pt-pt
definition: Alle Aspekte des körperlichen und geistigen Wohlbefindens von Menschen. @de
definition: Todos os aspectos relativos ao bem-estar físico e mental dos seres humanos. @pt-br
definition: 人間の身体または精神的な厚生に関するすべての局面 @ja-jp
definition: All aspects pertaining to the physical and mental welfare of human beings. @en-gb
definition: Todos los aspectos pertinentes al bienestar psicológico y mental de los seres humanos. @es
definition: Conseguimento e mantenimento del buono stato psicofisico della persona, ma anche degli altri esseri viventi
definition: Etat physique et mental des organismes vivants @fr
note: nessuno
in scheme: Subject Code
created: 2000-10-30T12:00:00+00:00
modified: 2010-12-15T17:01:09+00:00
narrower: Malattia
narrower: Epidemia
narrower: Cura
narrower: Organizzazioni Sanitarie
narrower: Ricerca medica
narrower: Personale medico
narrower: Medicina
narrower: Medicina preventiva
narrower: Ferite, Lesioni
narrower: Ospedali, Cliniche
narrower: Servizio Sanitario Nazionale
narrower: Sistema sanitario privato
narrower: Politica Salute
narrower: Specializzazioni mediche
narrower: Servizio Medico
narrower: Forma fisica
narrower: Malesseri
narrower: Condizioni mediche
narrower: Paziente

Malattia
type: Concept
preferred label: enfermedades @es
preferred label: disease @en-gb
preferred label: Krankheit @de
preferred label: doenças @pt-pt
preferred label: 病気 @ja-jp
preferred label: Maladies @fr
definition: Cualquier condición dañina o destructiva. @es
definition: Altération de la santé @fr
definition: 何らかの危険または有害な健康状態 @ja-jp
definition: Any harmful or destructive condition @en-gb
definition: Alterazione dello stato di salute
definition: Jeder gesundheitsgefährdende oder zerstörerische Zustand. @de
definition: Toda condição nociva ou destrutiva. @pt-br
definition: Qualquer condição nociva ou destrutiva. @pt-pt
note: nessuno
in scheme: Subject Code
created: 2000-10-30T12:00:00+00:00
modified: 2010-12-15T17:01:09+00:00
broader: Salute
narrower: Contagiosa
narrower: Virale
narrower: sida
narrower: Cancro
narrower: Cardiache
narrower: Alzheimer
narrower: Malattie degli Animali
narrower: Malattie delle Piante
narrower: retrovírus

Epidemia
type: Concept
preferred label: epidemias y plagas @es
preferred label: epidemic and plague @en-gb
preferred label: Epidemie @de
preferred label: epidemias e pragas @pt-pt
preferred label: 感染症 @ja-jp
preferred label: épidémie @fr
definition: Una epidemia es una situación que se propaga rápidamente en una comunidad y que produce enfermedad. @es
definition: Sviluppo rapido di una malattia contagiosa all'interno di una comunità; malattia mortale di proporzioni epidemiche
definition: *Uma epidemia é uma doença que se espalha rapidamente numa comunidade; uma praga é geralmente uma doença mortal de proporções epidémicas.* @pt-pt
definition: Eine Epidemie ist ein sich in einer Gemeinschaft rasch verbreitender Zustand, eine Plage ist eine meist tödliche Krankheit mit epidemischer Verbreitung. @de
definition: 流行病は公衆に急速に広まる症状で、疫病は伝染性の致命的な病気 @ja-jp
definition: Développement rapide d'une maladie contagieuse chez un grand nombre d'individus d'une région donnée. Un fléau est généralement une épidémie mortelle @fr
definition: *Uma epidemia é uma doença que se espalha rapidamente em uma comunidade; uma praga é geralmente uma doença mortal de proporções epidémicas.* @pt-br
definition: An epidemic is a rapidly spreading condition in a community and a plague is usually a deadly disease of epidemic proportions @en-gb
note: nessuno
in scheme: Subject Code
created: 2000-10-30T12:00:00+00:00
modified: 2010-12-15T17:01:09+00:00
broader: Salute

Cura
type: Concept
preferred label: tratamentos @pt-br
preferred label: health treatment @en-gb
preferred label: Heilung/Therapie @de
preferred label: tratamiento de salud @es
preferred label: 治療 @ja-jp
preferred label: Traitements @fr
definition: Tratamento de doenças e de outras condições para restaurar o bem-estar. @pt-pt
definition: In generale, trattamento volto alla cura delle malattie e comunque a produrre condizioni di benessere
definition: Les moyens mis en œuvre pour soigner une maladie @fr
definition: Tratamiento en general de males y otras condiciones que producen enfermedades. @es
definition: Behandlung von Krankheiten und Heilungsbedingungen. @de
definition: In general treatment of diseases and other conditions to produce wellness @en-gb
definition: 健康をもたらすため、病気および他の症状の処置概要 @ja-jp
note: nessuno
in scheme: Subject Code
created: 2000-10-30T12:00:00+00:00
modified: 2010-12-15T17:01:09+00:00
broader: Salute
narrower: Farmaci su ricetta medica
narrower: Integratori
narrower: Dieta
narrower: Esame medico
narrower: Terapia

Organizzazioni Sanitarie
type: Concept
preferred label: health organisations @en-gb
preferred label: Organisations de santé @fr
preferred label: organizações de saúde @pt-pt
preferred label: Gesundheitsorganisation @de
preferred label: 保健衛生機関 @ja-jp
preferred label: organizaciones de salud @es
definition: Inclui histórias sobre organizações de saúde específicas, incluindo associações profissionais, organismos sem fins lucrativos e grupos internacionais. @pt-br
definition: Includes stories about specific health organizations, including professional associations, non-profits and international groups @en-gb
definition: Les organisations de santé, syndicats, associations professionnelles, ONG et organismes internationaux,… @fr
definition: Spezielle Gesundheitsorganisationen, inklusive professionelle Zusammenschlüsse, non-profit und internationale Gruppen. @de
definition: Organizzazioni operanti nel campo della salute, incluse associazioni professionali, gruppi internazionali e non profit
definition: 専門職団体や非営利および国際的団体を含んだ、特定の保健衛生機関のこと @ja-jp
definition: Incluye historias sobre organizaciones de salud, como asociaciones profesionales, grupos internacionales y organismos sin fines de lucro. @es
note: nessuno
in scheme: Subject Code
created: 2000-10-30T12:00:00+00:00
modified: 2010-12-15T17:01:09+00:00
broader: Salute

Ricerca medica
type: Concept
preferred label: investigación médica @es
preferred label: investigação médica @pt-br
preferred label: Recherche médicale @fr
preferred label: 医療研究 @ja-jp
preferred label: Medizinische Forschung @de
preferred label: medical research @en-gb
definition: Ursache- und Therapieforschung bei Krankheiten. @de
definition: Investigação sobre causas e curas de doenças. @pt-br
definition: La recherche sur les causes des maladies et sur leur traitement @fr
definition: Investigation into the causes and cures of diseases @en-gb
definition: Ricerca applicata specificatamente sulla natura delle malattie e le loro cause e sul progresso nella cura di esse
definition: 病気の原因および治療法の調査 @ja-jp
definition: Investigación acerca de las causas y curas de enfermedades. @es
note: nessuno
in scheme: Subject Code
created: 2000-10-30T12:00:00+00:00
modified: 2010-12-15T17:01:09+00:00
broader: Salute

Personale medico
type: Concept
preferred label: medical staff @en-gb
preferred label: profissionais de saúde @pt-br
preferred label: Personnel médical @fr
preferred label: Gesundheitspersonal @de
preferred label: personal médico @es
preferred label: 医療従事者 @ja-jp
definition: Ärzte und Pflegepersonal, innerhalb und außerhalb einer medizinischen Einrichtung. @de
definition: Dottori, infermieri, medici interni e altri che operano in una struttura medica
definition: Médicos, enfermeiros e outros profissionais que trabalham em instalações médicas. @pt-pt
definition: Les médecins, infirmiers aide-soignants, etc. travaillant dans des installations médicales @fr
definition: Doctors, nurses, interns and others in a medical facility @en-gb
definition: 医療施設の医師、看護師、インターンと他の医療スタッフ @ja-jp
definition: Dcotores, efermeras, internistas y otros en una dependencia medica. @es
note: nessuno
in scheme: Subject Code
created: 2000-10-30T12:00:00+00:00
modified: 2010-12-15T17:01:09+00:00
broader: Salute
narrower: Medicina di Base
narrower: Sindacati Sanità

Medicina
type: Concept
preferred label: Medizin/Medikament @de
preferred label: medicine @en-gb
preferred label: medicina @pt-br
preferred label: 医薬品 @ja-jp
preferred label: medicamentos @es
preferred label: Médicaments @fr
definition: 病気または体調不良を除去するために使用される物質 @ja-jp
definition: Remèdes pris pour éliminer la maladie @fr
definition: Sustancia que es administrada con intencion de eliminar un mal o enfermedad. @es
definition: A substance used with the expectation that it will eliminate disease or illness @en-gb
definition: Substância administrada com intenção de eliminar uma afecção ou doença. @pt-br
definition: Substância administrada com intenção de eliminar uma afeção ou doença. @pt-pt
definition: Ein Mittel, das verabreicht wird in der Hoffnung ein Leiden oder eine Krankheit zu heilen. @de
definition: Sostanza o trattamento usato con l'aspettativa che possa eliminare un'infermità o una malattia
note: nessuno
in scheme: Subject Code
created: 2000-10-30T12:00:00+00:00
modified: 2010-12-15T17:01:09+00:00
broader: Salute
narrower: Fitoterapia
narrower: Olistica
narrower: Occidentale
narrower: Cinese

Medicina preventiva
type: Concept
preferred label: medicina preventiva @es
preferred label: Vorsorge @de
preferred label: preventative medicine @en-gb
preferred label: Médecine préventive @fr
preferred label: 予防薬 @ja-jp
definition: Sustancias utilizadas para prevenir males y enfermedades. @es
definition: Substances used to prevent diseases or illnesses @en-gb
definition: Substâncias usadas para prevenir afeções ou doenças. @pt-pt
definition: Substâncias usadas para prevenir afecções ou doenças. @pt-br
definition: Uso dei rimedi per prevenire l'insorgenza di infermità o malattie
definition: Stoffe, die zur Vorbeugung von Krankheiten genutzt werden. @de
definition: Remèdes utiliser pour prévenir les maladies @fr
definition: 病気または体調不良を予防するために使用される物質 @ja-jp
note: nessuno
in scheme: Subject Code
created: 2000-10-30T12:00:00+00:00
modified: 2010-12-15T17:01:09+00:00
broader: Salute
narrower: Vaccino

Ferite, Lesioni
type: Concept
preferred label: injury @en-gb
preferred label: Invalidität/Versehrte @de
preferred label: けが @ja-jp
preferred label: traumatismos @pt-br
preferred label: lesiones @es
preferred label: Blessures @fr
definition: Una condición traumática del cuerpo humano, usualmente causada por elementos externos. @es
definition: A traumatic condition of the human body caused usually by outside forces @en-gb
definition: 通常外部の作用により引き起こされた人体の外傷性の症状 @ja-jp
definition: Condição traumática do corpo, geralmente causada por forças externas. @pt-pt
definition: Blessure, lésion comportant une plaie @fr
definition: Condizioni traumatiche generalmente determinate da cause esterne
definition: Eine traumatische körperliche Beeinträchtigung, verursacht durch äußerliche Gewalteinwirkung. @de
note: nessuno
in scheme: Subject Code
created: 2000-10-30T12:00:00+00:00
modified: 2010-12-15T17:01:09+00:00
broader: Salute

Ospedali, Cliniche
type: Concept
preferred label: Krankenhaus @de
preferred label: hospitais @pt-br
preferred label: hospital and clinic @en-gb
preferred label: Hôpitaux et cliniques @fr
preferred label: 病院・診療所 @ja-jp
preferred label: hospitales y clínicas @es
definition: Instalações médicas para o tratamento de doenças e feridas. @pt-br
definition: Medizinische Einrichtung zur Behandlung von Krankheiten und Verletzungen. @de
definition: Istituti medici per il trattamento e la cura
definition: Medical facilities for the treatment of illnesses and injury @en-gb
definition: Instalaciones médicas utilizadas para el tratamiento de enfermedades o lesiones. @es
definition: 疾病や傷害を治療するための医療施設 @ja-jp
definition: Etablissement, hôpital ou clinique, aménagé pour dispenser tous les soins médicaux et chirurgicaux @fr
note: nessuno
in scheme: Subject Code
created: 2000-10-30T12:00:00+00:00
modified: 2010-12-15T17:01:09+00:00
broader: Salute

Servizio Sanitario Nazionale
type: Concept
preferred label: atención estatal de salud @es
preferred label: government health care @en-gb
preferred label: serviço nacional de saúde @pt-br
preferred label: 保健所 @ja-jp
preferred label: Santé publique @fr
preferred label: Staatliche Gesundheitsfürsorge @de
definition: Le programme de santé publique @fr
definition: Cuidado de la salud a cargo de gobiernos nacionales. @es
definition: 国家政府によって提供された健康管理 @ja-jp
definition: Cuidados de saúde fornecidos pelos governos nacionais. @pt-br
definition: Sistema de saúde assegurado pelo estado. @pt-pt
definition: Health care provided by national governments @en-gb
definition: Sistema sanitario pubblico garantito dallo Stato; Programma pubblico per la salute
definition: Gesundheitsfürsorge, die von der Regierung unterstützt wird. @de
note: nessuno
in scheme: Subject Code
created: 2000-10-30T12:00:00+00:00
modified: 2010-12-15T17:01:09+00:00
broader: Salute
narrower: Medicare
narrower: 低所得者医療扶助制度

Sistema sanitario privato
type: Concept
preferred label: 民間保健機関 @ja-jp
preferred label: sistemas privados de saúde @pt-pt
preferred label: Private Gesundheitsfürsorge @de
preferred label: Assurances médicales @fr
preferred label: private health care @en-gb
preferred label: atención privada de salud @es
definition: Assistenza sanitaria fornita da organizzazioni e/o istituzioni privati
definition: Gesundheitsfürsorge, die von privat finanzierten oder Versicherungsorganisationen unterstützt wird. @de
definition: Programme ou assurance santé privés @fr
definition: 個人的に資金を供給するか、あるいは保証された組織によって提供されたヘルスケア @ja-jp
definition: Cuidados de saúde fornecidos por organizações de fundos privados. @pt-pt
definition: Cuidado de la salud a cargo de organizaciones privadas o aseguradoras. @es
definition: Health care provided by privately funded or insured organizations @en-gb
note: nessuno
in scheme: Subject Code
created: 2000-10-30T12:00:00+00:00
modified: 2010-12-15T17:01:09+00:00
broader: Salute

Politica Salute
type: Concept
preferred label: healthcare policy @en-gb
preferred label: política de saúde @pt-br
preferred label: política de atención de salud @es
preferred label: Gesundheitspolitik @de
preferred label: 保健政策 @ja-jp
preferred label: Politique de santé @fr
definition: Decisioni politiche riguardanti la salute e le strategie dei vari paesi su questi temi
definition: Política relativa à saúde, incluindo o que diferentes países estão a fazer em relação à prescrição de medicamentos, aids, cuidados psiquiátricos, financiamento da assistência médica e tópicos relacionados. @pt-br
definition: Decisiones políticas de salud, incluyendo lo que los diferentes países están haciendo sobre prescripción de medicamentos, SIDA, cuidado psicológico, financiamiento de la asistencia médica y temas relacionados. @es
definition: Política relativa à saúde, incluindo o que diferentes países estão a fazer em relação à prescrição de medicamentos, sida, cuidados psiquiátricos, financiamento da assistência médica e tópicos relacionados. @pt-pt
definition: Les politiques de santé @fr
definition: Politische Entscheidungen in Bezug auf die Gesundheit, umfasst was die Länder tun für die Drogenbekämpfung, AIDS, psychiatrische Versorgung, öffentliche Mittel für die Gesundheitsversorgung und ähnliches. @de
definition: 健康関連の政策決定、さまざまな国が行っている処方薬に関する政策、エイズ、精神病治療、医療資金供給と関連した項目を含む @ja-jp
definition: Health-related policy decisions including what different countries are doing regarding prescription drug policies, AIDS, psychiatric care, health care funding and related topics. @en-gb
note: nessuno
in scheme: Subject Code
created: 2000-10-30T12:00:00+00:00
modified: 2010-12-15T17:01:09+00:00
broader: Salute
narrower: Sicurezza alimentare

Specializzazioni mediche
type: Concept
preferred label: especialidades médicas @pt-br
preferred label: 専門医療 @ja-jp
preferred label: medical specialisation @en-gb
preferred label: especializaciones médicas @es
preferred label: Medizinisches Spezialgebiet @de
preferred label: Spécialisations médicales @fr
definition: The different medical specialist areas. @en-gb
definition: Les différentes spécialisations médicales @fr
definition: Diferentes áreas de especialización médica. @es
definition: Differenti aree e discipline di specializzazione medica
definition: Diferentes áreas de especialidade médica. @pt-br
definition: Verschiedene medizinische Spezialgebiete. @de
definition: 異なる医学専門分野 @ja-jp
note: nessuno
in scheme: Subject Code
created: 2000-10-30T12:00:00+00:00
modified: 2010-12-15T17:01:09+00:00
broader: Salute
narrower: Geriatria
narrower: Pediatria
narrower: Riproduzione
narrower: Genetica
narrower: Ginecologia, Ostetricia

Servizio Medico
type: Concept
preferred label: servicios médicos @es
preferred label: 臨床検査 @ja-jp
preferred label: serviços médicos (geral) @pt-br
preferred label: medical service @en-gb
preferred label: Medizinische Dienstleistung @de
preferred label: Examens médicaux @fr
definition: Medizinische Unterstützung/Hilfsmittel für Ärtze, wie Bluttests oder andere Tests an Einzelnen, Röntgen, CT, MRT etc. @de
definition: 医者に対する医療的なサポートとなるもの。血液検査やX線撮影、MRIなどの個々に行う様々な医療検査を含む @ja-jp
definition: Serviços de apoio a médicos, incluindo análises ao sangue e outros testes individuais, raios X, tomografias axiais computadorizadas, ressonâncias magnéticas, etc. @pt-pt
definition: Esami ed analisi mediche e altri test praticati da personale specializzato.
definition: Les examens et analyses médicaux : sang, radio, scanners, etc. @fr
definition: Serviços de apoio a médicos, incluindo exames de sangue e outros testes individuais, raios X, tomografias computadorizadas, ressonâncias magnéticas, etc. @pt-br
definition: Medical support for doctors, including blood tests and other medical tests on individuals, X-rays CAT scans MRIs etc. @en-gb
definition: Soporte médico para doctores, incluyendo test de sangre y otros test para personas, rayos X, escáner, MRI, etc. @es
note: nessuno
in scheme: Subject Code
created: 2000-10-30T12:00:00+00:00
modified: 2010-12-15T17:01:09+00:00
broader: Salute

Forma fisica
type: Concept
preferred label: 体力 @ja-jp
preferred label: Etat physique @fr
preferred label: physical fitness @en-gb
preferred label: estado físico @es
preferred label: condição física @pt-br
preferred label: Fitness @de
definition: L'état de santé cardio-vasculaire et musculaire @fr
definition: Condición cardiovascular y muscular de una persona. @es
definition: Kondition in Bezug auf die Gesundheit des Herz-Kreislauf-Systems und der Muskulatur. @de
definition: Condição cardiovascular e muscular de uma pessoa. @pt-br
definition: The condition of a person's cardio-vascular and muscular health. @en-gb
definition: Condizioni di salute di una persona a livello cardiovascolare e muscolare
definition: 人の持久力や筋力などの状態 @ja-jp
note: nessuno
in scheme: Subject Code
created: 2003-04-05T12:00:00+00:00
modified: 2012-07-10T12:00:00+00:00
broader: Salute

Malesseri
type: Concept
preferred label: Maladie @fr
preferred label: outras doenças @pt-pt
preferred label: Leiden @de
preferred label: enfermedad @es
preferred label: illness @en-gb
preferred label: 体調不良 @ja-jp
definition: 腹痛、頭痛、偏平足、腰痛のような非特定の疾病 @ja-jp
definition: Non-specific maladies such as stomach aches, headaches, flat feet, lumbago @en-gb
definition: Maladies bénignes comme les douleurs d'estomac, les maux de tête ou le lumbago @fr
definition: Doenças não específicas como dores de estômago, dores de cabeça, pés planos, lumbago. @pt-br
definition: Enfermedades no especifica tales dolor de estomago, dolor de cabeza, pie plano, lumbago. @es
definition: Doenças não específicas como dores de estômago, dores de cabeça, pés chatos, lumbago. @pt-pt
definition: Malanni non specifici, disturbi come mal di stomaco, mal di testa, lombaggine
definition: Unspezifische Krankheiten wie Magenschmerzen, Kopfschmerzen, Plattfüße, Hexenschuss. @de
note: nessuno
in scheme: Subject Code
created: 2004-04-22T12:00:00+00:00
modified: 2012-07-10T12:00:00+00:00
broader: Salute
narrower: Malattia mentale
narrower: Disturbo alimentare
narrower: Obesità

Condizioni mediche
type: Concept
preferred label: 症状 @ja-jp
preferred label: Medizinischer Zustand @de
preferred label: condiciones médicas @es
preferred label: medical conditions @en-gb
preferred label: condição médica @pt-br
preferred label: Etat de santé @fr
definition: Estados de evolução de doenças ou feridas. @pt-br
definition: Verschiedene Stadien von Krankheit, Leiden oder Verletzung. @de
definition: Various stages of disease, illness or injury @en-gb
definition: Varias etapas de una nfermedad, malestar o de lesión @es
definition: Vari stadi dell'evoluzione delle malattie o degli stati di infermità
definition: Etats de l'évolution des maladies ou des blessures @fr
definition: 病気、体調不良、傷害のさまざまな状態 @ja-jp
note: nessuno
in scheme: Subject Code
created: 2004-10-13T12:00:00+00:00
modified: 2012-07-10T12:00:00+00:00
broader: Salute

Paziente
type: Concept
preferred label: patient @en-gb
preferred label: doente @pt-pt
preferred label: 患者 @ja-jp
preferred label: Patient @de
definition: Chi è affetto da uno stato di malattia o da un disturbo ed è sottoposto a cure o terapie
definition: Fragen, die Menschen betreffen, die übergreifend Insassen von Krankenhäusern oder in ärztlicher Behandlung sind. @de
definition: Assuntos que afetam as pessoas em geral enquanto usuários de hospitais ou de consultas médicas. @pt-br
definition: 病院への来院者、あるいは医師の手術を受ける人々が抱える問題 @ja-jp
definition: Assuntos que afetam as pessoas em geral enquanto utentes de hospitais ou de consultas médicas. @pt-pt
definition: Issues which affect population in general as attendees at hospitals or doctors' surgeries. @en-gb
note: nessuno
in scheme: Subject Code
created: 2006-08-21T12:00:00+00:00
modified: 2012-07-10T12:00:00+00:00
broader: Salute
broad match: http://cv.iptc.org/newscodes/mediatopic/07000000

Contagiosa
type: Concept
preferred label: Ansteckende Krankheit @de
preferred label: doenças contagiosas @pt-br
preferred label: Maladies contagieuses @fr
preferred label: communicable diseases @en-gb
preferred label: 伝染病 @ja-jp
preferred label: enfermedades contagiosas @es
definition: Malattia trasmissibile da una persona o animale ad un'altra/o
definition: Krankheiten, die von einem Menschen oder Tier zu einem anderen übertragen werden können. @de
definition: Maladie transmissible d'un individu (homme ou animal) à l'autre @fr
definition: Doenças que podem ser transmitidas de um indivíduo (pessoa ou animal) a outro. @pt-pt
definition: Diseases that can be transmitted from one person or animal to another @en-gb
definition: 人や動物から伝染がありうる病気 @ja-jp
definition: Enfermedades que se pueden transmitir de una persona o animal a otra. @es
note: nessuno
in scheme: Subject Code
created: 2003-04-05T12:00:00+00:00
modified: 2012-07-10T12:00:00+00:00
broader: Malattia

Virale
type: Concept
preferred label: doenças virais @pt-pt
preferred label: enfermedades virósicas @es
preferred label: virus diseases @en-gb
preferred label: Maladie virale @fr
preferred label: Virusinfektion @de
preferred label: ウイルス疾患 @ja-jp
definition: Krankheiten, ausgelöst durch Infektionen innerhalb der Zellen durch Viren. @de
definition: Doenças causadas por uma infeção das células através de vírus. @pt-br
definition: Enfermedades causadas por una infección dentro de células a través de virus. @es
definition: ウイルスによる細胞内の感染によって引き起こされる病気 @ja-jp
definition: Malattia provocata da un'infezione delle cellule da parte di un virus
definition: Maladie provoquée par l'infection de cellules par un virus @fr
definition: Diseases caused by infection within cells by viruses @en-gb
note: nessuno
in scheme: Subject Code
created: 2003-04-05T12:00:00+00:00
modified: 2012-07-10T12:00:00+00:00
broader: Malattia

sida
type: Concept
preferred label: aids @pt-br
preferred label: SIDA @fr
preferred label: AIDS
preferred label: エイズ @ja-jp
preferred label: Aids @de
definition: Sindrome da Immunodeficienza Acquisita
definition: Le syndrome du SIDA est constitué par une ou plusieurs maladies révélant un déficit immunitaire de l'organisme qui est dû à un agent viral transmissible @fr
definition: Acquired Immunity Deficiency Syndrome, an incurable disease caused by the human immunodeficiency virus @en-gb
definition: Acquired Immunity Deficiency Syndrome, eine unheilbare Krankheit verursacht durch HIV. @de
definition: Síndrome da Imunodeficiência Adquirida, doença incurável causada pelo vírus da imunodeficiência humana. @pt-pt
definition: 後天性免疫欠陥症候群、HIVウイルスによって起こされた不治の病気 @ja-jp
definition: Síndrome de Imunodeficiência Adquirida, doença incurável causada pelo vírus da imunodeficiência humana. @pt-br
definition: Síndrome de Inmuno Deficiencia Adquirida , enfermedad incurable causada por el virus de inmunodeficiencia humano. @es
note: nessuno
in scheme: Subject Code
created: 2003-04-05T12:00:00+00:00
modified: 2012-07-10T12:00:00+00:00
broader: Malattia

Cancro
type: Concept
preferred label: Cancer @fr
preferred label: がん @ja-jp
preferred label: Krebs @de
preferred label: câncer @pt-br
preferred label: cancer @en-gb
preferred label: cancro @pt-pt
preferred label: cáncer @es
definition: Doença grave e muitas vezes fatal, caracterizada pela transformação de células normais em tumores. @pt-br
definition: A serious and often fatal disease caused when normal cells mutate into tumours @en-gb
definition: Tumore maligno caratterizzato dalla degenerazione delle cellule di un organo o di un tessuto
definition: Enfermedad grave y a menudo fatal causada cuando las células normales se transforman en tumores. @es
definition: 普通の細胞が腫瘍のという状態に突然変異することによって起こる、重大な、そしてしばしば致命的な病気 @ja-jp
definition: Tumeur maligne caractérisée par la dégénérence des cellules d'un organe ou d'un tissu @fr
definition: Eine ernsthafte und meist tödliche Krankheit, bei der sich Zellen zu Tumoren entwickeln. @de
note: nessuno
in scheme: Subject Code
created: 2003-04-05T12:00:00+00:00
modified: 2012-07-10T12:00:00+00:00
broader: Malattia

Cardiache
type: Concept
preferred label: Herzkrankheit @de
preferred label: doenças cardíacas @pt-br
preferred label: Maladie cardiaque @fr
preferred label: heart disease @en-gb
preferred label: 心臓病 @ja-jp
preferred label: enfermedades cardíacas @es
definition: Malattie riguardanti il cuore ed il sistema cardiocircolatorio; infarto, ostruzione dei vasi ecc.
definition: Eine verbreitete und ernsthafte Krankheit, verursacht durch die Verengung der Gefäße, die das Herz versorgen. @de
definition: Doença degenerativa grave causada pelo estreitamento das artérias que alimentam o coração. @pt-br
definition: A degenerative and serious disease caused by narrowing of the arteries feeding the heart @en-gb
definition: Enfermedad grave y degenerativa causada por la obstrucción de las arterias que llegan al corazón. @es
definition: Maladie dégénérative provoquée par le rétrécissement des artères @fr
definition: 深刻かつ退行的な病気。心臓に血液を送っている動脈が狭まることによって起こる @ja-jp
note: nessuno
in scheme: Subject Code
created: 2003-04-05T12:00:00+00:00
modified: 2012-07-10T12:00:00+00:00
broader: Malattia

Alzheimer
type: Concept
preferred label: Alzheimer Krankheit @de
preferred label: alzheimer's disease @en-gb
preferred label: アルツハイマー病 @ja-jp
preferred label: mal de alzheimer @es
definition: A disorder of the brain leading to dementia @en-gb
definition: Maladie cérébrale progressive entraînant une démence @fr
definition: Doença cerebral progressiva que leva à demência. @pt-br
definition: Eine Verwirrung des Geistes, die zur Demenz führt. @de
definition: 痴呆症につながる脳の障害 @ja-jp
definition: Desorden mental que conduce a la demencia. @es
definition: Malattia cerebrale che conduce progressivamente alla demenza
note: nessuno
in scheme: Subject Code
created: 2003-04-05T12:00:00+00:00
modified: 2012-07-10T12:00:00+00:00
broader: Malattia
broad match: http://cv.iptc.org/newscodes/mediatopic/20000446

Malattie degli Animali
type: Concept
preferred label: Tierkrankheit @de
preferred label: 動物の病気 @ja-jp
preferred label: Maladie animale @fr
preferred label: enfermedades animales @es
preferred label: doenças de origem animal @pt-pt
preferred label: animal diseases @en-gb
definition: Disorders affecting animals that do not necessarily endanger humans @en-gb
definition: Troubles affectant les animaux mais ne mettant pas nécessairement en danger l'être humain @fr
definition: Doenças que afetam animais mas não colocam necessariamente em perigo os seres humanos. @pt-br
definition: Krankheit, die Tiere befällt, aber nicht notwendigerweise gefährdend für Menschen ist. @de
definition: 動物がかかる病気。人間にも害を及ぼすとは限らない @ja-jp
definition: Desordenes que afectan a los animales que no necesariamente ponen en peligro a seres humanos. @es
definition: Disturbi o malattie che colpiscono gli animali e non necessariamente mettono in pericolo la specie umana
note: nessuno
in scheme: Subject Code
created: 2003-04-05T12:00:00+00:00
modified: 2012-07-10T12:00:00+00:00
broader: Malattia

Malattie delle Piante
type: Concept
preferred label: doenças das plantas @pt-pt
preferred label: Pflanzenkrankheit @de
preferred label: 植物の病気 @ja-jp
preferred label: enfermedades de plantas @es
preferred label: plant diseases @en-gb
preferred label: Maladie végétale @fr
definition: Doenças que afetam plantas, causadas por parasitas ou fatores ambientais. @pt-pt
definition: Desordenes que afectan a las plantas ya sea por parásitos o factores ambientales. @es
definition: Disorders affecting plants caused either by parasites or environmental factors @en-gb
definition: Krankheit, die Pflanzen befällt, verursacht durch Parasiten oder durch Umwelteinflüsse. @de
definition: Troubles affectant les plantes provoquées par des parasites ou par l'environnement @fr
definition: Disturbi o malattie che colpiscono gli organismi vegetali causate da parassiti o fattori legati all'ambiente
definition: 植物がかかる病気。寄生虫か、環境のいずれかの要因が原因となる @ja-jp
note: nessuno
in scheme: Subject Code
created: 2003-04-05T12:00:00+00:00
modified: 2012-07-10T12:00:00+00:00
broader: Malattia

retrovírus
type: Concept
preferred label: レトロウイルス @ja-jp
preferred label: retrovirus @es
preferred label: Retrovirus
definition: A family of RNA viruses such as those causing leukaemia and AIDS @en-gb
definition: Família de vírus RNA como os que causam leucemia e aids. @pt-br
definition: Famille de virus à ARN comme ceux provoquant la leucémie et le SIDA @fr
definition: Família de vírus ARN como os que causam leucemia e sida. @pt-pt
definition: un familiar de los viruses RNA, tales como aquellos que causan la Leucemia y el Sida. @es
definition: 白血病やエイズを引き起こすウイルスのようなRNAウイルス群 @ja-jp
definition: Familie des RNA Virus, wie der, der Leukämie und Aids verursacht. @de
definition: Una famiglia dei virus RNA come quelli che causano la leucemia e l'AIDS
note: nessuno
note: typo fixed in Explanation @en-gb
in scheme: Subject Code
created: 2004-10-13T12:00:00+00:00
modified: 2012-07-10T12:00:00+00:00
broader: Malattia

Farmaci su ricetta medica
type: Concept
preferred label: medicamentos @pt-br
preferred label: prescription drugs @en-gb
preferred label: medicamento bajo prescripción médica @es
preferred label: Prescription médicale @fr
preferred label: 処方 @ja-jp
preferred label: Droge auf Rezept @de
definition: Medicinali acquistabili solo dietro prescrizione da parte del medico
definition: Drugs that can be purchased only with a doctor's authorization @en-gb
definition: Drogas que só podem ser compradas com autorização médica. @pt-br
definition: 医師の発行した処方箋がないと購入できない薬剤 @ja-jp
definition: Drogas que solo se pueden comprar con la autorización de un doctor. @es
definition: Drogen, die ausschließlich mit der Erlaubnis des Arztes verabreicht werden dürfen. @de
definition: Médicaments ou drogues ne pouvant être achetés que sur ordonnance du médecin @fr
note: nessuno
in scheme: Subject Code
created: 2003-04-05T12:00:00+00:00
modified: 2012-07-10T12:00:00+00:00
broader: Cura

Integratori
type: Concept
preferred label: Diätische Ergänzung @de
preferred label: sumplementos alimenticios @es
preferred label: dietary supplements @en-gb
preferred label: suplementos alimentares @pt-pt
preferred label: Compléments nutritifs @fr
preferred label: サプリメント @ja-jp
definition: Nutrientes que se acrescentam à alimentação para fortalecer a saúde. @pt-pt
definition: Elementi o sostanze nutritive assimilate in aggiunta al cibo al fine di sostenere la salute
definition: Nutrientes que se toman además de la comida para fortalecer la salud. @es
definition: Nutrients taken in addition to food to bolster health @en-gb
definition: Nährstoffe, die der Nahrung beigefügt werden zur Förderung der Gesundheit. @de
definition: 健康を強めるために食物に加えて取られる栄養物 @ja-jp
definition: Eléménts nutritifs pris en complément de la nourriture pour satisfaire les besoins journaliers de l'organisme @fr
note: nessuno
in scheme: Subject Code
created: 2003-04-05T12:00:00+00:00
modified: 2012-07-10T12:00:00+00:00
broader: Cura

Dieta
type: Concept
preferred label: diet @en-gb
preferred label: dieta @pt-br
preferred label: Régime @fr
preferred label: ダイエット @ja-jp
preferred label: Diät @de
definition: Regime alimentare controllato
definition: Kontrollierter Konsum von Nahrungsmitteln. @de
definition: Controlled food consumption @en-gb
definition: Contrôle de la consommation d'aliments @fr
definition: Consumo controlado de comida. @pt-pt
definition: 食事量を制限すること @ja-jp
note: nessuno
in scheme: Subject Code
created: 2004-10-13T12:00:00+00:00
modified: 2012-07-10T12:00:00+00:00
broader: Cura

Esame medico
type: Concept
preferred label: Medizinische Untersuchung/Test @de
preferred label: meios complementares de diagnóstico @pt-br
preferred label: 医療検査 @ja-jp
preferred label: Protocole médical @fr
preferred label: medical procedure/test @en-gb
preferred label: exámen/procedimiento médico @es
definition: ストレス検査、カテーテル挿入、血液検査、コンピュータ化された断層写真撮影、磁気共鳴映像診断などの治療 @ja-jp
definition: Variété de traitements comme les IRM, les scanners, analyses de sang @fr
definition: Variedade de tratamentos, como testes de estresse, cateterização, exames de sangue, tomografia computadorizada, ressonância magnética, etc. @pt-br
definition: Any of a variety of treatments such as stress tests, catheterization, blood tests, computerised axial tomography scan or magnetic resonance imaging @en-gb
definition: Cualquiera de las variedades de tratamientos, tales como los exámenes de stress, exámen de sangre, tomografía axial computarizada. @es
definition: Variedade de tratamentos, como testes de stress, cateterização, análises ao sangue, tomografia axial computadorizada, ressonância magnética, etc. @pt-pt
definition: Trattamento praticato secondo un determinato protocollo per la valutazione di un determinato disturbo o malattia
definition: Jede Variation der Behandlung wie Stresstests, Katheterisieren, Bluttests, CT oder MCR. @de
note: typo fixed in Explanation @en-gb
note: nessuno
in scheme: Subject Code
created: 2004-10-13T12:00:00+00:00
modified: 2012-07-10T12:00:00+00:00
broader: Cura

Terapia
type: Concept
preferred label: terapias @pt-br
preferred label: Therapie @de
preferred label: therapy @en-gb
preferred label: 理学療法 @ja-jp
preferred label: Thérapie @fr
preferred label: terapia @es
definition: Traitement de la condition physique, mentale ou médicale par des moyens non chirurgicaux @fr
definition: Tratamento de condições físicas, mentais ou médicas através de meios não cirúrgicos. @pt-br
definition: Trattamento finalizzato a risolvere una patologia
definition: 外科的手段を行わない、体･心や病状の治療 @ja-jp
definition: Behandlung der physikalischen, mentalen oder medizinischen Kondition mit nicht-chirurgischen Mitteln. @de
definition: Tratamiento físico, mental o médico mediante medios no cirurgicos. @es
definition: Treatment of physical, mental or medical conditions by non-surgical means @en-gb
note: typo fixed in Explanation @en-gb
note: nessuno
in scheme: Subject Code
created: 2004-10-13T12:00:00+00:00
modified: 2012-07-10T12:00:00+00:00
broader: Cura

Medicina di Base
type: Concept
preferred label: primary care physician @en-gb
preferred label: médicos de família @pt-pt
preferred label: Hausarzt @de
preferred label: 開業医 @ja-jp
definition: Insieme delle attività riguardanti le prestazioni di base, del medico di medicina generale e di assistenza primaria operante nel territorio
definition: Allgemeinmediziner - erster Kontakt bei Gesundheitsproblemen. @de
definition: Médico de cuidados de saúde básicos - primeiro ponto de contacto para todos os problemas de saúde. @pt-pt
definition: 患者の基本的健康維持を担当する医師－健康に関するすべての問題について第１次的に対応する @ja-jp
definition: Médico de cuidados de saúde básicos - primeiro ponto de contato para todos os problemas de saúde. @pt-br
definition: Patient's basic health care doctor - first point of call for all health related problems @en-gb
note: nessuno
in scheme: Subject Code
created: 2006-08-21T12:00:00+00:00
modified: 2012-07-10T12:00:00+00:00
broader: Personale medico
broad match: http://cv.iptc.org/newscodes/mediatopic/20000485

Sindacati Sanità
type: Concept
preferred label: sindicatos da saúde @pt-br
preferred label: health-workers union @en-gb
preferred label: 医療従事者組合 @ja-jp
preferred label: Gewerkschaft für medizinische Berufe @de
definition: Organizzazioni e attività sindacali riguardanti i lavoratori del comparto Sanità
definition: 医師、看護師、ヘルスワーカーなどの組合に関する問題 @ja-jp
definition: Questões envolvendo grupos de médicos, enfermeiros, trabalhadores da saúde, etc. @pt-br
definition: Issues involving industry groups for doctors, nurses, health workers etc. @en-gb
definition: Fragen, die sich auf organisierte Vertretungen für Ärzte, Schwestern und Pflegepersonal beziehen. @de
note: nessuno
in scheme: Subject Code
created: 2006-08-21T12:00:00+00:00
modified: 2012-07-10T12:00:00+00:00
broader: Personale medico
broad match: http://cv.iptc.org/newscodes/mediatopic/20000536

Fitoterapia
type: Concept
preferred label: fitoterapia @pt-br
preferred label: herbal @en-gb
preferred label: herbales @es
preferred label: Homöopathie @de
preferred label: 漢方 @ja-jp
preferred label: Phytothérapie @fr
definition: Treatment based on the use of herbs and other plants to cure or alleviate disease symptoms @en-gb
definition: Behandlung, die auf der Nutzung von Kräutern und anderen Pflanzen beruht, um Krankheitssymptomen vorzubeugen oder zu heilen. @de
definition: Médecine par les plantes @fr
definition: 薬草やその他の植物を用いた病気症状を治療したり緩和するための治療 @ja-jp
definition: Trattamento basato sull'utilizzo di erbe e altre piante
definition: Tema basado en el uso de hierbas y otras plantas para la cura o alivio de síntomas de enfermedades. @es
definition: Tratamento baseado no uso de ervas e de outras plantas para curar ou aliviar sintomas de doença. @pt-br
note: nessuno
in scheme: Subject Code
created: 2000-10-30T12:00:00+00:00
modified: 2010-12-15T17:01:09+00:00
broader: Medicina

Olistica
type: Concept
preferred label: 全人的医療 @ja-jp
preferred label: holística @pt-pt
preferred label: holistic @en-gb
preferred label: Ganzheitliche Medizin @de
preferred label: holísticos @es
preferred label: Médecine holistique @fr
definition: Tratado sobre la persona completa, incluyendo factores mentales, sociales más allá de sólo los síntomas de una enfermedad. @es
definition: Trattamento che considera il paziente come un intero, inclusi i fattori mentali e sociali, e non solo sulla base dei sintomi
definition: 病気による症状よりも精神的、社会的な要因を含む人に対する全体的な治療 @ja-jp
definition: Médecine qui traite le patient comme un tout et pas seulement en fonction des symptômes @fr
definition: Tratamento da pessoa como um todo, incluindo fatores mentais e sociais, e não somente os sintomas da doença. @pt-br
definition: Treatment of the whole person including mental and social factors rather than just the symptoms of the disease. @en-gb
definition: Behandlung der gesamten Person, unter Einbeziehung mentaler und sozialer Faktoren, eher als die Krankheitssymptome selbst. @de
note: nessuno
in scheme: Subject Code
created: 2000-10-30T12:00:00+00:00
modified: 2010-12-15T17:01:09+00:00
broader: Medicina

Occidentale
type: Concept
preferred label: western @en-gb
preferred label: medicina ocidental @pt-pt
preferred label: 西洋医学 @ja-jp
preferred label: Médecine occidentale @fr
preferred label: Schulmedizin @de
preferred label: occidentales @es
preferred label: ocidental @pt-br
definition: Diagnóstico, tratamento e prevenção de doenças baseados na investigação científica moderna ocidental. @pt-pt
definition: 西洋の近代科学の研究に基づいた病気の診断、治療および予防 @ja-jp
definition: Pratique de la médecine selon les normes en vigueur dans les pays occidentaux @fr
definition: Diagnosi, trattamento e prevenzione delle malattie basata sulla moderna ricerca scientifica
definition: Diagnostische, Behandlung und Prävention von Krankheiten, basierend auf modernen wissenschaftlichen Forschungen der westlichen Welt. @de
definition: Diagnóstico, tratamiento y prevención de enfermedades basados en investigación científica moderna del occidente. @es
definition: The practice of diagnosis, treatment and prevention of disease based on modern scientific research in the western hemisphere. @en-gb
note: nessuno
in scheme: Subject Code
created: 2000-10-30T12:00:00+00:00
modified: 2010-12-15T17:01:09+00:00
broader: Medicina

Cinese
type: Concept
preferred label: traditional Chinese @en-gb
preferred label: Chinesische Medizin @de
preferred label: 東洋医学 @ja-jp
preferred label: chinos tradicionales @es
preferred label: medicina tradicional chinesa @pt-pt
preferred label: tradicional chinesa @pt-br
preferred label: Médecine traditionnelle chinoise @fr
definition: Diagnóstico, tratamiento y prevención de enfermedades basados en métodos tradicionales desarrollados en oriente. @es
definition: Diagnosi, trattamento e prevenzione delle malattie basata sui metodi tradizionali sviluppatisi in oriente, specie in Cina
definition: The practice of diagnosis, treatment and prevention of disease based on traditional methods developed in the orient. @en-gb
definition: Diagnóstico, tratamento e prevenção de doenças baseados em métodos tradicionais orientais @pt-br
definition: Diagnóstico, tratamento e prevenção de doenças baseados em métodos tradicionais orientais. @pt-pt
definition: Diagnose, Behandlung und Prävention von Krankheiten basierend auf traditionellen Methoden aus dem Orient. @de
definition: Pratique de la médecine selon les méthodes de la Chine traditionnelle @fr
definition: 東洋で発展した伝統的な方法に基づいた病気の診断、治療および予防 @ja-jp
note: nessuno
in scheme: Subject Code
created: 2000-10-30T12:00:00+00:00
modified: 2010-12-15T17:01:09+00:00
broader: Medicina

Vaccino
type: Concept
preferred label: vacunas @es
preferred label: ワクチン @ja-jp
preferred label: Vaccins @fr
preferred label: vacinas @pt-pt
preferred label: vaccines @en-gb
preferred label: Impfung @de
definition: Médications utilisées pour immuniser contre des maladies @fr
definition: 病気に対する免疫を作るための薬剤 @ja-jp
definition: Farmaco prodotto per sviluppare immunità rispetto a una certa malattia
definition: Medicamentos desenvolvidos para criar imunidade a doenças. @pt-pt
definition: Medikamente, die erzeugt werden um gegen Krankheiten immun zu werden. @de
definition: Medicamentos diseñados para desarrollar inmunidad frente a las enfermedades. @es
definition: Medications designed to create immunity to diseases @en-gb
note: nessuno
in scheme: Subject Code
created: 2003-04-05T12:00:00+00:00
modified: 2012-07-10T12:00:00+00:00
broader: Medicina preventiva

Medicare
type: Concept
preferred label: 高齢者医療保険制度 @ja-jp
preferred label: salud pública para jubilados en eeuu @es
preferred label: medicare @pt-br
preferred label: Pflegeversicherung @de
definition: A program of the U.S. government to provide health care to senior citizens @en-gb
definition: 米政府による高齢者に対する医療保険制度 @ja-jp
definition: Aux USA, programme gouvernemental de santé à destination des personnes âgées et des handicapés @fr
definition: Programa do governo norte-americano para fornecer cuidados de saúde a cidadãos idosos. @pt-pt
definition: Programa del gobierno de Estados Unidos para brindar atención de salud al adulto mayor. @es
definition: Staatliche Gesundheitsversorgung von älteren Menschen. @de
definition: Specifico programma del governo USA di assistenza sanitaria agli anziani e ai portatori di handicap
note: nessuno
in scheme: Subject Code
created: 2003-04-05T12:00:00+00:00
modified: 2012-07-10T12:00:00+00:00
broader: Servizio Sanitario Nazionale
broad match: http://cv.iptc.org/newscodes/mediatopic/20000480

低所得者医療扶助制度
type: Concept
preferred label: medicaid @en-gb
preferred label: salud pública en eeuu @es
preferred label: Medicaid
preferred label: Staatliche Krankenversicherung @de
definition: Programa del gobierno de Estados Unidos para brindar atención de salud a ciudadanos de escaso recursos de todas las edades. @es
definition: 米政府によるすべての年齢の貧困者に対する医療扶助制度 @ja-jp
definition: Programa do governo norte-americano para fornecer cuidados de saúde a cidadãos carenciados de todas as idades. @pt-pt
definition: Aux USA, programme gouvernemental d'aide médicale aux plus pauvres @fr
definition: Programa do governo norte-americano para fornecer cuidados de saúde a cidadãos necessitados de todas as idades. @pt-br
definition: Staatliche Gesundheitsversorgung von Menschen aller Altersgruppen. @de
definition: A program of the U.S. government to provide health care to needy citizens of all ages @en-gb
definition: Specifico programma del governo USA di assistenza sanitaria ai cittadini bisognosi
note: nessuno
in scheme: Subject Code
created: 2003-04-05T12:00:00+00:00
modified: 2012-07-10T12:00:00+00:00
broader: Servizio Sanitario Nazionale
broad match: http://cv.iptc.org/newscodes/mediatopic/20000480

Sicurezza alimentare
type: Concept
preferred label: segurança alimentar @pt-pt
preferred label: food safety @en-gb
preferred label: Lebensmittelkontrolle @de
preferred label: 食品安全 @ja-jp
preferred label: Sûreté alimenatire @fr
preferred label: seguridad alimenticia @es
definition: Strategie per garantire la qualità degli alimenti, lotta contro ogni forma di adulterazione
definition: Issues relating to food cleanliness and contamination @en-gb
definition: Questões relativas à limpeza e à contaminação de alimentos. @pt-pt
definition: 食物の清潔さと汚染に関連している問題 @ja-jp
definition: Asuntos que tienen que ver con la limpieza y contaminación de los alimentos. @es
definition: Les questions touchant à la sureté alimentaire et aux contaminations @fr
definition: Artikel im Kontext von Lebensmittelreinheit und Lebensmittelvergiftung. @de
note: nessuno
in scheme: Subject Code
created: 2003-04-05T12:00:00+00:00
modified: 2012-07-10T12:00:00+00:00
broader: Politica Salute

Geriatria
type: Concept
preferred label: geriatria @pt-br
preferred label: Geriatrie @de
preferred label: geriatric @en-gb
preferred label: geriatría @es
preferred label: 老年病 @ja-jp
preferred label: Gériatrie @fr
definition: La recherche en matière de vieillesse @fr
definition: Research into aging and age-related issues including age-related illnesses, medical research, trends, geriatric medicine and related topics like age discrimination and health insurance for an ageing population. @en-gb
definition: Erforschung des Alters oder altersbedingte Probleme, wie Krankheiten, medizinische Forschung, Entwicklungen, altersspezifische Medizin, und verwandte Themen wie Altersdiskriminierung und Gesundheitsfürsorge im Alter. @de
definition: 老化、加齢性の問題の研究で、加齢性の病気、医学の研究、傾向、老人病の薬と老人のための年齢差別や健康保険のような関連した項目を含む @ja-jp
definition: Investigación en asuntos etarios, incluido enfermedades relacionadas con la edad, investigación médica, tendencias, medicina geriátrica, otros temas como discriminación etaria y seguro de salud para la población mayor. @es
definition: Investigação sobre questões de idade e de envelhecimento, incluindo doenças relacionadas à idade, tendências da investigação médica, geriatria e tópicos relacionados como discriminação etária e seguro de saúde para a população idosa. @pt-br
definition: Investigação sobre questões de idade e de envelhecimento, incluindo doenças relacionadas com a idade, tendências da investigação médica, geriatria e tópicos relacionados como discriminação etária e seguro de saúde para a população idosa. @pt-pt
definition: Medicina che si occupa della salute degli anziani e cura i disturbi e le malattie della terza età
note: nessuno
in scheme: Subject Code
created: 2000-10-30T12:00:00+00:00
modified: 2010-12-15T17:01:09+00:00
broader: Specializzazioni mediche

Pediatria
type: Concept
preferred label: 小児病 @ja-jp
preferred label: pediatría @es
preferred label: Pédiatrie @fr
preferred label: pediatria @pt-br
preferred label: Pädiatrie @de
preferred label: pediatrics @en-gb
definition: Forschung und Medizin speziell für die Jüngeren, umfasst Neugeborene, Kleinkindversorgung, Kinderkrankheiten und ihre Behandlung, sowie Gesundheitsfragen von Jugendlichen und ihre Verhaltensprobleme. @de
definition: Investigação e medicina especificamente para jovens: inclui bebés prematuros, cuidados infantis, doenças de crianças e seu tratamento, bem como saúde e problemas de comportamento de adolescentes. @pt-pt
definition: Médecine et médecins spécialisés dans les maladies enfantines et plus généralement de la naissance à l'adolescence @fr
definition: Research and medicine specifically for the young - includes premature babies, infant care, childhood disease and treatment - also teen-related health and behaviour problems. @en-gb
definition: Medicina specializzata nelle malattie dell'infanzia e dell'età evolutiva
definition: Investigação e medicina especificamente para jovens: inclui bebês prematuros, cuidados infantis, doenças de crianças e seu tratamento, bem como saúde e problemas de comportamento de adolescentes. @pt-br
definition: 特に若者のための研究と医学-未熟児、乳児ケア、幼児の病気と治療を含み-同じく10代の健康と行動問題を含む @ja-jp
definition: Investigación y medicina especializada en jóvenes, incluye bebés prematuros, cuidado de niños, enfermedades y tratamiento de niños, además de salud y problemas de comportamiento de adolescentes. @es
note: nessuno
in scheme: Subject Code
created: 2000-10-30T12:00:00+00:00
modified: 2010-12-15T17:01:09+00:00
broader: Specializzazioni mediche

Riproduzione
type: Concept
preferred label: reprodução @pt-pt
preferred label: 生殖医学 @ja-jp
preferred label: Reproduktionsmedizin @de
preferred label: Reproduction @fr
preferred label: reproducción @es
preferred label: reproduction @en-gb
definition: Incluye tecnologías reproductivas, como fertilización in vitro, clonación y debates relacionados. Desarrollo de asuntos sexuales y enfermedades de transmisión sexual. @es
definition: Reproduktionstechnologien, wie Invitrofertilisation, sowohl das Klonen als auch die damit zusammenhängenden Debatten. Entwicklungen der Sexualität und durch sexuellen Kontakt übertragene Krankheiten fallen auch in diese Kategorie. @de
definition: Inclui tecnologias reprodutivas como fertilização in vitro, clonagem e debates relacionados, questões sobre desenvolvimento sexual e sobre doenças sexualmente transmissíveis. @pt-br
definition: Ricerca e medicina specializzate nelle tematiche proprie della riproduzione umana
definition: Des techniques de reproduction in vitro au débat sur le clonage en passant par le développement sexuel et les maladies sexuellement transmissibles @fr
definition: Reproductive technologies like invitro fertilization and cloning as well as related debates. Sexual development matters and sexually transmitted diseases would also fall under this category. @en-gb
definition: ここには関連した議論のみならず、体外受精やクローン技術のような生命操作技術を含める。性発達性障害や性転換症においてもこのカテゴリーに分類される @ja-jp
note: nessuno
in scheme: Subject Code
created: 2000-10-30T12:00:00+00:00
modified: 2010-12-15T17:01:09+00:00
broader: Specializzazioni mediche

Genetica
type: Concept
preferred label: Genetik @de
preferred label: genetics @en-gb
preferred label: Génétique @fr
preferred label: 遺伝子治療 @ja-jp
preferred label: genética @pt-br
definition: La recherche sur les gênes et l'hérédité y compris l'étude des protéines par exemple @fr
definition: 遺伝子ベースの病気と病気の治療法についての科学と研究。プロテオミクス(どのタンパク質がどの遺伝子によって造られ、それがどのような役割を果たしているか調べる研究)や一般的な遺伝学全般と幹細胞についての研究を含む @ja-jp
definition: Wissenschaft und Forschung in Bezug auf Störungen des genetischen Codes und deren Ursachen. Umfasst Proteinforschung (Studium welches Gen, welches Eiwieß produziert und was diese tun), allgemeine Genetik und Stammzellenforschung. @de
definition: Ciência que investiga doenças genéticas, seu tratamento e cura. Inclui proteómica (estudo sobre a produção de proteínas e sobre sua ação), genética geral e investigação celular. @pt-br
definition: Scienza e ricerca applicate ai temi riguardanti le malattie genetiche e il loro trattamento; la ricerca sulle cellule staminali, ecc.
definition: La ciencia e investigación de enfermedades genéticas, su tratamiento y cura. Esto puede incluir proteomics (el estudio de qué proteínas se producen por qué genes y qué hacen esas proteínas), genética general e investigación celular. @es
definition: The science and research into genetic-base disease and cures for disease. This would include proteomics (the study of what proteins are produced by which genes and what those proteins do), general genetics and stem-cell research. @en-gb
definition: Ciência que investiga doenças genéticas, seu tratamento e cura. Inclui proteómica (estudo sobre a produção de proteínas e sobre a sua ação), genética geral e investigação celular. @pt-pt
note: nessuno
in scheme: Subject Code
created: 2000-10-30T12:00:00+00:00
modified: 2010-12-15T17:01:09+00:00
broader: Specializzazioni mediche

Ginecologia, Ostetricia
type: Concept
preferred label: -- @es
preferred label: Gynécologie @fr
preferred label: 産婦人科 @ja-jp
preferred label: obstetrícia/ginecologia @pt-pt
preferred label: Gynäkologie @de
preferred label: obstetrics/gynecology @en-gb
definition: Specialty of female reproductive organs @en-gb
definition: Krankheiten der weiblichen Sexual- und Fortpflanzungsorgane. @de
definition: Especialidade médica que se ocupa dos órgãos reprodutores femininos. @pt-pt
definition: -- @es
definition: 女性生殖器の専門 @ja-jp
definition: Spécialité de la médecine concernant les femmes @fr
definition: Medicina dell'apparato riproduttivo femminile, della fecondazione, gestazione e parto
note: nessuno
in scheme: Subject Code
created: 2004-10-13T12:00:00+00:00
modified: 2012-07-10T12:00:00+00:00
broader: Specializzazioni mediche

Malattia mentale
type: Concept
preferred label: Maladie mentale @fr
preferred label: doenças mentais @pt-pt
preferred label: Psychische Krankheit @de
preferred label: mental illness @en-gb
preferred label: enfermedad mental @es
preferred label: 精神障害 @ja-jp
definition: Aquellas enfermedades que afectan la mente @es
definition: Doenças que afetam a mente. @pt-br
definition: Maladies affectant le mental @fr
definition: Die Krankheiten, die die Psyche betreffen. @de
definition: Those illnesses affecting the mind @en-gb
definition: Malattia o disturbo mentale o psicologico; malattia psichiatrica
definition: 心を冒す病気 @ja-jp
note: nessuno
in scheme: Subject Code
created: 2004-10-13T12:00:00+00:00
modified: 2012-07-10T12:00:00+00:00
broader: Malesseri

Disturbo alimentare
type: Concept
preferred label: Essstörung @de
preferred label: eating disorder @en-gb
preferred label: distúrbios alimentares @pt-pt
preferred label: 摂食障害 @ja-jp
preferred label: transtornos alimentares @pt-br
preferred label: desordenes alimenticios. @es
preferred label: Troubles alimentaires @fr
definition: Anorexia, bilimia, consumo excesivo de alimentos y otras enfermedades similares. @es
definition: Anorexie, boulimie et troubles de l'alimentation @fr
definition: Anorexia, bulimia, comer em excesso e doenças similares. @pt-pt
definition: Magersucht, Bulimie, Adipositas und vergleichbare Krankheiten. @de
definition: Disturbi dovuti ad una cattiva alimentazione ed alterato rapporto con il cibo
definition: Anorexia, bulimia, overeating and similar illnesses @en-gb
definition: 拒食症、過食症、食べ過ぎ、および同様の病気 @ja-jp
note: nessuno
in scheme: Subject Code
created: 2004-10-13T12:00:00+00:00
modified: 2012-07-10T12:00:00+00:00
broader: Malesseri

Obesità
type: Concept
preferred label: obesidade @pt-br
preferred label: Übergewicht @de
preferred label: Obésité @fr
preferred label: obesidad @es
preferred label: 肥満 @ja-jp
preferred label: obesity @en-gb
definition: Condição do peso corporal considerada geralmente 20% acima do normal para o gênero, idade, altura e estrutura óssea. @pt-br
definition: Zustand des Körpergewichts, der 20 Prozent über dem Normalgewicht liegt, je nach Geschlecht, Alter und Größe und Körperbau. @de
definition: Masse corporelle généralement supérieur à 20% de la normale en fonction du sexe, de l'âge, de la taille et de la structure osseuse @fr
definition: Condizione del peso corporeo generalmente considerata in ordine al 20 % al di sopra della norma per quanto riguarda sesso, età, peso e struttura ossea
definition: Una condición del peso corporal considerada generalmente 20 por ciento sobre lo normal para el género, la edad, la altura y la estructura del hueso @es
definition: Condição do peso corporal considerada geralmente 20% acima do normal para o género, idade, altura e estrutura óssea. @pt-pt
definition: 性別、年齢、身長、および骨格の標準より、一般に体重が20パーセント重い状態 @ja-jp
definition: A condition of body weight generally considered 20 percent above the norm for gender, age, height and bone structure @en-gb
note: nessuno
in scheme: Subject Code
created: 2004-10-13T12:00:00+00:00
modified: 2012-07-10T12:00:00+00:00
broader: Malesseri

Storie, Curiosità
type: Concept
preferred label: Gens animaux insolite @fr
preferred label: 人間的興味 @ja-jp
preferred label: interesse humano @pt-br
preferred label: human interest @en-gb
preferred label: interés humano @es
preferred label: Vermischtes @de
definition: Argomenti di natura insolita o bizzarra, temi leggeri.
definition: Weniger Schwerwiegendes über Personen, Gruppen, Tiere oder andere Objekte. @de
definition: Histórias leves sobre indivíduos, grupos, animais ou objetos. @pt-br
definition: Histoires légères sur des groupes, des individus, des animaux ou des objets @fr
definition: Cosas acerca individuos, grupos, animales u objetos. @es
definition: Histórias ligeiras sobre indivíduos, grupos, animais ou objetos. @pt-pt
definition: 個人、グループ、動物、あるいは物についてのより明るい項目 @ja-jp
definition: Lighter items about individuals, groups, animals or objects. @en-gb
note: nessuno
in scheme: Subject Code
created: 2000-10-30T12:00:00+00:00
modified: 2010-12-15T17:01:09+00:00
narrower: Animali
narrower: Curiosità
narrower: Persone
narrower: Mistero
narrower: Società
narrower: Premi
narrower: Case reali
narrower: Piante

Animali
type: Concept
preferred label: animais @pt-pt
preferred label: Animaux @fr
preferred label: animales @es
preferred label: animal @en-gb
preferred label: 動物 @ja-jp
preferred label: Tier @de
definition: Les histoires d'animaux @fr
definition: すべての種類の動物に関する記事 @ja-jp
definition: historias que envuelven a animales de todos clases. @es
definition: Histórias envolvendo animais de qualquer tipo. @pt-pt
definition: Histórias envolvendo animais de todo tipo. @pt-br
definition: Tiere aller Arten @de
definition: Argomenti riguardanti gli animali di tutti i tipi
definition: Animals of all types @en-gb
note: nessuno
in scheme: Subject Code
created: 2000-10-30T12:00:00+00:00
modified: 2010-12-15T17:01:09+00:00
broader: Storie, Curiosità

Curiosità
type: Concept
preferred label: curiosidades @pt-br
preferred label: 好奇心 @ja-jp
preferred label: curiosity @en-gb
preferred label: Insolite @fr
preferred label: Kurioses @de
definition: Außergewöhnliche Inhalte, die Erheiterung oder Fragen auslösen. @de
definition: Argomenti di natura insolita o bizzarra che possono suscitare quesiti o divertimento
definition: Histórias de natureza insólita que podem suscitar questões ou divertir. @pt-br
definition: (読者に)疑問を引き起こしたり(読者を)面白がらせるような珍しい記事 @ja-jp
definition: Content of an unusual nature that can raise questions or amuse @en-gb
definition: Historias de una naturaleza inusual que pueden general interrogantes o sorprender. @es
definition: Les histoires bizarres, amusantes ou faisant réfléchir @fr
note: nessuno
in scheme: Subject Code
created: 2000-10-30T12:00:00+00:00
modified: 2010-12-15T17:01:09+00:00
broader: Storie, Curiosità
broad match: http://cv.iptc.org/newscodes/mediatopic/08000000

Persone
type: Concept
preferred label: pessoas @pt-pt
preferred label: gente @es
preferred label: 人々 @ja-jp
preferred label: people @en-gb
preferred label: Gens @fr
preferred label: Leute @de
definition: Unusual content about people of all levels @en-gb
definition: あらゆる地位にある人間についての常ならぬ話 @ja-jp
definition: Usualmente, historias acerca de personas de todas clases. @es
definition: Argomenti insoliti sulle persone
definition: Außergewöhnliche Inhalte über Personen auf allen Ebenen. @de
definition: Les histoires insolites sur les gens @fr
definition: Histórias insólitas sobre pessoas de todos os níveis. @pt-br
note: nessuno
in scheme: Subject Code
created: 2000-10-30T12:00:00+00:00
modified: 2010-12-15T17:01:09+00:00
broader: Storie, Curiosità
narrower: Consigli, Suggerimenti
narrower: Celebrità
narrower: Iniziative, Realizzazioni
narrower: Errori, Disavventure
narrower: Predizioni futuro

Mistero
type: Concept
preferred label: Mysteriöses @de
preferred label: ésotérisme @fr
preferred label: misterios @es
preferred label: mistérios (oculto) @pt-br
preferred label: 謎 @ja-jp
preferred label: mystery @en-gb
definition: Algo inexplicável ou desconhecido. @pt-br
definition: Algo inexplicable o desconocido. @es
definition: 説明のつかないもの、あるいは未知のもの @ja-jp
definition: Choses inexpliquées ou inconnues @fr
definition: Something unexplained or unknown @en-gb
definition: Temi riguardanti il mondo dell'inesplicabile e dello sconosciuto
definition: Etwas Unbekanntes oder Unerklärbares. @de
note: nessuno
in scheme: Subject Code
created: 2000-10-30T12:00:00+00:00
modified: 2010-12-15T17:01:09+00:00
broader: Storie, Curiosità
broad match: http://cv.iptc.org/newscodes/mediatopic/08000000

Società
type: Concept
preferred label: colunas sociais @pt-pt
preferred label: society @en-gb
preferred label: sociedad @es
preferred label: Society @de
preferred label: Mondanités @fr
preferred label: 社交 @ja-jp
definition: Geschichten über Prominente. @de
definition: Vicende accadute a persone note; Mondanità
definition: Stories of well-known people @en-gb
definition: 有名な人々の記事 @ja-jp
definition: Histoires sur des personnages connus @fr
definition: notas acerca de gente bastante conocida. @es
definition: Histórias sobre pessoas conhecidas. @pt-pt
note: nessuno
in scheme: Subject Code
created: 2000-10-30T12:00:00+00:00
modified: 2010-12-15T17:01:09+00:00
broader: Storie, Curiosità
narrower: Cerimonie
narrower: Morte
narrower: Funerali
narrower: Testamenti, Eredità
narrower: Commemorazioni

Premi
type: Concept
preferred label: prêmios e galardões @pt-br
preferred label: Auszeichnung/Preis @de
preferred label: award and prize @en-gb
preferred label: premios @es
preferred label: 叙勲・賞 @ja-jp
preferred label: prémios e galardões @pt-pt
preferred label: Prix et récompenses @fr
definition: Condecorações e prémios, incluindo os que são atribuídos pelo governo. @pt-pt
definition: Decorazioni, onorificenze, riconoscimenti e premi, compresi quelli conferiti dallo Stato
definition: Décorations, prix, y compris ceux distribués par l'Etat @fr
definition: Orden, Auszeichnungen und Preise inklusive der, die durch die Regierung vergeben werden. @de
definition: Condecoraciones y premios, incluidos aquellos otorgados por el gobierno. @es
definition: Decorations, awards and prizes, including those given by the government. @en-gb
definition: 勲章、賞と賞品、政府によって与えられたものを含む @ja-jp
note: nessuno
in scheme: Subject Code
created: 2000-10-30T12:00:00+00:00
modified: 2010-12-15T17:01:09+00:00
broader: Storie, Curiosità
narrower: Primati

Case reali
type: Concept
preferred label: imperial and royal matters @en-gb
preferred label: Royauté @fr
preferred label: realeza @pt-pt
preferred label: 皇室・王室 @ja-jp
preferred label: Adel @de
preferred label: asuntos imperiales, reales @es
definition: Notícias sobre membros de famílias reais e imperiais, incluindo assuntos de sistemas legais. @pt-br
definition: Temi riguardanti membri di famiglie reali o imperiali
definition: Noticias de los miembros de familias reales e imperiales, incluyendo asuntos de sistemas legales. @es
definition: Les informations sur les membres de familles royales et impériales @fr
definition: Imperial and royal family members, including matters on legal systems. @en-gb
definition: 法制度に関する事項を含む、皇室と王室メンバーについてのニュース @ja-jp
definition: Adelige oder Angehörige von Königsfamilien, inklusive Angelegenheiten amtierender Königshäuser. @de
note: nessuno
in scheme: Subject Code
created: 2000-10-30T12:00:00+00:00
modified: 2010-12-15T17:01:09+00:00
broader: Storie, Curiosità

Piante
type: Concept
preferred label: 植物 @ja-jp
preferred label: plantas @pt-pt
preferred label: plant @en-gb
preferred label: Pflanzenwelt @de
definition: An organism of the kind exemplified by trees, shrubs, grasses, ferns, and mosses, typically growing in a permanent site @en-gb
definition: Organismo do tipo exemplificado por árvores, arbustos, relvas, fetos e musgos, que tipicamente crescem em local permanente. @pt-br
definition: 高木、低木、草、シダ、こけなどに例示される生物であり、一定の場所で成長する @ja-jp
definition: Il verde: alberi, arbusti, prati, felci, muschi ecc. che crescono in un dato luogo
definition: Organismen wie Bäume, Gräser, Farne und Moose, die typischerweise in einem bestimmten Gebiet wachsen. @de
definition: Organismo do tipo exemplificado por árvores, arbustos, relvas, fetos e musgos, que tipicamente crescem num local permanente. @pt-pt
note: nessuno
in scheme: Subject Code
created: 2006-08-21T12:00:00+00:00
modified: 2012-07-10T12:00:00+00:00
broader: Storie, Curiosità

Consigli, Suggerimenti
type: Concept
preferred label: 人生相談 @ja-jp
preferred label: advice @en-gb
preferred label: Ratgeber @de
preferred label: Conseil, recettes @fr
preferred label: consejos @es
preferred label: conselhos @pt-br
definition: Cartas y respuestas de problemas personales que son publicables. @es
definition: Briefe und Antworten über persönliche Probleme, die veröffentlichbar sind. @de
definition: Cartas e respostas publicáveis sobre problemas pessoais. @pt-pt
definition: 公開可能である個人的な問題についての手紙や回答 @ja-jp
definition: Letters and answers about personal problems that are publishable @en-gb
definition: Courriers publiables sur des problèmes personnels et les réponses @fr
definition: Lettere e risposte su problemi personali che possono essere pubblicate; Rubriche di posta
note: nessuno
in scheme: Subject Code
created: 2000-10-30T12:00:00+00:00
modified: 2010-12-15T17:01:09+00:00
broader: Persone
broad match: http://cv.iptc.org/newscodes/mediatopic/08000000

Celebrità
type: Concept
preferred label: Célébrités @fr
preferred label: celebrity @en-gb
preferred label: 有名人 @ja-jp
preferred label: celebridades @es
preferred label: Prominente @de
definition: Vicende di celebrità e di gossip
definition: 有名人についてのニュース。つまり、マドンナが赤んぼうを身ごもった。エルトン･ジョンが、彼の会計係を告訴した等 @ja-jp
definition: Notícias sobre celebridades. @pt-br
definition: Celebrity news, i.e. Madonna has a baby, Elton John sues his accountants etc. @en-gb
definition: Notícias sobre pessoas famosas. @pt-pt
definition: Berühmtheiten-Nachrichten, wie z.B Madonnas Baby. @de
definition: Noticias sobre celebridades como Madonna tiene un hijo, Elton John demanda a sus contadores, etc. @es
definition: Les histoires sur les célébrités, vedettes @fr
note: nessuno
in scheme: Subject Code
created: 2000-10-30T12:00:00+00:00
modified: 2010-12-15T17:01:09+00:00
broader: Persone

Iniziative, Realizzazioni
type: Concept
preferred label: logros @es
preferred label: feitos @pt-pt
preferred label: Succès @fr
preferred label: Leistung (gesellschaftlich) @de
preferred label: 活躍 @ja-jp
preferred label: accomplishment @en-gb
definition: Achievements by individuals or groups, such as charitable fundraising, winning a competitive contest etc @en-gb
definition: 慈善募金活動、コンテストの優勝など、個人やグループによる業績 @ja-jp
definition: Sucessos individuais ou coletivos, tais como arrecadação de fundos de caridade, vencer uma competição, etc. @pt-br
definition: Logros de los individuos o grupos, tales como donaciones caritativas, ganar una competencia, un concurso, etc. @es
definition: Réalisation individuelle ou en groupe (comme la récolte de fonds humanitaire ou le succès dans une compétition) @fr
definition: Tätigkeiten von Einzelnen und Gruppen, wie karitatives Fundraising, Gewinn eines Wettbewerbs etc. @de
definition: Azioni considerevoli compiute da singoli o gruppi, come offerte di carità, donazioni, ma anche la vincita di un concorso
definition: Sucessos individuais ou coletivos, tais como angariação de fundos de caridade, vencer uma competição, etc. @pt-pt
note: nessuno
in scheme: Subject Code
created: 2004-10-13T12:00:00+00:00
modified: 2012-07-10T12:00:00+00:00
broader: Persone

Errori, Disavventure
type: Concept
preferred label: contratempo @pt-br
preferred label: Missgeschick @de
preferred label: human mishap @en-gb
preferred label: desgracia humana @es
preferred label: Mésaventures @fr
preferred label: 失敗 @ja-jp
definition: Histórias sobre gafes, erros bobos ou estúpidos, como esquecer de amarrar a extremidade de uma corda de bungee jumping. @pt-br
definition: Les histoires sur des gaffes, des erreurs bêtes ou stupides @fr
definition: Contrattempi ed errori con conseguenze di varia gravità
definition: 例えばバンジージャンプコードの片方を結び忘れるような愚かな人為的ミスから起きる話 @ja-jp
definition: Stories arising from silly/stupid human errors e.g. like forgetting to tie one end of a bungee cord @en-gb
definition: Histórias sobre gafes, erros tolos ou estúpidos, como esquecer-se de amarrar a extremidade de uma corda de bungee jumping. @pt-pt
definition: Historias sobre errores humanos tontos o estupidos e.j.como olvidarse de atar un extremo de una cuerda del amortiguador auxiliar @es
definition: Artikel über blöde menschliche Fehler e.g. wie das Vergessen ein Ende eines Bungeeseiles festzubinden. @de
note: nessuno
in scheme: Subject Code
created: 2004-10-13T12:00:00+00:00
modified: 2012-07-10T12:00:00+00:00
broader: Persone

Predizioni futuro
type: Concept
preferred label: leitura da sorte @pt-pt
preferred label: 占い @ja-jp
preferred label: fortune-telling @en-gb
preferred label: Wahrsagerei @de
definition: Vorhersage von zukünftigen Ereignissen oder die Beschreibung von Charakteren mit Methoden, die gewöhnlich nicht auf rationaler Grundlage stattfindet. @de
definition: The forecasting of future events or the delineation of character by methods not ordinarily considered to have a rational basis @en-gb
definition: 未来の出来事の予測や性格判断、通常、合理的な根拠をもたないと考えられる @ja-jp
definition: Prever eventos futuros ou traçar o caráter de alguém por métodos que geralmente não têm base racional. @pt-pt
definition: Pratiche di predizione di eventi futuri o di delineazione di un carattere, attraverso metodi solitamente considerati non avere una base razionale
note: nessuno
in scheme: Subject Code
created: 2006-08-21T12:00:00+00:00
modified: 2012-07-10T12:00:00+00:00
broader: Persone
broad match: http://cv.iptc.org/newscodes/mediatopic/08000000

Cerimonie
type: Concept
preferred label: cerimónia @pt-pt
preferred label: 式典 @ja-jp
preferred label: ceremonia @es
preferred label: cerimônia @pt-br
preferred label: Zeremonie @de
preferred label: Cérémonie @fr
preferred label: ceremony @en-gb
definition: Rituais de natureza não religiosa, como cerimónias de consagração, inaugurações, lançamento de barcos, etc. @pt-pt
definition: Riti laici o comunque di natura non religiosa: incoronazioni, vari di barche, dedicazioni ecc...
definition: Rituales no religiosos tales como dedicaciones, inauguraciones, lanzamientos de barcos, etc. @es
definition: Rituale nicht-religiöser Art wie Weihungen, Kranzniederlegungen, Schiffstaufen etc. @de
definition: Rituels non religieux comme des dédicaces, lancement d'un bateau @fr
definition: 献呈、献花や船の進水式のような非宗教的性質の儀式 @ja-jp
definition: Rituais de natureza não religiosa, como cerimônias de consagração, inaugurações, lançamento de barcos, etc. @pt-br
definition: Rituals of a non-religious nature such as dedications, wreath layings, ship launchings etc @en-gb
note: nessuno
in scheme: Subject Code
created: 2004-10-13T12:00:00+00:00
modified: 2012-07-10T12:00:00+00:00
broader: Società

Morte
type: Concept
preferred label: death @en-gb
preferred label: 死 @ja-jp
preferred label: morte @pt-pt
preferred label: Tod @de
definition: Aspetos de interesse humano da morte de uma pessoa. @pt-pt
definition: 人の死に関する人間的興味 @ja-jp
definition: Aspectos de interesse humano da morte de uma pessoa. @pt-br
definition: Gli aspetti riguardanti l'interesse sulla morte delle persone
definition: The human interest aspects of the demise of a person @en-gb
definition: Menschliches Interesse an dem Ableben einer Person. @de
note: nessuno
in scheme: Subject Code
created: 2006-08-21T12:00:00+00:00
modified: 2012-07-10T12:00:00+00:00
broader: Società
broad match: http://cv.iptc.org/newscodes/mediatopic/08000000

Funerali
type: Concept
preferred label: funeral @pt-br
preferred label: Beerdigung @de
preferred label: 葬儀 @ja-jp
definition: 遺体を埋葬するための儀式 @ja-jp
definition: Cerimonie di esequie e sepoltura
definition: Cerimónia de sepultamento dos restos mortais de uma pessoa. @pt-pt
definition: Zeremonie zur Bestattung eines Menschen. @de
definition: The ceremony to intern the remains of a person @en-gb
definition: Cerimônia de sepultamento dos restos mortais de uma pessoa. @pt-br
note: nessuno
in scheme: Subject Code
created: 2006-08-21T12:00:00+00:00
modified: 2012-07-10T12:00:00+00:00
broader: Società
broad match: http://cv.iptc.org/newscodes/mediatopic/08000000

Testamenti, Eredità
type: Concept
preferred label: Erbschaft @de
preferred label: doação de património @pt-pt
preferred label: estate bestowal @en-gb
preferred label: doação de patrimônio @pt-br
preferred label: 財産分与 @ja-jp
definition: Distribuição do património de uma pessoa de acordo com a sua vontade. @pt-pt
definition: Questioni testamentarie e riguardanti l'eredità di una persona: esecuzioni, disaccordi fra gli eredi ecc.
definition: The distribution of the estate of a person according to their will and any disagreements between the heirs @en-gb
definition: 故人の遺志あるいは相続者間の争いに基づく財産の分配 @ja-jp
definition: Distribuição do patrimônio de uma pessoa de acordo com sua vontade. @pt-br
definition: Die Verteilung des Besitzes einer Person nach ihrem Willen und die Streitigkeiten der Angehörigen. @de
note: nessuno
in scheme: Subject Code
created: 2006-08-21T12:00:00+00:00
modified: 2012-07-10T12:00:00+00:00
broader: Società
broad match: http://cv.iptc.org/newscodes/mediatopic/08000000

Commemorazioni
type: Concept
preferred label: Gedenkstätte @de
preferred label: memorial @en-gb
preferred label: 追悼 @ja-jp
definition: Commemorative ceremony or object - plaque, statue etc - in remembrance of a person. @en-gb
definition: Cerimônia comemorativa ou objeto - placa, estátua, etc. - em memória de uma pessoa. @pt-br
definition: Cerimónia comemorativa ou objeto - placa, estátua, etc. - em memória de uma pessoa. @pt-pt
definition: Zeremonien oder Stätten des Gedenkens - Gedenktafeln, Statuen etc., in Erinnerung an eine Person. @de
definition: 飾り板、銅像など人物を記念するための事物、式典 @ja-jp
definition: Commemorazioni
note: nessuno
in scheme: Subject Code
created: 2006-08-21T12:00:00+00:00
modified: 2012-07-10T12:00:00+00:00
broader: Società
broad match: http://cv.iptc.org/newscodes/mediatopic/08000000

Primati
type: Concept
preferred label: récord @es
preferred label: Record @fr
preferred label: recordes @pt-pt
preferred label: Rekord @de
preferred label: record @en-gb
preferred label: 記録 @ja-jp
definition: 個人又はグループが達成した息止め最長記録やほとんどの本を読むなどのスポーツ以外の新記録 @ja-jp
definition: Record o primati in eventi non sportivi stabiliti da singoli o da gruppi; Guinness Primati
definition: Nicht-sportliche Leistungen eines Einzelnen oder einer Gruppe, die einen neue Rekord aufstellen, wie meiste gelesene Bücher, längstes Luftanhalten. @de
definition: Non-sport achievement by an individual or group that sets a new record, such as most books read, holding your breath longest @en-gb
definition: Sucesso não esportivo, realizado por um indivíduo ou por um grupo, que estabelece um novo recorde, tal como o maior número de livros lidos, suster a respiração durante mais tempo, etc. @pt-br
definition: logro del no-deportivo por un individuo o un grupo que fija un nuevo expediente, tal como la mayoría de libros leídos, mantener la respisación por mayor tiempo. @es
definition: Exploit non sportif réalisé par un individu ou un groupe @fr
definition: Sucesso não desportivo, realizado por um indivíduo ou por um grupo, que estabelece um novo recorde, tal como o maior número de livros lidos, suster a respiração durante mais tempo, etc. @pt-pt
note: nessuno
in scheme: Subject Code
created: 2004-10-13T12:00:00+00:00
modified: 2012-07-10T12:00:00+00:00
broader: Premi

Lavoro
type: Concept
preferred label: mano de obra @es
preferred label: trabalho @pt-pt
preferred label: Arbeit, Soziales @de
preferred label: 労働 @ja-jp
preferred label: Social @fr
preferred label: labour @en-gb
definition: Ensemble des activités économiques des hommes, d'un pays, en vue de produire quelque chose d'utile pour la communauté, aspects sociaux, organisations, réglements, chômage @fr
definition: Aspectos sociales, organizaciones, reglas y condiciones que afectan el empleo y la generación de riqueza o provisión de servicios. Soporte económico a los desempleados. @es
definition: Aspetos sociais, organizações, regras e condições que afetam o emprego e a produção de riqueza ou o fornecimento de serviços. Apoio económico aos desempregados. @pt-pt
definition: Social aspects, organizations, rules and conditions affecting the employment of human effort for the generation of wealth or provision of services and the economic support of the unemployed. @en-gb
definition: Soziale Aspekte, Organisationen, Regeln und Bedingungen bezogen auf die bezahlte Arbeit von menschlicher Leistung, für eine Generation des Wohlstands oder Belohnung für Dienstleistungen und die wirtschaftliche Unterstützung bei Arbeitslosigkeit. @de
definition: Aspetti sociali, organizzazioni, regole e condizioni riguardanti impiego e forme di occupazione e le forme di sostegno per chi non è occupato
definition: 豊かな世代への雇用におけるの人間の努力、またはサービス規定、失業者への経済的サポートに影響する社会的局面、組織、ルールや状況 @ja-jp
definition: Aspectos sociais, organizações, regras e condições que afetam o emprego e a geração de riqueza ou o fornecimento de serviços. Apoio económico aos desempregados. @pt-br
note: nessuno
in scheme: Subject Code
created: 2000-10-30T12:00:00+00:00
modified: 2010-12-15T17:01:09+00:00
narrower: Apprendistato
narrower: Contratti collettivi
narrower: Impiego
narrower: Vertenze
narrower: Legislazione Lavoro
narrower: Pensione
narrower: Riqualificazione
narrower: Sciopero
narrower: Disoccupazione
narrower: Sindacati
narrower: Paghe, Pensioni
narrower: Rapporto Lavoro
narrower: Salute, Sicurezza sul lavoro
narrower: Tirocinio avanzato
narrower: Datore lavoro
narrower: Lavoratore

Apprendistato
type: Concept
preferred label: 職業訓練 @ja-jp
preferred label: estagiários e aprendizes @pt-pt
preferred label: apprentices @en-gb
preferred label: aprendices @es
preferred label: Apprentissage @fr
preferred label: Ausbildung/Lehrstelle @de
definition: Salariés qui apprennent un métier sous la direction d'un patron @fr
definition: Attività di formazione lavoro
definition: Personas que forman parte de uanfuerza de trabajo en el nivel inicial, sirviendo bajo un maestro. @es
definition: Menschen, die sich lernend im Arbeitsprozess befinden und von einem Ausbilder betreut werden. @de
definition: People who are in the work force at a learning level, serving under a master @en-gb
definition: Pessoas que fazem parte de uma força de trabalho num nível inicial, aprendendo a profissão sob a direção de alguém. @pt-pt
definition: 雇い主の下で働き、労働力の中において習得段階にある人々 @ja-jp
definition: Pessoas que fazem parte de uma força de trabalho em nível inicial, aprendendo a profissão sob a direção de alguém. @pt-br
note: nessuno
in scheme: Subject Code
created: 2000-10-30T12:00:00+00:00
modified: 2010-12-15T17:01:09+00:00
broader: Lavoro

Contratti collettivi
type: Concept
preferred label: Convention collective @fr
preferred label: 労働協約 @ja-jp
preferred label: collective contract @en-gb
preferred label: contratos coletivos @pt-br
preferred label: Tarifvertrag @de
preferred label: contratos colectivos @es
definition: Usually written contracts covering a specific class of worker @en-gb
definition: Contratos escritos que cobrem uma classe específica de trabalhadores. @pt-pt
definition: Contratti di lavoro di una specifica categoria di lavoratori
definition: Schriftliche Verträge, die sich auf eine bestimmte Gruppe von Beschäftigten beziehen. @de
definition: Convention régissant les relations sociales d'une catégorie de salariés @fr
definition: Contratosusualmente escritos y que cubren una clase especifica de trabajadores. @es
definition: 通常、労働者の特定クラスをカバーしている契約 @ja-jp
note: nessuno
in scheme: Subject Code
created: 2000-10-30T12:00:00+00:00
modified: 2010-12-15T17:01:09+00:00
broader: Lavoro
narrower: Contratti, Salario
narrower: Contratti, Assistenza sanitaria
narrower: Contratti, Norme lavoro

Impiego
type: Concept
preferred label: employment @en-gb
preferred label: empleo @es
preferred label: Beschäftigung @de
preferred label: emprego @pt-br
preferred label: Emploi @fr
preferred label: 雇用 @ja-jp
definition: Trabalho pago @pt-br
definition: 賃金の払われる労働 @ja-jp
definition: Lavoro dipendente remunerato
definition: Travail rémunéré @fr
definition: Paid labour @en-gb
definition: trabajo pagado. @es
definition: Bezahlte Arbeit. @de
note: nessuno
in scheme: Subject Code
created: 2000-10-30T12:00:00+00:00
modified: 2010-12-15T17:01:09+00:00
broader: Lavoro
narrower: Mercato Lavoro
narrower: Licenziamento
narrower: Lavoro minorile
narrower: Professioni

Vertenze
type: Concept
preferred label: conflitos laborais @pt-br
preferred label: Tarifkonflikt @de
preferred label: conflictos laborales @es
preferred label: 労働争議 @ja-jp
preferred label: Conditions de travail @fr
preferred label: labour dispute @en-gb
definition: Diferentes opiniones acerca de las condiciones de trabajo, pagos, etc. @es
definition: Diferenças de opinião sobre condições de trabalho, salário, etc. @pt-br
definition: Les débats sur les conditions du travail @fr
definition: Dispute sul lavoro, sulle condizioni di impiego, sulle paghe, ecc.
definition: Differences of opinion about work conditions, pay, etc @en-gb
definition: Meinungsverschiedenheiten der Tarifpartner über Arbeitsbedingungen, Bezahlung etc. @de
definition: 労働条件、賃金などに関する見解の相違 @ja-jp
note: nessuno
in scheme: Subject Code
created: 2000-10-30T12:00:00+00:00
modified: 2010-12-15T17:01:09+00:00
broader: Lavoro

Legislazione Lavoro
type: Concept
preferred label: Arbeitsrecht @de
preferred label: legislación laboral @es
preferred label: Législation du travail @fr
preferred label: legislação laboral @pt-br
preferred label: labour legislation @en-gb
preferred label: 労働法 @ja-jp
definition: Gesetze, die Beschäftigung und Arbeit regeln. @de
definition: La législation régissant le travail et les relations sociales dans l'entreprise @fr
definition: Leis que regulam trabalho e emprego. @pt-br
definition: Laws governing work and labour @en-gb
definition: Leggi che regolano lavoro e manodopera
definition: 仕事と労働を管理している法律 @ja-jp
definition: Leyes que riguen el trabajo y los empleos. @es
note: nessuno
in scheme: Subject Code
created: 2000-10-30T12:00:00+00:00
modified: 2010-12-15T17:01:09+00:00
broader: Lavoro

Pensione
type: Concept
preferred label: retirement @en-gb
preferred label: aposentadoria @pt-br
preferred label: 退職 @ja-jp
preferred label: jubilación @es
preferred label: reforma @pt-pt
preferred label: Ruhestand @de
preferred label: Retraite @fr
definition: Gli anni dopo il lavoro, periodo che comincia a partire dal collocamento a riposo
definition: La période commençant à partir de la cessation d'activité rémunérée @fr
definition: Die Jahre nach der Berufstätigkeit. @de
definition: The years after work @en-gb
definition: *Os anos após o trabalho; período que começa após cessação da atividade remunerada.* @pt-pt
definition: Los años despues del trabajo. @es
definition: 職を終えること @ja-jp
note: nessuno
in scheme: Subject Code
created: 2000-10-30T12:00:00+00:00
modified: 2010-12-15T17:01:09+00:00
broader: Lavoro

Riqualificazione
type: Concept
preferred label: reconversão (profissional) @pt-pt
preferred label: Reconversion @fr
preferred label: Umschulung @de
preferred label: 再訓練 @ja-jp
preferred label: recapacitación @es
preferred label: retraining @en-gb
definition: 古びた技量がもはや適用可能でない場合に、新しい技術の労働者トレーニングを提供すること @ja-jp
definition: Maßnahme, um neue Sachkenntnisse zu erwerben, wenn die bestehenden nicht mehr länger verwendbar sind. @de
definition: Acquisizione da parte del lavoratore di nuove competenze, anche per mezzo di attività di tirocinio
definition: Proveer a los empleados de nuevos conocimientos cuando sus oficios se convienten en obsoletos. @es
definition: Providing a worker training in new skills when his old skills are no longer applicable @en-gb
definition: Dotar um trabalhador de novos conhecimentos e competências quando os antigos já não são aplicáveis. @pt-pt
definition: L'acquisition de nouvelles compétences @fr
note: nessuno
in scheme: Subject Code
created: 2000-10-30T12:00:00+00:00
modified: 2010-12-15T17:01:09+00:00
broader: Lavoro

Sciopero
type: Concept
preferred label: strike @en-gb
preferred label: huelga @es
preferred label: Grèves @fr
preferred label: greve @pt-pt
preferred label: ストライキ @ja-jp
preferred label: Streik @de
definition: Ação por parte dos empregados que envolve paralização de atividade laboral. @pt-br
definition: A job action involving cessation of work @en-gb
definition: Arrêt de travail @fr
definition: Eine Arbeitsaktion, umfasst die Niederlegung der Arbeit. @de
definition: Astensione volontaria dal lavoro attuata per iniziativa dei lavoratori, che determina un'interruzione dell'attività, per ottenere miglioramenti
definition: 業務活動停止を伴う抗議行動 @ja-jp
definition: Ação por parte dos empregados que envolve paralisação de atividade laboral. @pt-pt
definition: Una acción de los empleados que envuelve la paralización de labores. @es
note: nessuno
in scheme: Subject Code
created: 2000-10-30T12:00:00+00:00
modified: 2010-12-15T17:01:09+00:00
broader: Lavoro

Disoccupazione
type: Concept
preferred label: desempleo @es
preferred label: Chômage @fr
preferred label: unemployment @en-gb
preferred label: Arbeitslosigkeit @de
preferred label: 失業 @ja-jp
preferred label: desemprego @pt-pt
definition: Falta de trabalho remunerado. @pt-pt
definition: Das Fehlen von bezahlter Arbeit. @de
definition: Lack of paid work @en-gb
definition: 賃金労働を失うこと @ja-jp
definition: falta de trabajo remunerado. @es
definition: Mancanza di lavoro pagato
definition: Le fait de ne pas avoir d'emploi salarié @fr
note: nessuno
in scheme: Subject Code
created: 2000-10-30T12:00:00+00:00
modified: 2010-12-15T17:01:09+00:00
broader: Lavoro

Sindacati
type: Concept
preferred label: unions @en-gb
preferred label: sindicatos @es
preferred label: 労働組合 @ja-jp
preferred label: Gewerkschaft @de
preferred label: Syndicats @fr
definition: Groups established to represent bodies of workers @en-gb
definition: 労働者の団体を代表するために設立された集まり @ja-jp
definition: Grupos estabelecidos para representar classes de trabalhadores na defesa dos seus interesses comuns. @pt-pt
definition: Etablierte Gruppen, um die Arbeiterschaft zu vertreten. @de
definition: Associazioni di lavoratori costituite per tutelare gli interessi economici e professionali della categoria
definition: Grupos estabelecidos para representar classes de trabalhadores na defesa de seus interesses comuns. @pt-br
definition: L'association de personnes ayant pour but la défense d'intérêts communs @fr
definition: Grupos establecidos para representar cuerpos de trabajo. @es
note: nessuno
in scheme: Subject Code
created: 2000-10-30T12:00:00+00:00
modified: 2010-12-15T17:01:09+00:00
broader: Lavoro

Paghe, Pensioni
type: Concept
preferred label: Lohn/Rente @de
preferred label: 賃金・年金 @ja-jp
preferred label: salários e pensões @pt-pt
preferred label: salarios y pensiones @es
preferred label: wage and pension @en-gb
preferred label: Salaire brut @fr
definition: Partes de um salário dividido para remuneração atual e remuneração futura. @pt-br
definition: Teile des Gehalts, aufgeteilt in aktuelles und zukünftiges Einkommen. @de
definition: Parts of a salary divided for current income and future income @en-gb
definition: Salaires réellement versés et cotisations vieillesse @fr
definition: Parte de un salario dividido por el actual y futuro ingreso. @es
definition: Remunerazioni periodiche spettanti ai lavoratori; Remunerazioni periodiche spettanti a chi è collocato a riposo
definition: 給料を現収入と将来の収入に分けた部分 @ja-jp
note: nessuno
in scheme: Subject Code
created: 2000-10-30T12:00:00+00:00
modified: 2010-12-15T17:01:09+00:00
broader: Lavoro
narrower: Indennità'
narrower: Previdenza sociale

Rapporto Lavoro
type: Concept
preferred label: work relations @en-gb
preferred label: relações laborais @pt-pt
preferred label: Arbeitsbeziehung @de
preferred label: 労使関係 @ja-jp
preferred label: Relations du travail @fr
preferred label: relaciones laborales @es
definition: EL dar y recibir entre la administración y los empleados. @es
definition: The give and take between management and labour @en-gb
definition: Das Geben und Nehmen zwischen Unternehmensführung und Beschäftigten. @de
definition: Relações entre administração e empregados. @pt-br
definition: Relazione tra datore lavoro e lavoratore
definition: Regulação do trabalho e do emprego, tanto ao nível das regras formais (contratos coletivos, acordos de empresa, leis ou regulamentações) como das regras informais (baseadas em costumes e tradicões). @pt-pt
definition: 経営側と労働者間のやりとり @ja-jp
definition: Les relations entre patrons et employés @fr
note: nessuno
in scheme: Subject Code
created: 2000-10-30T12:00:00+00:00
modified: 2010-12-15T17:01:09+00:00
broader: Lavoro

Salute, Sicurezza sul lavoro
type: Concept
preferred label: salud y seguridad laboral @es
preferred label: Arbeitssicherheit @de
preferred label: health and safety at work @en-gb
preferred label: 労働安全衛生 @ja-jp
preferred label: higiene e segurança no trabalho @pt-pt
preferred label: Règles de sécurité au travail @fr
definition: Regeln und Maßnahmen, die die Gesundheit der Arbeiter garantieren. @de
definition: Le règlement et les procédures internes assurant la sécurité des travailleurs au sein de l'entreprise @fr
definition: Regolamenti e procedure assunti sul posto di lavoro per garantire la salute dei lavoratori
definition: Regras e procedimentos para garantir a saúde dos trabalhadores. @pt-br
definition: 労働者の健康を保証する規則と手続き @ja-jp
definition: Rules and procedures for guaranteeing the health of workers @en-gb
definition: Reglas y procedimientos para garantizar la salud de los empleados. @es
note: nessuno
in scheme: Subject Code
created: 2000-10-30T12:00:00+00:00
modified: 2010-12-15T17:01:09+00:00
broader: Lavoro

Tirocinio avanzato
type: Concept
preferred label: capacitación especializada @es
preferred label: advanced training @en-gb
preferred label: 専門教育 @ja-jp
preferred label: Berufliche Weiterbildung / Fortbildung @de
preferred label: formação profissional @pt-pt
preferred label: Formation continue @fr
definition: Formation supplémentaire dans le but de renforcer les aptitudes @fr
definition: Formazione supplementare per il miglioramento delle competenze
definition: Formação adicional para melhorar as competências de um trabalhador. @pt-br
definition: さらに技能を高めるための訓練 @ja-jp
definition: Ergänzende Maßnahmen, um aktuelle Sachkenntnisse zu erwerben. @de
definition: Entrenamiento adicional para mejorar la qualidades de un empleado. @es
definition: Additional training to enhance current skills @en-gb
note: nessuno
in scheme: Subject Code
created: 2000-10-30T12:00:00+00:00
modified: 2010-12-15T17:01:09+00:00
broader: Lavoro

Datore lavoro
type: Concept
preferred label: employer @en-gb
preferred label: 雇用者 @ja-jp
preferred label: empregador @pt-br
preferred label: Arbeitgeber @de
preferred label: empleadores @es
preferred label: Employeurs @fr
definition: La persona que emplea a los @es
definition: La personne qui emploie des employés, paie les salaires et autres avantages sociaux @fr
definition: 労働者を雇い、給料やその他の手当てなどを支給する者 @ja-jp
definition: Derjenige, der Arbeiter beschäftigt und ihre Löhne und andere Vergütungen zahlt. @de
definition: Pessoa que emprega trabalhadores e paga salários e outros benefícios. @pt-br
definition: The person who employs workers and pays the salaries and other benefits to workers @en-gb
definition: Chi dà lavoro, paga i salari e le altre competenze dovute
note: nessuno
in scheme: Subject Code
created: 2000-10-30T12:00:00+00:00
modified: 2010-12-15T17:01:09+00:00
broader: Lavoro

Lavoratore
type: Concept
preferred label: 被雇用者 @ja-jp
preferred label: Personnel @fr
preferred label: employee @en-gb
preferred label: empleados @es
preferred label: empregado @pt-br
preferred label: Arbeitnehmer @de
definition: Chi svolge la sua attività occupazionale traendone in cambio una paga e altri vantaggi
definition: Pessoa que troca seu tempo, talento e capacidades por dinheiro e outros benefícios. @pt-br
definition: A person who trades his time and talent for money and other benefits @en-gb
definition: 自分の時間や能力を代価に、お金やその他の手当てなどを受給する者 @ja-jp
definition: Una persona que cambia su tiempo y talento por dinero y otros beneficios. @es
definition: Jemand der seine Zeit und Talente gegen Geld und andere Vergütungen anbietet. @de
definition: Pessoa contratada para prestar serviços a um empregador, mediante um salário. @pt-pt
definition: Une personne qui échange son temps et ses capacités pour de l'argent ou d'autres avantages @fr
note: nessuno
in scheme: Subject Code
created: 2000-10-30T12:00:00+00:00
modified: 2010-12-15T17:01:09+00:00
broader: Lavoro

Contratti, Salario
type: Concept
preferred label: questões contratuais de salário @pt-pt
preferred label: Accords salariaux @fr
preferred label: Gehaltstarifvertrag @de
preferred label: contract issue-wages @en-gb
preferred label: contratos/pagos @es
preferred label: 賃金契約 @ja-jp
definition: Elementos e discussões contratuais sobre remuneração. @pt-pt
definition: Elemento della negoziazione contrattuale riguardante la remunerazione e gli stipendi
definition: L'emploi salarié @fr
definition: 報酬について的を絞った契約と契約議論の要素 @ja-jp
definition: Teile der Tarifverträge und Tarifverhandlungen, die sich auf die Vergütung beziehen. @de
definition: Element of contracts and contract discussions centring on remuneration @en-gb
definition: Elementos acerca de contratos y discusiones de contratos centrados en una remunieración. @es
note: nessuno
in scheme: Subject Code
created: 2004-04-22T12:00:00+00:00
modified: 2012-07-10T12:00:00+00:00
broader: Contratti collettivi

Contratti, Assistenza sanitaria
type: Concept
preferred label: questões contratuais de saúde @pt-pt
preferred label: Assurance sociale privée @fr
preferred label: Krankengeld @de
preferred label: contract issue-healthcare @en-gb
preferred label: 企業健保 @ja-jp
preferred label: contratos/cuidado de salud @es
definition: Elementos acerca de contratos y discusiones de contratos centrados en cuidados de salud. @es
definition: 健康管理の問題について的を絞った契約と契約議論の要素 @ja-jp
definition: Elemento della negoziazione contrattuale riguardante l'assistenza sanitaria
definition: Elementos e discussões contratuais sobre questões cuidados de saúde. @pt-br
definition: Element of contracts and contract discussions centring on health care issues @en-gb
definition: Eléments ou négociation de contrats sur l'assurance sociale privée @fr
definition: Teile des Tarifvertrages und der Tarifverhandlungen, die sich auf die Versorgung im Krankheitsfall beziehen. (Achtung: ist in Deutschland Teil des Manteltarifvertrages und nicht separat geregelt). @de
note: nessuno
in scheme: Subject Code
created: 2004-04-22T12:00:00+00:00
modified: 2012-07-10T12:00:00+00:00
broader: Contratti collettivi

Contratti, Norme lavoro
type: Concept
preferred label: questões contratuais laborais @pt-br
preferred label: 就業規則 @ja-jp
preferred label: Manteltarifvertrag @de
preferred label: contract issue-work rules @en-gb
preferred label: contratos/normas de trabajo @es
preferred label: Règlement intérieur d'entreprises @fr
definition: Elementos acerca de contratos y discusiones de contratos sobre temas tales como almuerzo, descanso, horas laborales, vacaciones, horarios, antigüedad, etc. @es
definition: Elementos e discussões contratuais sobre regras afetas a questões como almoço e outras pausas, turnos, marcação de férias, antiguidade, licença por doença, etc. @pt-br
definition: Eléments ou négociation de contrats sur le règlement intérieur des entreprises @fr
definition: Element of contracts and contract discussions centring on rules affecting issues such as lunch and other breaks, work shifts, vacation scheduling, seniority, sick leave etc. @en-gb
definition: Elemento della negoziazione contrattuale riguardante le regole sul lavoro e temi quali i turni, le ferie, l'anzianità, ecc...
definition: Teile des Tarifvertrages und der Tarifverhandlungen, die sich auf die Versorgung, Pausenregelung, Urlaubsregelung, Arbeitszeit, Krankmeldung etc. beziehen. @de
definition: 昼食と他の休憩、交代勤務、休暇計画、年功、病欠などのような規則や、契約の問題に的を絞った契約論議 @ja-jp
note: nessuno
in scheme: Subject Code
created: 2004-04-22T12:00:00+00:00
modified: 2012-07-10T12:00:00+00:00
broader: Contratti collettivi

Mercato Lavoro
type: Concept
preferred label: labor market @en-gb
preferred label: mercado de trabalho @pt-pt
preferred label: Arbeitsmarkt @de
preferred label: mercado laboral @es
preferred label: 労働市場 @ja-jp
preferred label: Marché du travail @fr
definition: Les personnes travaillant ou cherchant du travail @fr
definition: Grupo de pessoas que trabalham ou que procuram trabalho. @pt-br
definition: 働いている、もしくは求職中の労働力 @ja-jp
definition: Temi riguardanti chi lavora o è in cerca di lavoro
definition: Arbeitende und arbeitssuchende Bevölkerung. @de
definition: Notícias sobre os que oferecem a força de trabalho e os que a procuram. @pt-pt
definition: A pool of people who are working or are seeking work @en-gb
definition: Grupo de personas que tienen o buscan trabajo. @es
note: nessuno
in scheme: Subject Code
created: 2003-04-05T12:00:00+00:00
modified: 2012-07-10T12:00:00+00:00
broader: Impiego

Licenziamento
type: Concept
preferred label: 一時解雇 @ja-jp
preferred label: Personalabbau @de
preferred label: despedimentos @pt-pt
preferred label: demissões @pt-br
preferred label: job layoffs @en-gb
preferred label: Plan social @fr
preferred label: despidos @es
definition: Die Reduzierung von Arbeit innerhalb einer Firma durch Entlassungen aufgrund sich ändernder wirtschaftlicher Bedingungen. @de
definition: La diminution du nombre de salariés d'une entreprise par licenciement en raison du changement de la situation économique @fr
definition: 経済的な要因の変化によって生じる企業力衰退による解雇 @ja-jp
definition: Redução da força de trabalho de uma empresa, através de despedimento por alterações de fatores económicos. @pt-pt
definition: The reduction of a company's work force through dismissal because of changing economic factors @en-gb
definition: Reducción de la fuerza laboral de una empresa por medio del despido debido al cambio de factores económicos. @es
definition: Riduzione della forza lavoro a causa del cambiamento di fattori economici
note: nessuno
in scheme: Subject Code
created: 2003-04-05T12:00:00+00:00
modified: 2012-07-10T12:00:00+00:00
broader: Impiego

Lavoro minorile
type: Concept
preferred label: Travail des enfants @fr
preferred label: trabajo infantil @es
preferred label: trabalho infantil @pt-br
preferred label: child labor @en-gb
preferred label: Kinderarbeit @de
preferred label: 少年労働 @ja-jp
definition: 通常、18歳以下の雇用 @ja-jp
definition: Beschäftigung von Kindern meistens unter 18 Jahre. @de
definition: Niños que trabajan, generalmente menores de 18 años. @es
definition: Trabalho de crianças, geralmente com menos de 18 anos. @pt-br
definition: Lavoro esercitato da minori di 18 anni di età
definition: Employment of children, usually under the age of 18 @en-gb
definition: Le travail des enfants, généralement les moins de 18 ans @fr
note: nessuno
in scheme: Subject Code
created: 2003-04-05T12:00:00+00:00
modified: 2012-07-10T12:00:00+00:00
broader: Impiego

Professioni
type: Concept
preferred label: occupations @en-gb
preferred label: ocupaciones @es
preferred label: Profession @fr
preferred label: ocupações @pt-pt
preferred label: Beruf @de
preferred label: 職業 @ja-jp
definition: Generalmente es lo que uno se dedica aunque las profesiones son a menudo tales cosas como abogados y doctóreselas ocupaciones son oficinistas o chóferes. @es
definition: De uma maneira geral, ofício, profissão ou negócio a que alguém se dedica. @pt-pt
definition: D'une manière générale le métier de quelqu'un, @fr
definition: Tätigkeit, Profession oder Geschäft im Allgemeinen, obwohl mit Profession meist Rechtsanwälte und Ärzte, mit Tätigkeit eher Angestellte oder Fernfahrer gemeint sind. @de
definition: ここで言う職業は*trade(商売)*、*profession*、*business*を示す。普通、*profession*は弁護士や医者といった専門識のことを言い、*occupations*は事務員あるいはトラック運転手などに使われている @ja-jp
definition: Generally one's trade, profession or business although professions are usually such things as lawyers and doctors, and occupations are such as clerks or truckers @en-gb
definition: Occupazioni , mestieri in generale
note: nessuno
in scheme: Subject Code
created: 2003-04-05T12:00:00+00:00
modified: 2012-07-10T12:00:00+00:00
broader: Impiego

Indennità'
type: Concept
preferred label: Allocations sociales @fr
preferred label: beneficios laborales @es
preferred label: benefícios laborais @pt-br
preferred label: Arbeitnehmerzulage @de
preferred label: employee benefits @en-gb
preferred label: 福利厚生 @ja-jp
definition: Benefícios atribuídos por uma empresa a um trabalhador, tais como pensões, seguro de saúde, ou compensação monetária paga pelo governo a desempregados (seguro-desemprego). @pt-br
definition: 年金や健康保険のような、企業から従業員への給付金。あるいは通常失業手当と呼ばれる政府によって失業者に支払われた金銭補償 @ja-jp
definition: Allocations versées par une société à un employé telles que pension et assurance santé, ou allocations chômage versées par l'état aux sans emploi @fr
definition: Sowohl Vergütungen, die ein Arbeitnehmer von einer Firma erhält, wie Pensionen, Krankenversicherung, als auch der finanzielle Ausgleich, den die Regierung zahlt bei Arbeitslosigkeit, Arbeitslosengeld genannt. @de
definition: Beneficios que se le entregan a un trabajador por una compañía, como pensiones, seguro de salud; o compensación monetaria que el gobierno le paga a los cesantes que generalmente solicitan beneficios de desempleo. @es
definition: Benefícios atribuídos por uma empresa a um trabalhador, tais como pensões, seguro de saúde, ou compensação monetária paga pelo governo a desempregados (subsídio de desemprego). @pt-pt
definition: Either benefits provided to an employee by a company, such as pensions, health insurance; or monetary compensation paid by a government to the jobless usually called unemployment benefits @en-gb
definition: Sussidi destinati a chi lavora ma anche i sussidi di disoccupazione previsti per chi ne è privo
note: nessuno
in scheme: Subject Code
created: 2003-04-05T12:00:00+00:00
modified: 2012-07-10T12:00:00+00:00
broader: Paghe, Pensioni

Previdenza sociale
type: Concept
preferred label: Cotisations Vieillesse @fr
preferred label: 社会保障 @ja-jp
preferred label: seguridad social @es
preferred label: Sozialversicherung @de
preferred label: social security @en-gb
preferred label: segurança social @pt-pt
preferred label: seguridade social @pt-br
definition: FICA. Money paid by individual and companies into a government account to be paid out when that individual reaches a certain age @en-gb
definition: *FICA (**Federal Insurance Contributions Act**, imposto norte-americano). Dinheiro que um indivíduo ou empresa deposita em conta do Estado para depois lhe ser devolvido quando essa pessoa atingir determinada idade.* @pt-br
definition: Zahlungen, die von Einzelnen und Firmen an die Regierung geleistet werden und in einem bestimmten Alter an den Einzelnen ausgezahlt wird. @de
definition: FICA(Federal Insurance Contributions Act) Dinero que un individuo o empresa paga a una cuenta del gobierno para después que lo reembuelsen cuando esta persona llegue a cierta edad. @es
definition: Fundo à guarda do estado que integra uma comissão percentual aplicada a todos rendimentos ou proveitos de trabalhadores dependentes, independentes ou pessoa coletiva, que é usado em situações de desemprego, reformas pensionárias, salário mínimo garantido, abonos familiares, cuidados de saúde e outras regalias sociais. @pt-pt
definition: Assicurazioni sociali finanziate con contribuzione obbligatoria che garantiscono il lavoratore dal rischio di non avere mezzi in caso di invalidità, vecchiaia, malattia, disoccupazione ecc.
definition: 連邦保険拠出金法。個人と会社によって政府口座に払い込み、個人がある年齢に達したら支払われるお金 @ja-jp
definition: Argent versé par une personne et par les entreprises dans un fond public pour être reversé quand l'individu atteint un certain âge @fr
note: nessuno
in scheme: Subject Code
created: 2003-04-05T12:00:00+00:00
modified: 2012-07-10T12:00:00+00:00
broader: Paghe, Pensioni

Tempo libero
type: Concept
preferred label: estilo de vida y tiempo libre @es
preferred label: Vie quotidienne et loisirs @fr
preferred label: lifestyle and leisure @en-gb
preferred label: estilo de vida e lazer @pt-pt
preferred label: 生活・余暇 @ja-jp
preferred label: Freizeit, Modernes Leben @de
definition: Competencias que generalmente entretienen. @es
definition: Aktivitäten zum Vergnügen, zur Entspannung und Erholung, außerhalb von bezahlter Arbeit, inklusive Essen und Reisen. @de
definition: Activités entreprises pour le plaisir personnel en dehors du travail, y compris le restaurant et les voyages @fr
definition: 賃金が支払われる仕事以外で、楽しみのための活動、休養、あるいはレクリエーションであり、食べることや旅行を含んでいる @ja-jp
definition: Piaceri personali e svaghi, gastronomia e viaggi
definition: Activities undertaken for pleasure, relaxation or recreation outside paid employment, including eating and travel. @en-gb
definition: Atividades realizadas por prazer, para relaxamento ou divertimento, fora do emprego, incluindo comer e viajar. @pt-pt
note: nessuno
in scheme: Subject Code
created: 2000-10-30T12:00:00+00:00
modified: 2010-12-15T17:01:09+00:00
narrower: Giochi
narrower: Giochi d'azzardo, Lotterie
narrower: Gastronomia
narrower: Hobby
narrower: Vacanze
narrower: Turismo
narrower: Spostamenti, Trasporti quotidiani
narrower: Club, associazioni
narrower: Vita quotidiana
narrower: Svaghi (generico)
narrower: Festività
narrower: Caccia
narrower: Pesca
narrower: Automobili
narrower: Avventura
narrower: Bellezza
narrower: Questioni Spesa
narrower: Matrimonio

Giochi
type: Concept
preferred label: ゲーム @ja-jp
preferred label: Jeux @fr
preferred label: juegos @es
preferred label: jogos @pt-pt
preferred label: game @en-gb
preferred label: Spiel @de
definition: 一般に娯楽のための競技 @ja-jp
definition: Contests generally for ones amusement @en-gb
definition: Competencias que generalmente entretienen. @es
definition: Allgemeiner Wettstreit zur Unterhaltung. @de
definition: Attività ludica fisica o intellettuale di puro svago
definition: Atividade intelectual ou física para divertimento próprio. @pt-br
definition: Activité intellectuelle ou physique aux fins d'amusement @fr
note: nessuno
in scheme: Subject Code
created: 2000-10-30T12:00:00+00:00
modified: 2010-12-15T17:01:09+00:00
broader: Tempo libero
narrower: Jeu de Go
narrower: Scacchi
narrower: bridge
narrower: shogi

Giochi d'azzardo, Lotterie
type: Concept
preferred label: くじ・賭博 @ja-jp
preferred label: juegos de azar y loterías @es
preferred label: Jeux de hasard et loteries @fr
preferred label: jogos sociais e lotarias @pt-pt
preferred label: gaming and lottery @en-gb
preferred label: Glücksspiel und Lotterie @de
preferred label: jogos sociais e loterias @pt-br
definition: Gambling, often involving selection of sets of numbers one expects to come up @en-gb
definition: Jeu de hasard impliquant le plus souvent des séries de chiffres que l'on s'attend à voir *sortir* @fr
definition: Giochi d'azzardo di varia natura; Estrazioni di numeri o di serie di numeri cui sono associati determinati premi in denaro
definition: Jogo de azar, que envolve seleção de um conjunto de números que se espera acertar. @pt-pt
definition: ギャンブル。しばしば、一連の数字から当たると期待するものを選ぶことを必要とする @ja-jp
definition: Juego que normalmente envuelve la selección de un conjunto de números que uno espera acertar. @es
definition: Spielen um Geld, meist im Zusammenhang mit Zahlen und dem Setzen auf erhoffte Kombinationen. @de
note: nessuno
in scheme: Subject Code
created: 2000-10-30T12:00:00+00:00
modified: 2010-12-15T17:01:09+00:00
broader: Tempo libero

Gastronomia
type: Concept
preferred label: gastronomia @pt-pt
preferred label: gastronomy @en-gb
preferred label: グルメ @ja-jp
preferred label: Gastronomie @fr
preferred label: gastronomía, restoranes y cocina @es
preferred label: Essen und Trinken @de
definition: 美食の技術 @ja-jp
definition: Die Kunst des guten Essens. @de
definition: Arte del mangiare e del bere bene
definition: L'art du bien manger @fr
definition: Conhecimento de tudo o que abrange a culinária, o arranjo das refeições e a arte de saborear e apreciar as iguarias. @pt-pt
definition: The art of good eating @en-gb
definition: Arte de comer bem. @pt-br
definition: EL arte de comer bien. @es
note: nessuno
in scheme: Subject Code
created: 2000-10-30T12:00:00+00:00
modified: 2010-12-15T17:01:09+00:00
broader: Tempo libero
narrower: Alimenti biologici

Hobby
type: Concept
preferred label: hobby @pt-pt
preferred label: pasatiempos @es
preferred label: Violons d'Ingres @fr
preferred label: 趣味 @ja-jp
definition: Vários tipos de atividades realizadas para entretenimento pessoal, como colecionar selos, modelismo, costura, artesanato, etc. @pt-pt
definition: Verschiedene Arten der Freizeitbeschäftigung, wie z.B. Sammeln von Briefmarken, Modellbau, Handarbeit, Kunstgewerbe. @de
definition: Attività varie realizzate per puro divertimento; Passatempi
definition: Varios tipos de actividades para la entretención tales como coleccionar estampillas, construir modelos, costura o manualidades. @es
definition: Passe temps divers : collections, modélisme, broderie,… @fr
definition: 楽しみのための様々な行動。たとえば、切手収集や模型作り、キルト作り、クラフトのようなもの @ja-jp
definition: Various types of activities for amusement, such as collecting stamps, building models, quilting, crafts @en-gb
note: nessuno
in scheme: Subject Code
created: 2000-10-30T12:00:00+00:00
modified: 2010-12-15T17:01:09+00:00
broader: Tempo libero
narrower: Bricolage
narrower: Shopping
narrower: Giardinaggio

Vacanze
type: Concept
preferred label: holiday or vacation @en-gb
preferred label: 休暇 @ja-jp
preferred label: Vacances @fr
preferred label: férias @pt-br
preferred label: vacaciones @es
preferred label: Urlaub @de
definition: Artículos sobre viajes recreativos a un solo lugar y/o país durante un período corto. @es
definition: Histórias sobre viagens de lazer a um só lugar ou país durante um curto período de tempo. @pt-pt
definition: Viaggi o permanenza in determinati luoghi per riposo o per svago; Villeggiature
definition: Courte période de repos pendant laquelle une personne se rend en voyage dans un lieu et/ou un pays @fr
definition: 一つの場所そして/あるいは国をまたぐ短い期間のレジャー旅行 @ja-jp
definition: Leisure travel to a single location and/or country over a short period of time @en-gb
definition: Freizeitreise zu einem bestimmten Ort und/oder Land. @de
note: nessuno
in scheme: Subject Code
created: 2000-10-30T12:00:00+00:00
modified: 2010-12-15T17:01:09+00:00
broader: Tempo libero

Turismo
type: Concept
preferred label: tourism @en-gb
preferred label: Reise @de
preferred label: Tourisme @fr
preferred label: turismo lazer @pt-pt
preferred label: turismo @es
preferred label: 観光旅行 @ja-jp
definition: Leisure travel involving visits to a number of locations and/or countries over an extended period of time, often as part of an organized group @en-gb
definition: Freizeitreise zu mehreren Orten und/oder Ländern über einen längeren Zeitraum, oft im Rahmen einer größeren Gruppe. @de
definition: Voyage de loisir dans des différents lieux et/ou pays, souvent dans le cadre d'un groupe organisé @fr
definition: Viaggi compiuti durante il tempo libero, con visite, spesso facendo parte di gruppi organizzati; Iniziative relative al turismo
definition: Histórias sobre viagens de lazer envolvendo visitas a vários lugares ou países durante um período de tempo alargado, muitas vezes como parte de um grupo. @pt-br
definition: しばしば団体グループの一部として、長い期間にわたって多くの場所そして/あるいは国々への訪問を伴うレジャー旅行 @ja-jp
definition: Artículos sobre viajes recreativos que involucren visitas a una serie de lugares y/o países durante un período prolongado, a menudo como parte de un grupo organizado. @es
note: nessuno
in scheme: Subject Code
created: 2000-10-30T12:00:00+00:00
modified: 2010-12-15T17:01:09+00:00
broader: Tempo libero

Spostamenti, Trasporti quotidiani
type: Concept
preferred label: Voyage et transport quotidien @fr
preferred label: 通勤・出張 @ja-jp
preferred label: travel and commuting @en-gb
preferred label: viagens @pt-br
preferred label: viajes y desplazamiento diario @es
preferred label: Reiseverkehr @de
definition: Histórias sobre opções de transporte, redes de viagens, deslocação diária entre o domicílio e o local de trabalho, partilha de automóvel e viagens de negócios. @pt-pt
definition: Artículos acerca de opciones de transporte, redes de viajes, desplazamiento laboral diario, acuerdos de turnos para el traslado y viajes de negocios. @es
definition: Transportbedingungen, Reiseverbindungen, Pendelverkehr, Fahrdienste und Geschäftsreisen. @de
definition: Histórias sobre opções de transporte, redes de viagens, deslocação diária entre o domicílio e o local de trabalho, carona solidária e viagens de negócios. @pt-br
definition: Transport options, travel networks, commuting, car pooling and business travel @en-gb
definition: 輸送経路、旅行ネットワーク、通勤、相乗りとビジネス旅行 @ja-jp
definition: Temi riguardanti le varie opzioni di trasporto, collegamenti, pendolari, car pooling e viaggi d'affari
definition: Stories about transport options, travel networks, commuting, car pooling and business travel @fr
note: nessuno
in scheme: Subject Code
created: 2000-10-30T12:00:00+00:00
modified: 2010-12-15T17:01:09+00:00
broader: Tempo libero
narrower: Traffico

Club, associazioni
type: Concept
preferred label: clubes y asociaciones @es
preferred label: clubes e associações @pt-pt
preferred label: クラブ・協会 @ja-jp
preferred label: Associations et clubs @fr
preferred label: Verein @de
preferred label: club and association @en-gb
definition: Organización integrada por individuos que comparten los mismos intereses. @es
definition: Organizações a que as pessoas aderem por partilharem interesses similares. @pt-pt
definition: Organizations joined by individuals because of similar interests @en-gb
definition: Circoli o organizzazioni cui aderiscono individui con interessi comuni
definition: Cercle de personnes avec un intérêt commun se réunissant régulièrement dans un lieu déterminé @fr
definition: 同じような興味を持った人が参加する団体 @ja-jp
definition: Einrichtungen, die von Einzelnen besucht werden, aufgrund gemeinsamer Interessen. @de
note: nessuno
in scheme: Subject Code
created: 2000-10-30T12:00:00+00:00
modified: 2010-12-15T17:01:09+00:00
broader: Tempo libero

Vita quotidiana
type: Concept
preferred label: decoração @pt-br
preferred label: lifestyle (house and home) @en-gb
preferred label: 住まい・暮らし @ja-jp
preferred label: estilo de vida (casa y hogar) @es
preferred label: Vie quotidienne @fr
preferred label: Wohnen @de
definition: La cultura de nuestros hogares. @es
definition: Einheitliche Kultur und Einrichtung des eigenen Heims. @de
definition: Vita in casa e in famiglia
definition: 家庭のなかの独自文化 @ja-jp
definition: Unique culture of ones own home @en-gb
definition: Estilo de vida em casa de cada um. @pt-br
definition: Le mode de vie à la maison @fr
note: nessuno
in scheme: Subject Code
created: 2000-10-30T12:00:00+00:00
modified: 2010-12-15T17:01:09+00:00
broader: Tempo libero

Svaghi (generico)
type: Concept
preferred label: lazer (geral) @pt-pt
preferred label: leisure (general) @en-gb
preferred label: tiempo libre (general) @es
preferred label: レジャー（一般） @ja-jp
preferred label: Freizeit @de
preferred label: Loisirs @fr
definition: Atividades praticadas por alguém no seu tempo livre. @pt-pt
definition: Actividades realizadas por uno en su tiempo libre. @es
definition: Activities carried out in ones' spare time @en-gb
definition: Atividades praticadas por alguém em seu tempo livre. @pt-br
definition: Aktivitäten, die jemand in seiner freien Zeit ausübt. @de
definition: 余暇で行う行動 @ja-jp
definition: Les activités pratiquées pendant son temps libre @fr
definition: Attività varie realizzate durante il proprio tempo libero
note: nessuno
in scheme: Subject Code
created: 2000-10-30T12:00:00+00:00
modified: 2010-12-15T17:01:09+00:00
broader: Tempo libero

Festività
type: Concept
preferred label: Jour férié @fr
preferred label: festivos @es
preferred label: Feiertag @de
preferred label: feriados @pt-pt
preferred label: 休日 @ja-jp
preferred label: public holiday @en-gb
definition: A day or days set off for celebration @en-gb
definition: Giorni dedicati a celebrazioni, cerimonie pubbliche
definition: Día o días destinados a celebraciones. @es
definition: Dia ou dias destinados a celebrações. @pt-pt
definition: Jour(s) de congé férié @fr
definition: 祝うための日あるいは日々 @ja-jp
definition: Ein oder mehrere Tage, die für Feierlichkeiten festgesetzt sind. @de
note: nessuno
in scheme: Subject Code
created: 2000-10-30T12:00:00+00:00
modified: 2010-12-15T17:01:09+00:00
broader: Tempo libero

Caccia
type: Concept
preferred label: caça @pt-br
preferred label: Jagd @de
preferred label: Chasse @fr
preferred label: caza @es
preferred label: 狩猟 @ja-jp
preferred label: hunting @en-gb
definition: Atividade que envolve o uso de armas ou de armadilhas na captura de animais. @pt-br
definition: Eine Aktivität, bei der Waffen oder Fallen benutzt werden, um Tiere zu fangen. @de
definition: Attività che prevede l'uso di armi o trappole per catturare animali
definition: 武器や罠を使って動物を捕まえる活動 @ja-jp
definition: Una actividad que implica el uso de armas de fuego o tgrampas para la captura de animales. @es
definition: Action de poursuivre des animaux dans le but de les tuer ou de les capturer @fr
definition: An activity involving the use of weapons or traps for the capturing of animals @en-gb
note: nessuno
in scheme: Subject Code
created: 2000-10-30T12:00:00+00:00
modified: 2010-12-15T17:01:09+00:00
broader: Tempo libero

Pesca
type: Concept
preferred label: Angeln @de
preferred label: 釣り @ja-jp
preferred label: Pêche @fr
preferred label: pesca @pt-br
preferred label: fishing @en-gb
definition: Attività che richiede l'uso di esche, ami, armi e trappole per la cattura di specie acquatiche
definition: Action de poursuivre des espèces aquatiques dans le but de les tuer ou de les capturer @fr
definition: Una actividad que implica el uso de carnadas, anzuelos o harpones para la captura de especies acuaticas. @es
definition: Atividade que envolve o uso de isca, chamariz, armas ou armadilhas na captura de espécies aquáticas. @pt-br
definition: Atividade que envolve o uso de isco, chamariz, armas ou armadilhas na captura de espécies aquáticas. @pt-pt
definition: Eine Aktivität, die Köder, Waffen und Netze benutzt um Wassertiere zu fangen. @de
definition: 餌、ルアー、武器、罠を使って水生種を捕まえる活動 @ja-jp
definition: An activity involving the use of baits, lures, weapons and traps for the capture of aquatic species @en-gb
note: nessuno
in scheme: Subject Code
created: 2000-10-30T12:00:00+00:00
modified: 2010-12-15T17:01:09+00:00
broader: Tempo libero

Automobili
type: Concept
preferred label: Oldtimer @de
preferred label: 自動車情報 @ja-jp
preferred label: evolución del automóvil @es
preferred label: Evolution de l'automobile @fr
preferred label: auto trends @en-gb
preferred label: tendências do mercado de automóveis @pt-br
definition: 自動車の進化 @ja-jp
definition: Evoluzione delle automobili, auto di moda, saloni automobilistici
definition: The evolution of the automobile @en-gb
definition: Entwicklungsgeschichte des Autos. @de
definition: Evolução do automóvel. @pt-br
definition: Evolución del automóvil. @es
definition: Les tendances d'évolution de l'automobile @fr
note: nessuno
in scheme: Subject Code
created: 2003-04-05T12:00:00+00:00
modified: 2012-07-10T12:00:00+00:00
broader: Tempo libero

Avventura
type: Concept
preferred label: 冒険 @ja-jp
preferred label: adventure @en-gb
preferred label: Abenteuer @de
preferred label: aventura @pt-br
definition: Expedições, feitos ousados, exploração, quebra de recordes, eventos arriscados. @pt-pt
definition: Spedizioni, prove di abilità, esplorazioni, superamento di record, situazioni rischiose
definition: Expeditions, daring feats, exploration, record-breaking, risk-associated events @en-gb
definition: 探検、冒険、記録への挑戦、危険をともなう催し @ja-jp
definition: Expeditionen, Entdeckungsreisen, gefährliche Kunstsstücke, Rekorde, risikoreiche Ereignisse @de
note: nessuno
in scheme: Subject Code
created: 2006-08-21T12:00:00+00:00
modified: 2012-07-10T12:00:00+00:00
broader: Tempo libero
broad match: http://cv.iptc.org/newscodes/mediatopic/10000000

Bellezza
type: Concept
preferred label: beauty @en-gb
preferred label: Schönheit @de
preferred label: 美容 @ja-jp
preferred label: beleza @pt-pt
definition: Issues relating to improving one's appearance and attractiveness, including reviews of beauty products @en-gb
definition: Assuntos relacionados ao melhoramento da aparência e capacidade de atração, incluindo críticas de produtos de beleza. @pt-br
definition: Assuntos relacionados como a melhoria da aparência e capacidade de atração, incluindo críticas de produtos de beleza. @pt-pt
definition: Artikel in Bezug auf Attraktivität und äußerliches Erscheinen, beinhaltet auch die Besprechung von Schönheitsprodukten @de
definition: 人々の容姿や魅力の向上に関する活動で、美容品の紹介を含む @ja-jp
definition: Cosmesi, prodotti e riviste riguardanti la cura del corpo e i prodotti cosmetici
note: nessuno
in scheme: Subject Code
created: 2006-08-21T12:00:00+00:00
modified: 2012-07-10T12:00:00+00:00
broader: Tempo libero

Questioni Spesa
type: Concept
preferred label: 消費者問題 @ja-jp
preferred label: consumer issue @en-gb
preferred label: Konsum @de
preferred label: questão de consumo @pt-pt
definition: Compras, produtos para o lar, pesquisas relevantes, recolha de produtos. @pt-br
definition: 家庭消費のための商品購入、関連する調査、商品のリコール @ja-jp
definition: Acquisti, prodotti per la casa, indagini, richiami di prodotti
definition: Einkaufen, relevante Umfragen, Reklamationen, Produkte in Bezug auf Haushalt und Wohnen. @de
definition: Shopping, products for the home, relevant surveys, product recalls @en-gb
note: nessuno
in scheme: Subject Code
created: 2006-08-21T12:00:00+00:00
modified: 2012-07-10T12:00:00+00:00
broader: Tempo libero

Matrimonio
type: Concept
preferred label: casamento @pt-br
preferred label: Hochzeit @de
preferred label: 結婚式 @ja-jp
preferred label: wedding @en-gb
definition: Die Heiratszeremonie und die Ereignisse, die damit zusammenhängen wie Hochzeitsnacht, Parties, Vorbereitungen, Geschenke @de
definition: Cerimónia de casamento e eventos relacionados - despedida de solteiro/a, ensaio, festas, lua de mel, etc. @pt-pt
definition: Cerimônia de casamento e eventos relacionados - despedida de solteiro, chá de panela, ensaio, festas, lua de mel, etc. @pt-br
definition: Cerimonia di Nozze ed eventi correlati: ricevimento, addio al celibato/nubilato, luna di miele, ecc.
definition: 結婚とそれに伴う出来事、結婚祝い、式のリハーサル、パーティ、新婚旅行など @ja-jp
definition: The marriage ceremony and the events that surround it - showers, rehearsal, parties, honeymoon, etc. @en-gb
note: nessuno
in scheme: Subject Code
created: 2006-08-21T12:00:00+00:00
modified: 2012-07-10T12:00:00+00:00
broader: Tempo libero

Jeu de Go
type: Concept
preferred label: Go
preferred label: go @pt-br
preferred label: 碁 @ja-jp
preferred label: go. ajedrez japonés @es
definition: Jogo de estratégia, de origem chinesa, em que cada jogador coloca alternadamente pedras em uma grelha de um tabuleiro. @pt-br
definition: Ein strategisches chinesisches Brettspiel. @de
definition: A strategic, deterministic Chinese board game played by alternately placing stones on a grid @en-gb
definition: Ajedrez japonés. @es
definition: Gioco cinese di strategia in cui alternativamente i giocatori depongono o no una pedina su di un tavoliere sul quale è tracciata un griglia
definition: Jeu de stratégie d'origine chinoise @fr
definition: 中国の戦略的ボードゲーム。ます目上に相互に石を置いて競う @ja-jp
definition: Jogo de estratégia, de origem chinesa, em que cada jogador coloca alternadamente pedras numa grelha de um tabuleiro. @pt-pt
note: nessuno
note: Explanation changed in V17 @en-gb
in scheme: Subject Code
created: 2006-08-21T12:00:00+00:00
modified: 2012-07-10T12:00:00+00:00
broader: Giochi
broad match: http://cv.iptc.org/newscodes/mediatopic/20000547

Scacchi
type: Concept
preferred label: Schach @de
preferred label: xadrez @pt-pt
preferred label: chess @en-gb
preferred label: チェス @ja-jp
preferred label: échecs @fr
preferred label: ajedrez @es
definition: Jogo de estratégia para o qual se utiliza um tabuleiro dividido em casas alternadamente claras e escuras, com 16 peças para cada jogador, que se jogam com movimentos específicos que dependem de sua identidade. @pt-br
definition: Jogo de estratégia para o qual se utiliza um tabuleiro dividido em casas alternadamente claras e escuras, com 16 peças para cada jogador, que se jogam com movimentos específicos que dependem da sua identidade. @pt-pt
definition: Ein Spiel, was auf einem quadratischen Brett mit 16 Figuren auf jeder Seite und mit bestimmten Zügen, gespielt wird, die abhängig sind von der Identität der jeweiligen Figur. @de
definition: A game played on a chequered board with 16 pieces to each side with specific ranges of movement depending on their identity @en-gb
definition: Gioco di strategia fatto su una scacchiera con 16 pezzi per giocatore che compiono specifiche mosse in base alla loro caratteristica
definition: Jeu de stratégie sur un tableau carré divisé en 64 cases, alternativement claires et foncées, et qui oppose deux adversaires munis chacun de 16 pièces blanches pour l'un et noires pour l'autre @fr
definition: 両サイドに置いてある各々動かせる範囲が決まっている16個の駒を使って、格子縞の盤上で遊ぶゲーム @ja-jp
definition: Un juego para el cual se utiliza un tablero con 16 piezas por lado, con especificos movimientos que dependen de su identidad. @es
note: typo fixed in Explanation @en-gb
note: nessuno
in scheme: Subject Code
created: 2000-10-30T12:00:00+00:00
modified: 2010-12-15T17:01:09+00:00
broader: Giochi
broad match: http://cv.iptc.org/newscodes/mediatopic/20000541

bridge
type: Concept
preferred label: Bridge
preferred label: ブリッジ @ja-jp
definition: A card game of four players who bet on the hands of each other, developed from Russian whist @en-gb
definition: Jeu de cartes (52) dérivé du whist et qui oppose deux équipes de deux partenaires dont l'une doit réaliser le contrat ou nombre de plis annoncé aux cours d'enchères initiales @fr
definition: Jogo de cartas (52), derivado do whist russo, que opõe 2 equipas de 2 jogadores, em que uma delas deve realizar um contrato ou número de vazas anunciadas no leilão inicial. @pt-pt
definition: お互いのもち札(お金)をかけて、4人のプレーヤーで行うカードゲーム。ロシア式ホイストが発展したもの @ja-jp
definition: Kartenspiel mit vier Spielern, die gegenseitig auf das Blatt des anderen Wetten abschließen, entwickelt aus einem russischen Kartenspiel. @de
definition: Un juego de cartas entre cuatro jugadores quienes apuestas a las manos de cada uno. @es
definition: Jogo de cartas (52), derivado do whist russo, que opõe 2 equipes de 2 jogadores, em que uma delas deve realizar um contrato ou número de vazas anunciadas no leilão inicial. @pt-br
definition: Gioco di carte in quattro a coppie contrapposte, in cui le carte rappresentano lo strumento necessario per sviluppare le manovre. Trova le sue radici nel whist, praticato in Inghilterra fin dal XVI secolo
note: nessuno
in scheme: Subject Code
created: 2000-10-30T12:00:00+00:00
modified: 2010-12-15T17:01:09+00:00
broader: Giochi
broad match: http://cv.iptc.org/newscodes/mediatopic/20000542

shogi
type: Concept
preferred label: Shogi
preferred label: 将棋 @ja-jp
definition: Gioco strategico su una scacchiera originario del Giappone; Scacchi Giapponesi
definition: A strategic board games which is native to Japan and is often called Japanese chess @en-gb
definition: Jogo de estratégia de tabuleiro, nativo do Japão, também chamado xadrez japonês. @pt-br
definition: Ein strategisches Brettspiel aus Japan, oft auch Japanisches Schach genannt. @de
definition: 日本固有の戦略的ボードゲームであり、しばしば、ジャパニーズチェスと呼ばれる @ja-jp
note: nessuno
in scheme: Subject Code
created: 2006-08-21T12:00:00+00:00
modified: 2012-07-10T12:00:00+00:00
broader: Giochi
broad match: http://cv.iptc.org/newscodes/mediatopic/20000541

Alimenti biologici
type: Concept
preferred label: organic foods @en-gb
preferred label: 自然食品 @ja-jp
preferred label: alimentos biológicos @pt-pt
preferred label: alimentos orgánicos @es
preferred label: Biologische Nahrungsmittel @de
preferred label: Aliments biologiques @fr
definition: Food which is grown using no artificial fertilizers or chemical compounds @en-gb
definition: Alimentos produzidos sem uso de fertilizantes artificiais ou compostos químicos. @pt-br
definition: Comida que se produce no usando fertilizantes artificiales o compuestos químicos. @es
definition: Nahrungsmittel, die erzeugt wurden, ohne künstlichen Dünger oder chemische Zusätze. @de
definition: Alimenti composti esclusivamente di elementi naturali e senza aver fatto uso di fertilizzanti artificiali o composti chimici
definition: La nourriture biologique élevée sans l'utilisation de fertilisants ou autres composés chimiques @fr
definition: 人工の肥料あるいは化合物を使わずに育てられる食物 @ja-jp
note: nessuno
in scheme: Subject Code
created: 2003-04-05T12:00:00+00:00
modified: 2012-07-10T12:00:00+00:00
broader: Gastronomia

Bricolage
type: Concept
preferred label: faça você mesmo @pt-br
preferred label: DIY @en-gb
preferred label: Heimwerken @de
preferred label: ＤＩＹ @ja-jp
definition: Do it yourself. Reparatur, Bau oder Instandhaltung im häuslichen Bereich durch einen Nichtfachmann. @de
definition: DIY - do it yourself, faça você mesmo. Construção, reparação ou manutenção de algo feita por um amador, não por um profissional. @pt-br
definition: DIY - do it yourself. Normally the construction, repair or maintenance of residential property by an amateur @en-gb
definition: ドゥ・イット・ユアセルフ。愛好家による住居の建設、修理、維持など。 @ja-jp
definition: Attività manuale e piccoli lavori di costruzione, riparazione o altro eseguiti in casa per passatempo e per proprio diletto; Fai da te
note: nessuno
in scheme: Subject Code
created: 2006-08-21T12:00:00+00:00
modified: 2012-07-10T12:00:00+00:00
broader: Hobby
broad match: http://cv.iptc.org/newscodes/mediatopic/20000570

Shopping
type: Concept
preferred label: ショッピング @ja-jp
preferred label: fazer compras @pt-pt
preferred label: shopping @en-gb
definition: Andare in giro per negozi per guardare e fare acquisti, soprattutto di capi di vestiario o accessori personali, ma non l'aspetto strettamente commerciale della vendita
definition: Consumer purchasing and related trends, but not the business aspects of retailing @en-gb
definition: Konsumeinkäufe und Entwicklungen in diesem Zusammenhang, nicht den wirtschaftlichen Aspekt des Handels betreffend. @de
definition: Consumo e tendências relacionadas, sem os aspetos relativos ao negócio do retalho. @pt-pt
definition: Consumo e tendências relacionadas, sem os aspectos relativos ao negócio do varejo. @pt-br
definition: 消費者の購入動向、ただし小売りの事業的側面ではない @ja-jp
note: nessuno
in scheme: Subject Code
created: 2006-08-21T12:00:00+00:00
modified: 2012-07-10T12:00:00+00:00
broader: Hobby
broad match: http://cv.iptc.org/newscodes/mediatopic/10000000

Giardinaggio
type: Concept
preferred label: jardinagem @pt-pt
preferred label: 園芸 @ja-jp
preferred label: Gärtnern @de
preferred label: gardening @en-gb
definition: 造園、植樹、植栽などの植物に関する非営利的側面であり、本人と他の人々に喜びをもたらす @ja-jp
definition: Aspetos não comerciais do paisagismo, cultivo de plantas, de árvores e de outra vegetação, que dão prazer ao jardineiro e a outros. @pt-pt
definition: Aspectos não comerciais do paisagismo, cultivo de plantas, de árvores e de outra vegetação, que dão prazer ao jardineiro e a outros. @pt-br
definition: The non-commercial aspects of landscaping, growing plants, trees and other vegetation that gives pleasure to the gardener and others @en-gb
definition: Arte, tecnica ed altri aspetti non commerciali riguardanti la cura delle piante, degli alberi e del verde in generale, intesa come passatempo per chi lo fa
definition: nicht-kommerzielle Seite der Gärtnerei, Bepflanzung von Bäumen und anderer Vegetation, die dem Gärtner und anderen Freude machen. @de
note: nessuno
in scheme: Subject Code
created: 2006-08-21T12:00:00+00:00
modified: 2012-07-10T12:00:00+00:00
broader: Hobby
broad match: http://cv.iptc.org/newscodes/mediatopic/20000550

Traffico
type: Concept
preferred label: Information routière @fr
preferred label: trânsito @pt-pt
preferred label: traffic @en-gb
preferred label: tráfico @es
preferred label: 交通情報 @ja-jp
preferred label: Verkehrsbericht @de
definition: Informazioni riguardanti il traffico: stato delle strade, formazione di code, esodi e controesodi ecc.
definition: Reportes de tráfico y/o alertas. @es
definition: Informações e/ou alertas sobre o trânsito. @pt-br
definition: L'information routière : état des routes, embouteillages,... @fr
definition: 交通に関する情報や警告 @ja-jp
definition: Verkehrsberichte und/oder Warnhinweise. @de
definition: Traffic reports and/or warnings @en-gb
note: nessuno
in scheme: Subject Code
created: 2003-11-26T12:00:00+00:00
modified: 2012-07-10T12:00:00+00:00
broader: Spostamenti, Trasporti quotidiani

Politica
type: Concept
preferred label: 政治 @ja-jp
preferred label: política @es
preferred label: Politik @de
preferred label: Politique @fr
preferred label: politics @en-gb
definition: Exercício do poder local, regional, nacional e internacional ou luta pelo poder e relações entre governos e estados. @pt-br
definition: Tout ce qui est relatif à l'exercice du pouvoir local, régional, national et international ainsi que les relations entre gouvernements et états @fr
definition: Local, regional, national and international exercise of power, or struggle for power, and the relationships between governing bodies and states. @en-gb
definition: 地方、地域、国家および国際的な権力の行使、権力のための闘争や、統治する組織や国家の間の関係 @ja-jp
definition: Lokale, regionale, nationale und internationale Übungen der Stärke oder zur Erlangung von Stärke, und die Beziehung zwischen regierenden Einheiten und Staaten. @de
definition: Ejercicio o lucha local, regional, nacional e internacional por el poder, y relaciones entre las entidades rectoras y los estados. @es
definition: Attività di governo e legislativa a livello locale, regionale, nazionale e internazionale, i partiti, le relazioni tra enti governativi e tra gli stati
note: nessuno
in scheme: Subject Code
created: 2000-10-30T12:00:00+00:00
modified: 2010-12-15T17:01:09+00:00
narrower: Difesa
narrower: Diplomazia
narrower: Elezioni
narrower: Servizi Segreti, Intelligence
narrower: Aiuto estero
narrower: Governo
narrower: Diritti umani
narrower: Enti locali
narrower: Parlamento
narrower: Partiti, Movimenti
narrower: Rifugiato
narrower: Regioni
narrower: Bilancio Statale
narrower: Trattati, Organizzazioni internazionali – ANNULLATO
narrower: Costituzione
narrower: Politica interna
narrower: Migrazioni
narrower: Iniziative popolari
narrower: Referendum
narrower: Politica nucleare
narrower: Lobbying
narrower: Concorrenza
narrower: Censura
narrower: Politica (generico)
narrower: Libertà Stampa
narrower: Libertà Religiosa
narrower: Trattati
narrower: Organizzazioni internazionali

Difesa
type: Concept
preferred label: Défense @fr
preferred label: defesa @pt-pt
preferred label: 防衛 @ja-jp
preferred label: Verteidigung @de
preferred label: defence @en-gb
preferred label: defensa @es
definition: Toute action pour défendre son pays @fr
definition: Alles was die Verteidigung des eigenen Landes umfasst. @de
definition: Cualquier cosa que tenga que ver con la defensa de su propio país. @es
definition: Attività e politica relative alla Difesa del paese
definition: Tudo o que envolva a defesa de seu país. @pt-br
definition: Anything involving the defence of one's own country @en-gb
definition: Tudo o que envolva a defesa do seu país. @pt-pt
definition: 自分自身の国を防御すること @ja-jp
note: nessuno
in scheme: Subject Code
created: 2000-10-30T12:00:00+00:00
modified: 2010-12-15T17:01:09+00:00
broader: Politica
narrower: Veterani, Reduci
narrower: Sicurezza nazionale
narrower: Misure Sicurezza
narrower: Forze Armate
narrower: Equipaggiamento militare
narrower: Armi da fuoco
narrower: Armi biologiche, chimiche
narrower: Sistemi missilistici
narrower: Armi nucleari

Diplomazia
type: Concept
preferred label: 外交 @ja-jp
preferred label: diplomacia @pt-br
preferred label: Diplomatie @de
preferred label: diplomacy @en-gb
definition: *Emprego das capacidades orais e de escrita para persuadir outros do seu ponto de vista; arte de negociação entre estados, governos.* @pt-pt
definition: Rapporti politici fra gli Stati ed i Governi, l'attività di negoziazione
definition: *Emprego das capacidades orais e de escrita para persuadir outros de seu ponto de vista; arte de negociação entre estados, governos.* @pt-br
definition: Anwendung sprachlicher oder schreibender Fähigkeiten, um andere von den eigenen Standpunkten zu überzeugen. @de
definition: El uso de las habilidades escritas y habladas que permiten disuadir el punto de vista de otros. @es
definition: The use of verbal and written skills for persuading others to your point of view @en-gb
definition: 言葉や書面であなたの見解を他人に説得する技術 @ja-jp
definition: L'art de la négociation entre états, gouvernements @fr
note: nessuno
in scheme: Subject Code
created: 2000-10-30T12:00:00+00:00
modified: 2010-12-15T17:01:09+00:00
broader: Politica
narrower: Summit
narrower: Relazioni Internazionali
narrower: Negoziati Pace
narrower: Alleanze

Elezioni
type: Concept
preferred label: eleições @pt-pt
preferred label: Wahl @de
preferred label: élections @fr
preferred label: election @en-gb
preferred label: elecciones @es
preferred label: 選挙 @ja-jp
definition: Seleção de representantes por votação. @pt-br
definition: La désignation d'un ou plusieurs représentants par un vote @fr
definition: Die Auswahl der Repräsentanten durch das Abgeben von Stimmen. @de
definition: Scelta democratica da parte di un popolo di suoi rappresentanti chiamati a governarlo e a legiferare
definition: 投票による代表者の選出 @ja-jp
definition: The selection of representatives by the casting of votes @en-gb
definition: La selección de un representante mediante el conteo de votos. @es
note: nessuno
in scheme: Subject Code
created: 2000-10-30T12:00:00+00:00
modified: 2010-12-15T17:01:09+00:00
broader: Politica
narrower: Candidato
narrower: Campagna elettorale
narrower: Finanziamento elettorale
narrower: Politiche
narrower: Regionali
narrower: Amministrative
narrower: Voto
narrower: Sondaggio elettorale
narrower: Europee
narrower: Primarie

Servizi Segreti, Intelligence
type: Concept
preferred label: Spionage und Geheimdienst @de
preferred label: espionaje e inteligencia @es
preferred label: 情報機関 @ja-jp
preferred label: espionagem @pt-pt
preferred label: Espionnage @fr
preferred label: espionage and intelligence @en-gb
definition: Colección secreta de información. @es
definition: Recolha secreta de informações. @pt-pt
definition: Versteckte Beschaffung von Informationen. @de
definition: Raccolta segreta di informazioni ed interventi per la sicurezza dello Stato
definition: Collecte clandestine de renseignements @fr
definition: 情報の隠れた収集 @ja-jp
definition: Covert collection of information @en-gb
note: nessuno
in scheme: Subject Code
created: 2000-10-30T12:00:00+00:00
modified: 2010-12-15T17:01:09+00:00
broader: Politica

Aiuto estero
type: Concept
preferred label: 対外援助 @ja-jp
preferred label: foreign aid @en-gb
preferred label: ajuda externa @pt-br
preferred label: ayuda internacional @es
preferred label: Aide internationale @fr
preferred label: Auslandshilfe @de
definition: Help provided by one nation to another @en-gb
definition: Auxílio prestado por uma nação a outra. @pt-br
definition: Hilfe, die ein Land einem anderen gewährt. @de
definition: Aiuto fornito da una nazione ad un 'altra, o a paesi in via di sviluppo; Aiuti internazionali
definition: Ayuda proporcionada por una nación a otra. @es
definition: 国によって外部に提供された援助 @ja-jp
definition: Aide apportée par un pays à un autre @fr
note: nessuno
in scheme: Subject Code
created: 2000-10-30T12:00:00+00:00
modified: 2010-12-15T17:01:09+00:00
broader: Politica
narrower: Sanzioni economiche

Governo
type: Concept
preferred label: governo (sistema) @pt-pt
preferred label: gobierno @es
preferred label: 政府 @ja-jp
preferred label: government @en-gb
preferred label: Regierung @de
preferred label: Gouvernement @fr
definition: 国を統治するためのシステム @ja-jp
definition: Sistema que administra um país. @pt-br
definition: Groupe de personnes désignées ou élues pour administrer un pays @fr
definition: Divisão do poder no estado, sistema que administra um país. @pt-pt
definition: Das regulierende System eines Landes. @de
definition: Sistema di governo che amministra una nazione
definition: El sistema que rige a un país. @es
definition: The system for ruling a country @en-gb
note: nessuno
in scheme: Subject Code
created: 2000-10-30T12:00:00+00:00
modified: 2010-12-15T17:01:09+00:00
broader: Politica
narrower: Pubblica amministrazione, PA
narrower: Sicurezza Cittadini
narrower: grupo de reflexão
narrower: Governo nazionale
narrower: Potere Esecutivo
narrower: Capo di Stato
narrower: Ministeri, Dipartimenti
narrower: Cariche pubbliche
narrower: Ministri
narrower: Impiegato pubblico
narrower: Privatizzazioni
narrower: Nazionalizzazioni
narrower: Impeachment

Diritti umani
type: Concept
preferred label: direitos humanos @pt-br
preferred label: derechos humanos @es
preferred label: Droits de l'homme @fr
preferred label: 人権 @ja-jp
preferred label: Menschenrechte @de
preferred label: human rights @en-gb
definition: Direitos comuns a todos os cidadãos do mundo. @pt-pt
definition: Derechos a los cuales tienen derecho todos los ciudadanos del mundo. @es
definition: Rechte, die von allen Bürgern in Anspruch genommen werden können. @de
definition: Les droits universels des citoyens @fr
definition: Diritti universalmente riconosciuti a tutti i cittadini
definition: 全ての市民が享受する普遍的に与えられた権利 @ja-jp
definition: Rights entitled to be enjoyed by all citizens universally @en-gb
note: nessuno
in scheme: Subject Code
created: 2000-10-30T12:00:00+00:00
modified: 2010-12-15T17:01:09+00:00
broader: Politica

Enti locali
type: Concept
preferred label: autoridades locales @es
preferred label: autoridades locais @pt-br
preferred label: Institutions locales @fr
preferred label: Kommune @de
preferred label: 地方自治 @ja-jp
preferred label: local authority @en-gb
definition: Les autorités locales, aux niveau de la ville, du département,... @fr
definition: 都市、州あるいは自治区レベルの権限 @ja-jp
definition: Autoridades de uma cidade, condado, distrito, município. @pt-br
definition: Autoridades de una ciudad, condado o municipio. @es
definition: Authorities at city, county state or borough level @en-gb
definition: Autoritäten in der Stadt, auf Landes- oder Bezirksebene. @de
definition: Notícias sobre autoridades regionais, distritais, municipais ou de qualquer outra subdivisão administrativa de um estado. @pt-pt
definition: Autorità ed istituzioni locali a livello comunale, provinciale, ma anche servizi pubblici locali, ecc.
note: nessuno
in scheme: Subject Code
created: 2000-10-30T12:00:00+00:00
modified: 2010-12-15T17:01:09+00:00
broader: Politica

Parlamento
type: Concept
preferred label: parlamento @pt-pt
preferred label: parliament @en-gb
preferred label: senado y cámara de diputados @es
preferred label: 議会 @ja-jp
preferred label: Parlement @fr
preferred label: Parlament @de
definition: Assemblee legislative degli eletti in rappresentanza del popolo
definition: Corpo coletivo dos representantes eleitos do povo. @pt-br
definition: L'assemblée ou les deux assemblées législatives où siègent les représentants élus du peuple @fr
definition: 人々を代表して公式に選ばれた集合的な組織 @ja-jp
definition: The collective body of elected officials representing the people @en-gb
definition: Cuerpo colectivo elejido oficialmente en representación de las personas. @es
definition: Die kollektive Gemeinschaft gewählter Volksvertreter. @de
note: nessuno
in scheme: Subject Code
created: 2000-10-30T12:00:00+00:00
modified: 2010-12-15T17:01:09+00:00
broader: Politica
narrower: Senato
narrower: Camera

Partiti, Movimenti
type: Concept
preferred label: parties and movements @en-gb
preferred label: partidos e movimentos @pt-br
preferred label: Partis politiques @fr
preferred label: 政党 @ja-jp
preferred label: partidos @es
preferred label: Partei @de
definition: Umfasst sowohl formelle und informelle politische Zusammenschlüsse. @de
definition: Associations -formelle ou informelle- de personnes ayant les mêmes opinions organisées en vue d'une action politique @fr
definition: 公式あるいは非公式に認識された政治的団体を扱う @ja-jp
definition: Associazioni politiche organizzate e riconosciute
definition: Cubre asociaciones políticas tanto formalmente reconocidas como informales. @es
definition: Associações políticas formalmente reconhecidas ou informais. @pt-br
definition: Covers both formally recognized and informal political associations @en-gb
note: nessuno
in scheme: Subject Code
created: 2000-10-30T12:00:00+00:00
modified: 2010-12-15T17:01:09+00:00
broader: Politica
narrower: Organizzazioni non governative (ONG)

Rifugiato
type: Concept
preferred label: refugiados @pt-pt
preferred label: 難民・亡命 @ja-jp
preferred label: Réfugiés @fr
preferred label: refugee @en-gb
preferred label: Flüchtling, Asyl @de
definition: Pessoa que procura abrigo noutro país por medo de perseguição no seu próprio país. @pt-pt
definition: Chi cerca rifugio in un altro paese a causa delle persecuzioni nel proprio
definition: Eine in einem anderen Land schutzsuchende Person, die Angst vor Verfolgung durch das eigene Land hat. @de
definition: A person seeking shelter in another country because of some fear of persecution in his own country @en-gb
definition: Pessoa que procura abrigo em outro país por medo de perseguição em seu próprio país. @pt-br
definition: 自国で迫害の恐れがあるためい別の国で避難する場所を求める人 @ja-jp
definition: Una persona que solicita refugio en otro país por miedo a la persecusión en su propio país. @es
definition: Personne qui a quitté son pays d'origine pour fuir un danger @fr
note: nessuno
in scheme: Subject Code
created: 2000-10-30T12:00:00+00:00
modified: 2010-12-15T17:01:09+00:00
broader: Politica

Regioni
type: Concept
preferred label: governos regionais @pt-br
preferred label: autoridades regionales @es
preferred label: 広域行政機関 @ja-jp
preferred label: Bundesland @de
preferred label: Institutions régionales @fr
preferred label: regional authority @en-gb
definition: 例えばデラウェア川流域委員会のように、１つ以上の管轄を包含するレベルにおける政府機関 @ja-jp
definition: Corpos governativos com mais de uma jurisdição (ex.: Delaware River Basin Commission - Comissão da Bacia do Rio Delaware). @pt-pt
definition: Autorità di governo e legislative a livello regionale, ma anche istituzioni a livello regionale
definition: Government bodies at levels encompassing more than one jurisdiction, e.g. the Delaware River Basin Commission @en-gb
definition: Regierungseinheiten auf Ebenen, die für mehr als eine Gerichtsbarkeit zuständig sind, wie z.B. Länder der BRD oder Österreich, Kantone der Schweiz. @de
definition: Commission ou comité représentant l'autorité publique au niveau régional, ex: parcs naturels, etc. @fr
definition: Cuerpos gubernamentales con más de una jurisdicción. Ej. La Comisición del Rio Basin de Delaware. @es
note: nessuno
in scheme: Subject Code
created: 2000-10-30T12:00:00+00:00
modified: 2010-12-15T17:01:09+00:00
broader: Politica

Bilancio Statale
type: Concept
preferred label: state budget and tax @en-gb
preferred label: orçamento do estado e impostos @pt-br
preferred label: 予算・税 @ja-jp
preferred label: Staatshaushalt und Steuern @de
preferred label: presupuesto estatal @es
preferred label: Budget de l'Etat et impôts @fr
definition: Instrumento de gestão do governo que discrimina as receitas e despesas anuais do estado. @pt-pt
definition: Le budget national établi par le gouvernement et voté par le parlement @fr
definition: Manovra di bilancio varata dal governo e votata dal Parlamento
definition: 政府によって発布された国家の予算 @ja-jp
definition: Orçamento nacional promulgado pelo governo. @pt-br
definition: The national budget as promulgated by the government @en-gb
definition: Der von der Regierung verkündete nationale Haushalt. @de
definition: El presupuesto nacional tal y como ha sido promulgado por el gobierno. @es
note: nessuno
in scheme: Subject Code
created: 2000-10-30T12:00:00+00:00
modified: 2010-12-15T17:01:09+00:00
broader: Politica
narrower: Finanze, Tasse

Trattati, Organizzazioni internazionali – ANNULLATO
type: Concept
preferred label: tratados e organizações internacionais-INATIVO @pt-br
preferred label: Traités et organisations internationales @fr
preferred label: 条約、国際機構-使用不可 @ja-jp
preferred label: treaty and international organisation-DEPRECATED @en-gb
preferred label: Staatsvertrag und internationale Organisationen-GELÖSCHT @de
preferred label: tratados y organizaciones @es
definition: Órgãos formais para regular as atividades entre nações, frequentemente com base em acordos escritos. @pt-pt
definition: Intese fra le nazioni e organismi internazionali che regolano i rapporti fra i vari paesi - ANNULLATO
definition: NA @en-gb
definition: Cuerpos formales para regulas actividades entre las naciones, a menudo basados en acuerdos escritos. @es
definition: Convention passées entre états souverains et les organismes internationaux qui régulent les rapports entre les pays @fr
definition: --- @de
definition: しばしば契約書に基づき、国家間において活動を規定する公的な組織体 @ja-jp
note: ANNULLATO in V 16, diviso in SubjectMatters 11027 e 11028
note: DEPRECATED in V 16, split to SubjectMatters 11027 and 11028 @en-gb
note: Hier gelöscht, aufgeteilt auf SubjectMatters 11027000 und 11028000 @de
in scheme: Subject Code
created: 2000-10-30T12:00:00+00:00
retired: 2005-08-26T00:00:00+00:00
modified: 2010-12-15T17:01:09+00:00
broader: Politica
narrower: Relazioni internazionali – ANNULLATO
narrower: Negoziati Pace – ANNULLATO
narrower: Alleanze – ANNULLATO
broad match: http://cv.iptc.org/newscodes/mediatopic/20000638

Costituzione
type: Concept
preferred label: constitution @en-gb
preferred label: Constitution @fr
preferred label: constituição @pt-pt
preferred label: 憲法 @ja-jp
preferred label: constitución @es
preferred label: Verfassung @de
definition: 政府の政策施行や市民の権利について詳しく説明する通常成文化された文書 @ja-jp
definition: Usualmente un documento escrito que establece los principios de un gobierno y los derechos de los ciudadanos. @es
definition: Für gewöhnlich ein schriftliches Dokument, was das Funktionieren einer Regierung und die Rechte der Bürger darin festschreibt. @de
definition: Geralmente, um documento escrito que estabelece os direitos e os deveres dos cidadãos e a organização política do estado, definindo os poderes e funções dos poderes legislativo, executivo e judicial. @pt-pt
definition: Geralmente, documento escrito que estabelece as operações de um governo e os direitos dos cidadãos. @pt-br
definition: Usually a written document setting forth the operations of a government and the rights of the citizens therein @en-gb
definition: Carta fondamentale di uno stato
definition: Généralement un texte écrit regroupant l'ensemble des lois fondamentales qui déterminent la forme de gouvernement d'un état @fr
note: moved to SubjectMatter 11002 in V16 @fr
note: nessuno
in scheme: Subject Code
created: 2000-10-30T12:00:00+00:00
modified: 2010-12-15T17:01:09+00:00
broader: Politica

Politica interna
type: Concept
preferred label: política interna @pt-br
preferred label: políticas internas @es
preferred label: 国内政策 @ja-jp
preferred label: Politique Intérieure @fr
preferred label: interior policy @en-gb
preferred label: Innenpolitik @de
definition: Políticas gubernamentales que afectan los asuntos internos de un país. @es
definition: Regierungspolitik bezogen auf die inneren Angelegenheiten eines Landes. @de
definition: Políticas governamentais que afetam os assuntos internos de um país. @pt-pt
definition: Attività politica di governo e partiti o gruppi che riguarda gli affari interni di un paese
definition: Government policies affecting internal affairs of a country @en-gb
definition: Les politiques gouvernementales relatives aux affaires internes d'un pays @fr
definition: 国内問題に影響する政府の政策 @ja-jp
note: moved to SubjectMatter 11002 in V16 @fr
note: nessuno
in scheme: Subject Code
created: 2000-10-30T12:00:00+00:00
modified: 2010-12-15T17:01:09+00:00
broader: Politica
narrower: Protezione dati personali
narrower: Aree Urbane
narrower: Welfare
narrower: Controllo armi personali
narrower: Popolazione
narrower: Raccolta dati personali
narrower: Inchieste su Utilità pubblica

Migrazioni
type: Concept
preferred label: migrações @pt-pt
preferred label: 集団移住 @ja-jp
preferred label: Migrations @fr
preferred label: Migration @de
preferred label: migration @en-gb
preferred label: migración @es
definition: Déplacement d'une population d'un endroit à un autre @fr
definition: Movimiento de personas de un lugar a otro. @es
definition: ある場所から別の場所まで人々の集団が移動すること @ja-jp
definition: Movimentação de um grupo de pessoas de um lugar a outro. @pt-br
definition: Bewegung einer Gemeinschaft von Menschen von einem Ort zu einem anderen. @de
definition: Movimenti di un gruppi di persone da un posto ad un altro
definition: Movement of one body of persons from one place to another @en-gb
definition: Movimentação de pessoas de um lugar para outro. @pt-pt
note: nessuno
in scheme: Subject Code
created: 2000-10-30T12:00:00+00:00
modified: 2010-12-15T17:01:09+00:00
broader: Politica

Iniziative popolari
type: Concept
preferred label: citizens initiative and recall @en-gb
preferred label: Bürgerinitiative @de
preferred label: Initative populaire @fr
preferred label: Iniciativa popular @pt-br
preferred label: iniciativa y revocación ciudadanas @es
preferred label: 市民運動・リコール @ja-jp
definition: 民間の権限者が決定の修正を求めたり、現在の法律や規制の改正を求めたりする政治的提案のこと @ja-jp
definition: Politische Überzeugungen von Nicht-Regierungsangehörigen für Korrekturen oder Veränderungen in Bezug auf schon existente Regeln und Vorschriften. @de
definition: Sugestões políticas de membros ou organismos não governamentais para corrigir uma ação ou para fazer mudanças nas regras e regulações existentes. @pt-br
definition: Political suggestions by non-government officials for corrective action, or for changes in existing rules and regulations @en-gb
definition: Iniziative provenienti da cittadini o movimenti di cittadini per nuove leggi o cambiamenti di leggi esistenti
definition: Sugestión política por parte de oficiales no gubernamentales para corregir una acción, o por el cambio de las reglas o regulaciones vigentes. @es
definition: Suggestions politiques émanant de groupes ou organisations non-gouvernementales pour corriger une politique donnée @fr
note: nessuno
in scheme: Subject Code
created: 2000-10-30T12:00:00+00:00
modified: 2010-12-15T17:01:09+00:00
broader: Politica

Referendum
type: Concept
preferred label: Référendum @fr
preferred label: referendo @pt-pt
preferred label: 国民投票 @ja-jp
preferred label: referenda @en-gb
preferred label: referendos @es
preferred label: Volksbegehren/Referendum @de
definition: Politische Vorschläge, Gesetze und Taten, die von Nicht-Regierungsangehörigen vorgebracht werden und zur Abstimmung durch die Abstimmungsberechtigten vorliegen. @de
definition: Iniziative referendarie proposte all'attenzione del corpo elettorale
definition: 民間の権限者が提案する政治的提案、法律、決定を有権者全体で投票にかけること @ja-jp
definition: Vote direct par lequel les citoyens expriment leur avis sur une proposition de mesure législative ou constitutionnelle, voire locale @fr
definition: Propostas políticas, leis e ações sugeridas por membros ou organismos não governamentais para serem votados pela comunidade. @pt-br
definition: Proposiciones políticas, leyes y acciones sugeridas por oficiales no gubernamentales para ser votados por la comunidad. @es
definition: Political proposals, laws and actions suggested by non-government officials to be voted on by the entire voting body @en-gb
note: nessuno
in scheme: Subject Code
created: 2000-10-30T12:00:00+00:00
modified: 2010-12-15T17:01:09+00:00
broader: Politica

Politica nucleare
type: Concept
preferred label: política nuclear @pt-pt
preferred label: 原子力政策 @ja-jp
preferred label: nuclear policy @en-gb
preferred label: políticas nucleares @es
preferred label: Atompolitik @de
preferred label: Politique Nucléaire @fr
definition: Politiche del governo riguardanti l'uso di combustibili nucleari per la produzione di energia o armi
definition: Políticas governamentais relativas ao uso de energia nuclear para a produção de energia ou de armas. @pt-pt
definition: Políticas gubernamentales concernientes al uso de energía nuclear para la producción energética o militar. @es
definition: エネルギー生産や兵器のために核燃料を使うことに関する政府の政策 @ja-jp
definition: Politik der Regierung in Bezug auf die Nutzung von nuklearer Energie- oder Waffenproduktion. @de
definition: Government policies as regards to use of nuclear fuels for power production or weapons @en-gb
definition: Les politiques gouvernementales en matière d'utilisation du nucléaire aux fins de produire de l'énergie ou de fabriquer des armes @fr
note: nessuno
in scheme: Subject Code
created: 2000-10-30T12:00:00+00:00
modified: 2010-12-15T17:01:09+00:00
broader: Politica

Lobbying
type: Concept
preferred label: lobbying @en-gb
preferred label: ロビー活動 @ja-jp
preferred label: Lobby @de
preferred label: Groupe de pression @fr
preferred label: cabildeo @es
definition: The attempt by non-government bodies and individual to affect the outcome of legislation through verbal, or other, persuasion @en-gb
definition: Tentativas de persuasão, verbais ou outras, exercidas por grupos não governamentais e indivíduos, para afetar o resultado dos processos de legislação. @pt-br
definition: Der Versuch nichtregierender Einheiten und Einzelner durch Überzeugung oder Fürsprache die Durchsetzung eines Gesetzes zu beeinflussen. @de
definition: Tentatives de persuasion, verbale ou autres, exercées par des groupes ou des individus pour faire évoluer ou changer un projet de loi ou de réglement gouvernemental @fr
definition: 非政府団体や個人が、口頭やその他の手段で説得することを通して、立法の結果に影響を及ぼそうと試みること @ja-jp
definition: Los intentos de persuación verbales u otro tipo, de una entidad no gubernamental e individuos por afectar los procesos de legislatura. @es
definition: Attività svolta da enti privati o gruppi di pressione per influire sui processi legislativi
note: nessuno
in scheme: Subject Code
created: 2000-10-30T12:00:00+00:00
modified: 2010-12-15T17:01:09+00:00
broader: Politica

Concorrenza
type: Concept
preferred label: Regulierungsbehörde @de
preferred label: Médiateur @fr
preferred label: regulatory policy and organisation @en-gb
preferred label: regulamentação @pt-br
preferred label: políticas y organizaciones reguladoras @es
preferred label: 調停・仲裁機関 @ja-jp
definition: Regole e organismi nazionali o internazionali chiamati a governare i conflitti di interesse e le norme sulla concorrenza
definition: Las normas y entidades, tanto nacionales como internacionales, que rigen los conflictos de intereses y las reglamentaciones relativas a la práctica correcta. @es
definition: Normas e entidades, nacionais e internacionais, que regem os conflitos de interesse e as regulações de boas práticas. @pt-br
definition: Die Regeln und ausführenden Organe, national und international, die Interessenskonflikte regulieren und für gute Praktizierbarkeit sorgen. @de
definition: Organes de régulation nationaux ou internationaux chargé de régler les conflits d'intérêt et les normes de concurrence @fr
definition: 国内外について利害関係やよい実施基準を管理する規則および組織体 @ja-jp
definition: The rules and bodies, both national and international, that govern conflict of interest and good practice regulations. @en-gb
note: nessuno
in scheme: Subject Code
created: 2000-10-30T12:00:00+00:00
modified: 2010-12-15T17:01:09+00:00
broader: Politica

Censura
type: Concept
preferred label: Zensur @de
preferred label: 検閲 @ja-jp
preferred label: censura @es
preferred label: censorship @en-gb
preferred label: Censure @fr
definition: Versuch durch Eingriff jede Art von Gemeinschaft, die Redefreiheit, Religion und Ideen, die gedruckt, gezeichnet, im Cyberspace oder auf anderem Wege verbreitet werden, zu kontrollieren. Umfasst nicht offizielle Reglementierungen wie Kino, Werbung oder Fernsehen. @de
definition: Attempts by any group to control freedoms of speech, religion, and ideas distributed in print, graphics, cyberspace and other ways. Does not include official standards such as cinema ratings, advertising and broadcast standards. @en-gb
definition: Intentos por controlar las libertades de expresión, religiosa, de culto, e ideas difundidas a través de los medios impresos, el ciberespacio y otros, por una organización o grupo, pero sin incluir el control interno de las industrias sobre sus propios órg @es
definition: Tentativas de um grupo controlar as liberdades de expressão ou religiosa e as ideias difundidas por escrito, no ciberespaço ou por outros meios. Não inclui padrões oficiais como classificação de filmes, padrões de publicidade e de radiodifusão, etc. @pt-br
definition: 組織や団体による表現の自由や宗教、崇拝あるいは印刷物やその他メディアにより広められた理念を規制する試み。しかし、映画評価、広告基準、放送基準のような産業自身の媒体による内部制御を含まない @ja-jp
definition: Ogni tentativo messo in atto da parte di qualcuno per controllare le libertà di parola, religione, e idee espresse attraverso stampa, grafici, spazi cibernetici o in altro modo.
definition: Toute tentative pour contrôler la liberté de parole, de religion et de conscience. Sont exclus les notations de films ou de livres, la publicité,... @fr
note: nessuno
note: replaced by *freedom of press* in V 12, reintroduced in V13 @en-gb
in scheme: Subject Code
created: 2004-04-28T12:00:00+00:00
modified: 2012-07-10T12:00:00+00:00
broader: Politica

Politica (generico)
type: Concept
preferred label: Politik (allgemein) @de
preferred label: política (general) @es
preferred label: politics (general) @en-gb
preferred label: 政治（一般） @ja-jp
preferred label: política (geral) @pt-br
preferred label: Politique @fr
definition: Arte ou ciência de governar um estado e/ou de conduzir os assuntos públicos. @pt-pt
definition: Die Kunst oder Wissenschaft an Regierungsangelegenheiten teilzuhaben, der Zustand einer politischen Partei. @de
definition: Arte o scienza di governare e/o gestire la cosa pubblica
definition: The art or science of participating in the affairs of government, a state of political party @en-gb
definition: Science ou art de gouverner un état et/ou de conduire les affaires publiques @fr
definition: 政府の問題に参加することについての技術あるいは科学、政党の状態 @ja-jp
definition: Arte o ciencia de participar en asuntos de gobierno, estado o partidos políticos o de un partido político de un país. @es
note: nessuno
in scheme: Subject Code
created: 2003-04-05T12:00:00+00:00
modified: 2012-07-10T12:00:00+00:00
broader: Politica
narrower: Sistemi politici
narrower: Democrazia
narrower: Sviluppo politico

Libertà Stampa
type: Concept
preferred label: Liberté de la presse @fr
preferred label: freedom of the press @en-gb
preferred label: Pressefreiheit @de
preferred label: liberdade de imprensa @pt-pt
preferred label: libertad de prensa @es
preferred label: 報道の自由 @ja-jp
definition: Informations sur la liberté de la presse et des médias, les pressions dont font l'objet les journalistes @fr
definition: Historias sobre los derechos et la libertad de los medios de prensa, la presión o intimidación hacia periodistas, censura de la prensa, actividades de entidades gubernamentales, asociaciones periodísticas y/o otras ONG en relación a la libertad de prensa. @es
definition: マスメディアの権利と自由、ジャーナリストに対する圧力や脅迫、マスメディアにおける検閲、報道の自由に関係した政府組織やジャーナリストの団体・組織、その他NGOの活動についての記事 @ja-jp
definition: Mass media rights and freedoms, pressure and intimidation of the journalists, censorship in mass media, activities of government bodies, journalistic associations and/or organizations and other NGOs in regards to press freedom @en-gb
definition: Histórias sobre direitos e liberdades dos mass media, pressão e intimidação de jornalistas, censura nos mass media, atividades de entidades governamentais, associações de jornalistas, organizações e outras ONG em relação à liberdade de imprensa. @pt-pt
definition: Rechte und Freiheiten der Massenmedien, Druck und Einschüchterung von Journalisten, Zensur, Aktivitäten der Regierung, Journalistenverbände und/oder Organisationen die für die Pressefreiheit kämpfen. @de
definition: Histórias sobre direitos e liberdades dos mídia, pressão e intimidação de jornalistas, censura nos mídia, atividades de entidades governamentais, associações de jornalistas, organizações e outras ONG em relação à liberdade de imprensa. @pt-br
definition: Diritti e libertà della stampa, pressione o intimidazioni che subiscono i giornalisti, ecc.
note: replaced *censorship* in V12, added as new Topic in V13 @es
note: nessuno
in scheme: Subject Code
created: 2004-04-28T12:00:00+00:00
modified: 2012-07-10T12:00:00+00:00
broader: Politica

Libertà Religiosa
type: Concept
preferred label: Religionsfreiheit @de
preferred label: freedom of religion @en-gb
preferred label: liberdade religiosa @pt-br
preferred label: 信教の自由 @ja-jp
definition: Religious rights and freedoms, pressure and intimidation of the believers, censorship in mass media, activities of government bodies, journalistic associations and/or organizations and other NGOs in regards to freedom of belief and practice @en-gb
definition: Histórias sobre direitos e liberdades religiosos, pressão e intimidação de crentes, censura nos mass media, atividades de entidades governamentais, associações de jornalistas, organizações e outras ONG em relação à liberdade religiosa. @pt-pt
definition: Diritto e libertà di professare una propria fede religiosa , pressione e intimidazioni subite in alcuni paesi, discriminazioni religiose
definition: Histórias sobre direitos e liberdades religiosos, pressão e intimidação de crentes, censura nos mídia, atividades de entidades governamentais, associações de jornalistas, organizações e outras ONG em relação à liberdade religiosa. @pt-br
definition: 信仰の権利と自由、信仰者に対する圧力や脅迫、マスメディアにおける検閲、信仰と慣習の自由に関する政府組織やジャーナリストの団体・組織、その他NGOの活動についての記事 @ja-jp
definition: Religionsrechte und Freiheiten, Unterdrückung und Einschüchterung von Gläubigen, Zensur in den Massenmedien, Vorgehensweisen von Regierungen, Journalistenverbände und andere NGOs im Zusammenhang mit Glaubensfreiheit und deren Praxis. @de
note: nessuno
in scheme: Subject Code
created: 2005-08-26T12:00:00+00:00
modified: 2012-07-10T12:00:00+00:00
broader: Politica

Trattati
type: Concept
preferred label: Internationaler Vertrag @de
preferred label: 条約・協定 @ja-jp
preferred label: treaty @en-gb
preferred label: tratado @pt-pt
definition: 条約(条約法のウィーン条約によって定義されたものとして)は、国際法のもとで拘束力のある、国際的な団体の間の書面契約 @ja-jp
definition: A treaty (as defined by the Vienna Convention on the Law of Treaties) is a written agreement between international entities that is binding under international law. @en-gb
definition: Ein Vertrag (wie es durch die Wiener Vertragsrechtskonvention definiert ist) ist eine schriftliche Vereinbarung zwischen internationalen Gremien, die dem internationalen Recht unterliegt. @de
definition: Um tratado (de acordo com a Convenção de Viena sobre o Direito dos Tratados) é um acordo escrito entre entidades internacionais vinculativo à luz do direito internacional. @pt-pt
definition: Intese vincolanti sottoscritte fra paesi o istituzioni
note: ex 11014000
in scheme: Subject Code
created: 2005-08-26T12:00:00+00:00
modified: 2012-07-10T12:00:00+00:00
broader: Politica

Organizzazioni internazionali
type: Concept
preferred label: Internationale Organisation @de
preferred label: 国際機関 @ja-jp
preferred label: international organisation @en-gb
preferred label: organizações internacionais @pt-br
definition: Beinhaltet Organisationen mit Mitgliedern und Aufgaben, die internationale Grenzen überschreiten; können auch zwischenstaatliche Organisationen und Organisationen von unabhängigen Staaten beinhalten. @de
definition: （国際機関は）各国を横断する構成員と機能を持つ諸機関を含む。また、独立諸国家の政府間組織を含むこともある @ja-jp
definition: Includes organisations with members and functions that cross international borders, and may include intergovernmental organisations of sovereign nations. @en-gb
definition: Inclui organizações com membros e funções que atravessam fronteiras internacionais e pode incluir organizações intergovernamentais de nações soberanas. @pt-pt
definition: Organizzazioni i cui membri e le cui funzioni operino al di là dei confini dei vari paesi, ma anche organizzazioni intergovernative di paesi sovrani
note: ex 11014000
in scheme: Subject Code
created: 2005-08-26T12:00:00+00:00
modified: 2012-07-10T12:00:00+00:00
broader: Politica

Veterani, Reduci
type: Concept
preferred label: 退役軍人 @ja-jp
preferred label: Veteran @de
preferred label: Anciens combattants @fr
preferred label: veteranos @pt-br
preferred label: veterans affairs @en-gb
preferred label: asuntos de ex combatientes @es
definition: Cuidado y previsión de aquellos que sirven en las fuerzas armadas. @es
definition: Cuidados e assistência para antigos combatentes das forças armadas. @pt-pt
definition: La prise en charge des anciens combattants @fr
definition: Versorgung und Pensionen für ehemalige Soldaten. @de
definition: Care and provision for those who served in the military @en-gb
definition: 軍役に服した人への世話と支給 @ja-jp
definition: Attenzioni e provvedimenti rivolti per chi ha servito sotto le armi, specie durante un conflitto
note: nessuno
in scheme: Subject Code
created: 2000-10-30T12:00:00+00:00
modified: 2010-12-15T17:01:09+00:00
broader: Difesa

Sicurezza nazionale
type: Concept
preferred label: national security @en-gb
preferred label: segurança nacional @pt-br
preferred label: Sécurité nationale @fr
preferred label: 国家安全保障 @ja-jp
preferred label: seguridad nacional @es
preferred label: Nationale Sicherheit @de
definition: Protezione della nazione e dei suoi confini, come anche il bene comune dei suoi cittadini
definition: The philosophy of securing a nation and its borders, as well as the well being of its citizens @en-gb
definition: Filosofia de proteger o país, as suas fronteiras e o bem-estar dos seus cidadãos. @pt-pt
definition: Die Sicherheitsvorstellungen ein Land und seine Grenzen zu schützen, genauso wie das Wohlergehen der Bürger. @de
definition: Filosofía de proteger al país y sus fronteras, como también a el bien común de sus ciudadanos. @es
definition: Philosophie politique pour assurer la sécurité d'un pays, de ses frontières et du bien être de ses citoyens @fr
definition: Filosofia de proteger o país, suas fronteiras e o bem-estar de seus cidadãos. @pt-br
definition: 市民の安寧と同様に、国とその国境を安全に保つことについての考え方 @ja-jp
note: nessuno
in scheme: Subject Code
created: 2003-04-05T12:00:00+00:00
modified: 2012-07-10T12:00:00+00:00
broader: Difesa

Misure Sicurezza
type: Concept
preferred label: medidas de segurança @pt-br
preferred label: security measures @en-gb
preferred label: 治安対策 @ja-jp
preferred label: Sicherheitsmaßnahme @de
preferred label: medidas de seguridad @es
preferred label: Mesures de sécurité @fr
definition: 国･国家･建物･人を、災難や外部の妨害から保護すること @ja-jp
definition: Adozione di mezzi e misure volti a garantire la sicurezza di una nazione, uno stato, un edificio o una persona da danni/torti e interferenze esterne
definition: Means of making a nation, a state, a building or a person secure from harm and outside interference. @en-gb
definition: Meios para proteger uma nação, um estado, um edifício ou uma pessoa de danos e interferências exteriores. @pt-br
definition: Mittel eine Nation, einen Staat, ein Gebäude oder eine Person vor Verletzung und äußeren Eingriffen zu schützen. @de
definition: Medio para construir un país, estado, edificio o proteger a una persona de daños desde el exterior. @es
definition: Les moyens de protéger un pays, un état, un bâtiment ou une personne d'éventuelles agressions extérieures @fr
note: nessuno
in scheme: Subject Code
created: 2003-04-05T12:00:00+00:00
modified: 2012-07-10T12:00:00+00:00
broader: Difesa

Forze Armate
type: Concept
preferred label: Bundeswehr @de
preferred label: Forces armées @fr
preferred label: 軍隊 @ja-jp
preferred label: fuerzas armadas @es
preferred label: forças armadas @pt-br
preferred label: armed Forces @en-gb
definition: Funcionários de um governo incumbidos de gerir um conflito armado ou de garantir a segurança de uma nação. @pt-br
definition: Conjunto das organizações e das forças de combate e de defesa de um estado. @pt-pt
definition: Die Angestellten der Regierung, die im Krieg eingesetzt werden oder die Sicherheit einer Nation durchsetzen. @de
definition: 戦争を行う、あるいは国家の安全保障のために政府により雇用された人たち @ja-jp
definition: Aquellos contratados por el gobierno para dirigir un conflicto armado, o para asegurar la seguridad de un país. @es
definition: Those employed by a government to conduct war, or to enforce the security of a nation @en-gb
definition: Fonctionnaires chargés de conduire la guerre et d'assurer la sécurité d'un pays @fr
definition: Insieme di uomini, donne e mezzi destinati alla difesa militare dello Stato
note: nessuno
in scheme: Subject Code
created: 2003-04-05T12:00:00+00:00
modified: 2012-07-10T12:00:00+00:00
broader: Difesa

Equipaggiamento militare
type: Concept
preferred label: équipement militaire @fr
preferred label: equipamento militar @pt-pt
preferred label: equipamiento militar @es
preferred label: Militärische Ausrüstung @de
preferred label: military equipment @en-gb
preferred label: 軍装備品 @ja-jp
definition: Equipamento atribuído a membros das forças armadas. @pt-br
definition: 軍隊のメンバーに支給される装備 @ja-jp
definition: Equipaggiamento di cui sono dotati i vari componenti delle forze armate
definition: Equipment issued to members of the armed forces @en-gb
definition: Ausrüstung der bewaffneten Streitkräfte. @de
definition: Equipamiento entregado a miembros de las fuerzas armadas. @es
definition: Ce qui équipe les membres des forces armées @fr
note: nessuno
in scheme: Subject Code
created: 2003-04-05T12:00:00+00:00
modified: 2012-07-10T12:00:00+00:00
broader: Difesa

Armi da fuoco
type: Concept
preferred label: armas de fogo @pt-br
preferred label: Armes à feu @fr
preferred label: firearms @en-gb
preferred label: 兵器 @ja-jp
preferred label: Waffen @de
preferred label: arma de fuego @es
definition: Tudo o que use um explosivo de maneira direcionada para impelir um objeto que possa mutilar ou matar. @pt-pt
definition: Engins utilisant une matière explosive pour propulser un objet dans le but de mutiler ou de tuer @fr
definition: Todo lo que use un explosivo de manera directa para impulsar un objeto que pueda mutilar o matar. @es
definition: 火薬を直接用い、殺傷力のある物体を発射するもの @ja-jp
definition: Anything that uses an explosive in a directed manner to propel an object that can maim or kill @en-gb
definition: Alles, was eine direkte Explosion nutzt, um ein Objekt zu betreiben, was verletzt oder tötet. @de
definition: Strumenti portatili che utilizzano una carica esplosiva per sparare un proiettile in grado di ferire o uccidere; fucili, pistole, mitragliatrici ecc.
note: nessuno
in scheme: Subject Code
created: 2003-04-05T12:00:00+00:00
modified: 2012-07-10T12:00:00+00:00
broader: Difesa
broad match: http://cv.iptc.org/newscodes/mediatopic/20000602

Armi biologiche, chimiche
type: Concept
preferred label: armas biológicas e químicas @pt-pt
preferred label: biological and chemical weapons @en-gb
preferred label: Armes biologiques et chimiques @fr
preferred label: armas biológicas y químicas @es
preferred label: Biologische und Chemische Waffen @de
preferred label: 生物化学兵器 @ja-jp
definition: 生物媒体または化学混合物で敵に障害を与える、または殺傷する兵器 @ja-jp
definition: Engins utilisant des agents biologiques ou chimiques dans le but de neutraliser, mutiler ou tuer un adversaire @fr
definition: Dispositivos que usam agentes biológicos ou misturas químicas para neutralizar, mutilar ou matar o inimigo. @pt-pt
definition: Dispositivi d'arma che utilizzano agenti biologici o composti chimici
definition: Aparatos que emplean agentes biológicos, o mezclas químicas para inutilizar, mutilar o matar a un enemigo. @es
definition: Devices using biological agents, or chemical mixtures to disable, maim or kill an opponent @en-gb
definition: Biologische Hilfsmittel, oder chemische Substanzgemische, um einen Gegner kampfunfähig zu machen, zu verletzen oder zu töten. @de
note: nessuno
in scheme: Subject Code
created: 2003-04-05T12:00:00+00:00
modified: 2012-07-10T12:00:00+00:00
broader: Difesa
broad match: http://cv.iptc.org/newscodes/mediatopic/20000602

Sistemi missilistici
type: Concept
preferred label: sistemas de misiles @es
preferred label: mísseis @pt-br
preferred label: missile systems @en-gb
preferred label: Raketensystem @de
preferred label: ミサイル @ja-jp
preferred label: Systèmes de missiles @fr
definition: Alles, was ein Gas, eine Explosion, biologische oder chemische Objekte durch die Luft befördert in der Absicht einen Gegner kampfunfähig zu machen, zu verletzen oder zu töten. @de
definition: 敵に障害を与える、または殺傷する目的で、不活性物質や爆発物あるいは生物化学物体を空中に推進させるもの @ja-jp
definition: Dispositivi d'arma autoguidati o teleguidati con sistemi di autopropulsione in grado di portare cariche di vario genere
definition: Todo lo que impulse un objeto inerte, explosivo, biológico o químico a través del aire con el objeto de lisiar, mutilar o matar a un enemigo. @es
definition: Anything that propels an inert, explosive, biological or chemical object through the air with the aim of disabling, maiming or killing an opponent. @en-gb
definition: Engins chargés d'explosifs de forte puissance, d'agents biologiques ou chimiques, ayant leur propre système de propulsion et de guidage dans le but de neutraliser, mutiler ou tuer un adversaire @fr
definition: Tudo o que impulsione um objeto inerte, explosivo, biológico ou químico pelo ar com o objetivo de neutralizar, mutilar ou matar o inimigo. @pt-br
note: nessuno
in scheme: Subject Code
created: 2003-04-05T12:00:00+00:00
modified: 2012-07-10T12:00:00+00:00
broader: Difesa
broad match: http://cv.iptc.org/newscodes/mediatopic/20000602

Armi nucleari
type: Concept
preferred label: armas nucleares @es
preferred label: nuclear weapons @en-gb
preferred label: Nuklearwaffen @de
preferred label: Arme nucléaire @fr
preferred label: 核兵器 @ja-jp
definition: ある種の元素の崩壊によって生じる放射能をコントロールし、敵を無力にしたり、傷つけたり、または殺害するために使用する兵器 @ja-jp
definition: Armas que emplean radioactividad controlada desde la descomposición de ciertos elementos hasta lisiar, mutilar y matar a un enemigo. @es
definition: Armi che producono o utilizzano energia nucleare
definition: Engins explosifs utilisant la réaction nucléaire et la radioactivité dégagée pour neutraliser, mutiler ou tuer un adversaire @fr
definition: Armas que usam radioatividade controlada a partir da decomposição de certos elementos para neutralizar, mutilar ou matar o inimigo. @pt-br
definition: Waffen, die kontrollierte Radioaktivität nutzen durch den Zerfall verschiedener Elemente um den Gegner kampfunfähig zu machen, zu verletzten oder zu töten. @de
definition: Weapons that use controlled radioactivity from the decay of certain elements to disable, maim or kill an opponent @en-gb
note: nessuno
in scheme: Subject Code
created: 2003-04-05T12:00:00+00:00
modified: 2012-07-10T12:00:00+00:00
broader: Difesa
broad match: http://cv.iptc.org/newscodes/mediatopic/20000602

Summit
type: Concept
preferred label: Sommet @fr
preferred label: summit @en-gb
preferred label: cumbre @es
preferred label: cimeiras @pt-pt
preferred label: Gipfel/G-7/ G-8 @de
preferred label: サミット @ja-jp
preferred label: cúpulas @pt-br
definition: Rencontre entre dirigeants d'au moins deux pays au niveau des chefs d'état ou de gouvernement. (Ex: Conseil européen, G7 et G8) y compris au niveau des ministres des affaires étrangères ou des finances @fr
definition: Includes meetings of leaders, foreign and finance ministers from the Group of Eight major nations and Group of Seven industrialized nations. @en-gb
definition: Inclui reuniões de líderes e dirigentes de ao menos 2 nações (ex.: Conselho Europeu, reunião de ministros das finanças e dos negócios estrangeiros do Grupo dos Oito ou do Grupo dos Sete dos países mais industrializados). @pt-br
definition: Umfasst Treffen von Regierenden, Außen- und Finanzministern der Gruppe der 8 größten Staaten und der Gruppe der 7 Industriestaaten (G7/G8). @de
definition: Vertici di capi di governo e/o ministri, compresi G8 e G7
definition: Reuniões de chefes de Estado e/ou de governo ou entre líderes de organizações. @pt-pt
definition: Incluye reuniones de líderes, ministros de relaciones exteriores y de finanzas del Grupo de los Ocho países principales y Grupo de los Siete países industrializados. @es
definition: 主要8カ国(G8)および先進7カ国(G7)の首脳、外務大臣及び大蔵大臣の会議 @ja-jp
note: nessuno
in scheme: Subject Code
created: 2000-10-30T12:00:00+00:00
modified: 2010-12-15T17:01:09+00:00
broader: Diplomazia

Relazioni Internazionali
type: Concept
preferred label: relações internacionais @pt-pt
preferred label: international relations @en-gb
preferred label: Internationale Beziehungen @de
preferred label: 国際関係 @ja-jp
definition: 交渉、条約、あるいは私的会議を通しての非暴力による国家間の関係 @ja-jp
definition: Non-violent relations between nations through negotiation, treaty, or personal meetings @en-gb
definition: Rapporti fra gli stati per mezzo di relazioni diplomatiche, trattati o incontri
definition: Nichtgewalttätige Beziehung zwischen zwei Staaten in Form von Verhandlungen, Verträgen und persönlichen Treffen @de
definition: Relações não violentas entre nações através de negociações, tratados ou reuniões pessoais. @pt-pt
note: Spostato da 11014001
note: FormalName error fixed @en-gb
in scheme: Subject Code
created: 2005-08-26T12:00:00+00:00
modified: 2012-07-10T12:00:00+00:00
broader: Diplomazia

Negoziati Pace
type: Concept
preferred label: negociações de paz @pt-br
preferred label: Friedensverhandlung @de
preferred label: peace negotiations @en-gb
preferred label: 和平交渉 @ja-jp
definition: Negociações para pôr fim a um conflito armado. @pt-br
definition: 対立の終結を意図した交渉 @ja-jp
definition: Negoziati avviati per porre fine ad un conflitto
definition: Negotiations intended to bring an end to a conflict @en-gb
definition: Verhandlung, die das Ende eines Konflikts herbeiführen soll @de
note: Spostato da 11014002
note: FormalName error fixed @en-gb
in scheme: Subject Code
created: 2005-08-26T12:00:00+00:00
modified: 2012-07-10T12:00:00+00:00
broader: Diplomazia

Alleanze
type: Concept
preferred label: alianças @pt-pt
preferred label: Bündnis @de
preferred label: 同盟 @ja-jp
preferred label: alliances @en-gb
definition: Coligações entre grupos com ideais semelhantes, formadas para apresentar uma força mais robusta contra qualquer desafio. @pt-pt
definition: Koalitionen gleichgesinnter Gruppen, die sich bilden um eine stärkere Kraft gegen jede Herausforderung demonstrieren zu können. @de
definition: どんな挑戦に対しても、より強い力を示すための同種の考え方をもつ組織同志の提携 @ja-jp
definition: Coalitions of like-minded groups formed to present a stronger force against any challenges @en-gb
definition: Coalizioni di gruppi che la pensano alla stessa maniera per presentare una forza maggiore contro ogni sfida
note: Spostato da 11014003
note: FormalName error fixed @en-gb
in scheme: Subject Code
created: 2005-08-26T12:00:00+00:00
modified: 2012-07-10T12:00:00+00:00
broader: Diplomazia
broad match: http://cv.iptc.org/newscodes/mediatopic/20000639

Candidato
type: Concept
preferred label: political candidates @en-gb
preferred label: candidatos eleitorais @pt-br
preferred label: Kandidat @de
preferred label: Candidats @fr
preferred label: candidatos políticos @es
preferred label: 候補者 @ja-jp
definition: Individuos que se eligen para representar y tener un cargo político. @es
definition: 公職につくために選択される個人 @ja-jp
definition: Individuals who are chosen to stand for office @en-gb
definition: Chi si presenta per essere votato nella competizione elettorale per una determinata carica politica
definition: Individuen, die sich zur Wahl stellen. @de
definition: Personnes qui postulent à un mandat électif @fr
definition: Indivíduos escolhidos para se candidatarem a cargo político. @pt-br
note: nessuno
note: moved from SubjectMatter 11014 in V 16 @fr
in scheme: Subject Code
created: 2003-04-05T12:00:00+00:00
modified: 2012-07-10T12:00:00+00:00
broader: Elezioni

Campagna elettorale
type: Concept
preferred label: Wahlkampf @de
preferred label: campañas políticas @es
preferred label: campanhas eleitorais @pt-br
preferred label: political campaigns @en-gb
preferred label: Campagne électorale @fr
preferred label: 政治活動 @ja-jp
definition: Campaigns for public office @en-gb
definition: Campagne pour l'élection à une charge publique @fr
definition: Kampagnen für öffentliche Parteien. @de
definition: Campañas para tener un cargo político. @es
definition: Campagna che si svolge in vista del voto
definition: Campanha para a eleição de um cargo político. @pt-pt
definition: 公職の運動 @ja-jp
note: nessuno
in scheme: Subject Code
created: 2003-04-05T12:00:00+00:00
modified: 2012-07-10T12:00:00+00:00
broader: Elezioni

Finanziamento elettorale
type: Concept
preferred label: campañas financieras @es
preferred label: financiamento de campanhas @pt-pt
preferred label: Financement de campagne @fr
preferred label: 政治資金 @ja-jp
preferred label: campaign finance @en-gb
preferred label: Wahlkampffinanzierung @de
definition: Dinheiro que torna possível as campanhas eleitorais para um cargo político público. @pt-pt
definition: Geld, das Kampagnen für öffentliche Parteien ermöglicht. @de
definition: Dinero que financia las campañas para un cargo publico. @es
definition: L'argent utilisée pendant la campagne à des fins de propagande électorale @fr
definition: 公職につくための運動を可能にするためのお金 @ja-jp
definition: Denaro utilizzato per finanziare una campagna elettorale
definition: The money that makes campaigns for public office possible @en-gb
note: nessuno
in scheme: Subject Code
created: 2003-04-05T12:00:00+00:00
modified: 2012-07-10T12:00:00+00:00
broader: Elezioni

Politiche
type: Concept
preferred label: eleições nacionais @pt-br
preferred label: Bundestagswahl @de
preferred label: 国政選挙 @ja-jp
preferred label: Elections nationales @fr
preferred label: elecciones nacionales @es
preferred label: national elections @en-gb
definition: Eleger pessoas para o governo a nível nacional. @pt-br
definition: Elegir personas para el gobierno a nivel nacional. @es
definition: Wahl einzelner Regierungsvertreter auf nationaler Ebene. @de
definition: 国家レベルの政治のため、個人を選出 @ja-jp
definition: Elezioni per scegliere rappresentanti e governanti a livello nazionale
definition: Le choix des personnes pour gouverner au niveau national @fr
definition: Choosing individuals for government at a national level @en-gb
note: nessuno
in scheme: Subject Code
created: 2003-04-05T12:00:00+00:00
modified: 2012-07-10T12:00:00+00:00
broader: Elezioni

Regionali
type: Concept
preferred label: 地域選挙 @ja-jp
preferred label: Landtagswahl/Bürgerschaftswahl @de
preferred label: eleições regionais @pt-pt
preferred label: elecciones regionales @es
preferred label: Elections régionales @fr
preferred label: regional elections @en-gb
definition: Elezioni per scegliere rappresentanti e governanti a livello Regionale
definition: Elegir personas para el gobierno a nivel regional. @es
definition: 地域レベルで政治家を選ぶ @ja-jp
definition: Le choix des personnes pour gouverner au niveau régional @fr
definition: Choosing individuals for government at a regional level @en-gb
definition: Eleger pessoas para o governo a nível regional. @pt-pt
definition: Wahl einzelner Regierungsvertreter auf der regionalen Ebene. @de
note: nessuno
in scheme: Subject Code
created: 2003-04-05T12:00:00+00:00
modified: 2012-07-10T12:00:00+00:00
broader: Elezioni

Amministrative
type: Concept
preferred label: local elections @en-gb
preferred label: elecciones locales @es
preferred label: 地方選挙 @ja-jp
preferred label: Kommunalwahl @de
preferred label: eleições locais @pt-br
preferred label: Elections locales @fr
definition: Le choix des personnes pour gouverner au niveau local, généralement municipal @fr
definition: Choosing individuals for government at the basic level, whether city, village or county @en-gb
definition: Wahl einzelner Regierungsvertreter auf der unteren Ebene, wie Stadt, Kreis oder Bezirk. @de
definition: Elezioni per scegliere rappresentanti e governanti a livello locale (provincia, comune, circoscrizione, ecc.)
definition: Elegir personas para el gobierno a nivel básico, ya sea en cuidad, aldea o condado. @es
definition: Eleger pessoas para o governo a nível local. @pt-br
definition: 都市、村、郡の基本レベルで政治家を選ぶ @ja-jp
note: nessuno
in scheme: Subject Code
created: 2003-04-05T12:00:00+00:00
modified: 2012-07-10T12:00:00+00:00
broader: Elezioni

Voto
type: Concept
preferred label: votação @pt-pt
preferred label: voting @en-gb
preferred label: Opération de vote @fr
preferred label: votación @es
preferred label: Stimmwahl @de
preferred label: 投票 @ja-jp
definition: Ato de selecionar uma pessoa que gostaria de ver como seu representante no governo. @pt-pt
definition: Die Wahl eines Individuums, der die eigenen Interessen in der Regierung vertreten soll. @de
definition: 個人の主張を代表する政治家を選出する行為 @ja-jp
definition: Acte par lequel une personne exprime son opinion en désignant le candidat qu'elle souhaiterait voir représenter ses intérêts @fr
definition: The act of selecting an individual you would like to represent your interests in government @en-gb
definition: Operazioni elettorali durante le quali il cittadino è chiamato a scegliere fra i vari candidati, ma anche i dati relativi all'affluenza dei votanti, nonché i dati con i risultati elettorali al termine dello scrutinio
definition: Acto de seleccionar que le gustaría que representara sus intereses en el gobierno. @es
note: nessuno
in scheme: Subject Code
created: 2003-04-05T12:00:00+00:00
modified: 2012-07-10T12:00:00+00:00
broader: Elezioni

Sondaggio elettorale
type: Concept
preferred label: sondagens @pt-br
preferred label: encuesta @es
preferred label: poll @en-gb
preferred label: 世論調査 @ja-jp
preferred label: Sondage @fr
preferred label: Wahlumfrage @de
definition: Periodic measurement of a political candidate's standing with the public @en-gb
definition: Misurazione periodica del favore del pubblico di cui gode un candidato politico
definition: Avaliação periódica da posição de um político para o público. @pt-pt
definition: Monitoreo constante de la posicion de un político ante el público. @es
definition: Mesure périodique de l'état de l'opinion vis-à-vis d'un parti ou d'un candidat @fr
definition: Regelmäßige Erhebung des Meinungsbildes in der Öffentlichkeit zu einem politischen Kandidaten. @de
definition: 選挙立候補者への市民からの支持を定期的に測定すること @ja-jp
note: nessuno
in scheme: Subject Code
created: 2004-04-22T12:00:00+00:00
modified: 2012-07-10T12:00:00+00:00
broader: Elezioni
broad match: http://cv.iptc.org/newscodes/mediatopic/20000574

Europee
type: Concept
preferred label: elecciones europeas @es
preferred label: Europawahl @de
preferred label: Elections européennes @fr
preferred label: 欧州選挙 @ja-jp
preferred label: eleições europeias @pt-pt
preferred label: european elections @en-gb
definition: Wahl von Vertretern in ein Gremium auf höherer als nationaler Ebene, z.B Europaparlament. @de
definition: Elezioni che interessano un'istituzione a livello superiore a quello nazionale, per es. per il Parlamento Europeo
definition: Eleger pessoas para um corpo superior ao governo nacional (ex.: Parlamento Europeu). @pt-pt
definition: Elecciones individuales de un individuo para integrar un cuerpo internacional. Ej. Parlamento Europeo. @es
definition: 国の政府より上位にあたる団体(例えば欧州議会)の構成員を選出すること @ja-jp
definition: Choosing individuals for a body which is at a higher level than national government, e.g. European parliament @en-gb
definition: Elire des candidats au Parlement européen @fr
note: nessuno
in scheme: Subject Code
created: 2004-04-22T12:00:00+00:00
modified: 2012-07-10T12:00:00+00:00
broader: Elezioni

Primarie
type: Concept
preferred label: primarias @es
preferred label: eleições presidenciais @pt-br
preferred label: 予備選 @ja-jp
preferred label: Elections primaires @fr
preferred label: Vorwahl @de
preferred label: primary @en-gb
definition: Elections préliminaires au niveau local ou régional @fr
definition: Elecciones primarias a nivel local o regional con miras a eleciones regionales o nacionales. @es
definition: Consultazioni preliminari condotte su base locale o regionale per la scelta di candidati in vista delle elezioni amministrative, regionali o politiche
definition: 地方、国政選挙につながる地域あるいは地方基盤での予備選挙 @ja-jp
definition: Eleições primárias locais ou regionais que conduzem a eleições regionais ou nacionais. @pt-br
definition: Vorwahlen auf lokaler oder regionaler Ebene, die zu einer regionalen oder nationalen Wahl führen. @de
definition: Preliminary elections on a local or regional basis leading up to a regional or national election @en-gb
note: nessuno
in scheme: Subject Code
created: 2004-10-13T12:00:00+00:00
modified: 2012-07-10T12:00:00+00:00
broader: Elezioni

Sanzioni economiche
type: Concept
preferred label: economic sanction @en-gb
preferred label: sanções econômicas @pt-br
preferred label: Sanction économique @fr
preferred label: 経済制裁 @ja-jp
preferred label: Wirtschaftliche Sanktion @de
preferred label: sanções económicas @pt-pt
preferred label: sanción económica @es
definition: Ações punitivas tomadas por um país contra outro, incluindo restrições comerciais, embargos, etc. @pt-br
definition: Acciones punitivas tomadas por un país en contra de otro, incliyendo restricciones cambiarias, embargos, etc. @es
definition: Punitive actions taken by one country against another including trade restrictions, embargoes etc. @en-gb
definition: Sanzioni adottate da un'istituzione internazionale, da un gruppo di paesi o da un solo paese a discapito di un altro: restrizioni sul commercio, embarghi, ecc...
definition: ある国に対し、相反するもう一つの国が貿易規制や通商禁止などを含む懲罰を行うこと @ja-jp
definition: Sanctions prises par un pays contre un autre, comme un embargo ou des restrictions commerciales @fr
definition: Strafende Handlungen eines Staates gegen einen anderen, Handelseinschränkungen, Embargos etc. beinhaltend @de
note: nessuno
in scheme: Subject Code
created: 2004-10-13T12:00:00+00:00
modified: 2012-07-10T12:00:00+00:00
broader: Aiuto estero

Pubblica amministrazione, PA
type: Concept
preferred label: servicios civiles y públicos @es
preferred label: serviços públicos @pt-pt
preferred label: 行政 @ja-jp
preferred label: civil and public service @en-gb
preferred label: Öffentlicher Dienst @de
preferred label: Service public @fr
definition: Les services fournis à titre onéreux ou gratuits par les fonctionnaires de l'état au bénéfice des usagers @fr
definition: Notícias referentes a toda a atividade desempenhada direta ou indiretamente pelo estado para responder a necessidades essenciais do cidadão, da coletividade ou do próprio estado. @pt-pt
definition: El servicio pagado de parte de civiles para el gobierno, y el frecuentemente servicio no pagado de individuos para el beneficio de otros (servicios publicos). @es
definition: Bezahlte Dienstleistung von Zivilisten für die Regierung und die oftmals unbezahlte eherenamtliche Dienstleistung für andere. @de
definition: Enti le cui funzioni principali consistono nel produrre beni e servizi per la collettività non destinati alla vendita; Servizi pubblici
definition: Serviços pagos pelos civis para o governo e serviços não pagos de indivíduos para benefício de outros (serviço público). @pt-br
definition: The paid service by civilians for the government, and the often non-paid service of individuals for the benefit of others (public service) @en-gb
definition: 政府が市民に行うサービス、またしばしば他の利益のための特殊な無償のサービス(社会奉仕) @ja-jp
note: nessuno
in scheme: Subject Code
created: 2000-10-30T12:00:00+00:00
modified: 2010-12-15T17:01:09+00:00
broader: Governo

Sicurezza Cittadini
type: Concept
preferred label: 市民の安全 @ja-jp
preferred label: seguridad ciudadana @es
preferred label: segurança dos cidadãos @pt-pt
preferred label: Innere Sicherheit @de
preferred label: Sécurité publique @fr
preferred label: safety of citizens @en-gb
definition: Políticas do governo para proteger o bem-estar dos seus cidadãos. @pt-pt
definition: Políticas do governo para proteger o bem-estar de seus cidadãos. @pt-br
definition: Políticas gubernamnetales para proteguer el bienestar de los ciudadanos. @es
definition: Government policies to protect the well being of its citizens @en-gb
definition: Politiche pubbliche finalizzate alla protezione del benessere dei cittadini
definition: Les politiques gouvernementales pour protéger le bien être des citoyens @fr
definition: Regierungspolitik, die das Wohlergehen der Bürger schützt. @de
definition: 市民の福利を保護する政府の政策 @ja-jp
note: nessuno
in scheme: Subject Code
created: 2000-10-30T12:00:00+00:00
modified: 2010-12-15T17:01:09+00:00
broader: Governo

grupo de reflexão
type: Concept
preferred label: Think Tank
preferred label: grupos de expertos @es
preferred label: think tank @en-gb
preferred label: Experts @fr
preferred label: シンクタンク @ja-jp
definition: Groupe de réflexion politique publiant avis et recommandations @fr
definition: Grupo que acomete investigación política y emite documentos de posición, recomendaciones, etc. @es
definition: Grupo de investigação e reflexão política que emite documentos de posição, recomendações, etc. @pt-pt
definition: Gruppe die politische Forschung betreibt und Positionspapiere und Empfehlungen verfasst etc. @de
definition: Group that undertakes political research and issue position papers, recommendations etc @en-gb
definition: Gruppi di esperti che compiono ricerche politiche e pubblicano documenti sull'argomento
definition: 政治的研究や(組織体の出す)方針について勧告等を行うグループ @ja-jp
note: nessuno
in scheme: Subject Code
created: 2000-10-30T12:00:00+00:00
modified: 2010-12-15T17:01:09+00:00
broader: Governo
broad match: http://cv.iptc.org/newscodes/mediatopic/20000593

Governo nazionale
type: Concept
preferred label: Bundesregierung @de
preferred label: 中央政府 @ja-jp
preferred label: Gouvernement national @fr
preferred label: national government @en-gb
preferred label: governo nacional @pt-pt
preferred label: gobierno nacional @es
definition: The ruling body of a nation @en-gb
definition: Die herrschende, regulierende Kraft eines Staates. @de
definition: Corpo governativo de uma nação. @pt-br
definition: Istituzione che governa una nazione
definition: Cuerpo que tiene el mando en el país. @es
definition: L'institution chargée de gérer une nation @fr
definition: ある国家を支配する組織 @ja-jp
note: nessuno
in scheme: Subject Code
created: 2003-04-05T12:00:00+00:00
modified: 2012-07-10T12:00:00+00:00
broader: Governo

Potere Esecutivo
type: Concept
preferred label: executive (government) @en-gb
preferred label: ejecutivo (gobierno) @es
preferred label: Pouvoir exécutif @fr
preferred label: governo @pt-pt
preferred label: Bundeskabinett @de
preferred label: 行政府 @ja-jp
definition: Quella parte istituzionale che esercita un potere che implica la totale azione di governo
definition: That portion of a ruling body involving the overall operation of government @en-gb
definition: 政府の全体的な運営を担っている政権組織の部分 @ja-jp
definition: Ceux qui sont chargés de faire exécuter les lois @fr
definition: Porção do corpo governativo de um país que detém o poder de executar as leis. @pt-pt
definition: Porción de esa parte de tiene el poder incluyendo una operación en conjunto con el gobierno. @es
definition: Der Teil der regulierenden Kraft des Staates, der in alle Regierungsangelegenheiten involviert ist. @de
note: nessuno
in scheme: Subject Code
created: 2003-04-05T12:00:00+00:00
modified: 2012-07-10T12:00:00+00:00
broader: Governo

Capo di Stato
type: Concept
preferred label: chefes de estado @pt-pt
preferred label: heads of state @en-gb
preferred label: 国家指導者 @ja-jp
preferred label: Bundespräsident @de
preferred label: Chef de l'Etat @fr
preferred label: jefes de estado @es
definition: Symbolic or actual chief representative of a nation, such as royalty, or president or emir, for example @en-gb
definition: Representante simbólico o jefe actual del país, como la realeza, o el presidente por ejemplo. @es
definition: Representante supremo de uma nação, simbólico ou não, como realeza, presidente ou emir, por exemplo. @pt-pt
definition: Chi rappresenta una nazione o ne è il capo effettivo: presidente, re, emiro, principe ecc.
definition: Symbolischer oder aktiver Repräsentant eines Landes, wie z.B. König, Präsident oder Emir. @de
definition: 例えば王族、大統領あるいは首長のような、国の象徴的であるか、あるいは実際の最高の代表者 @ja-jp
definition: Représentant suprême d'une nation : roi, émir, président,… @fr
note: nessuno
in scheme: Subject Code
created: 2003-04-05T12:00:00+00:00
modified: 2012-07-10T12:00:00+00:00
broader: Governo

Ministeri, Dipartimenti
type: Concept
preferred label: 省庁 @ja-jp
preferred label: departamentos governamentais @pt-br
preferred label: Ministère @fr
preferred label: departamentos de gobierno @es
preferred label: government departments @en-gb
preferred label: Ministerium @de
definition: Abteilungen der Regierung, die ein spezielles Gebiet vertreten, wie z.B. Gesundheit, Soziales, Wirtschaft oder Verteidigung. @de
definition: 健康、福祉、経済あるいは戦争のような、特定の分野を専門とした政府の部門 @ja-jp
definition: Sezioni di un governo con competenza su specifici settori: ad es. salute, assistenza, economia, interni, esteri ecc.
definition: Ramas del gobierno que se concentran en áreas especificas como salud, bienestar, economía o guerra. @es
definition: Ensemble des services publics d'un secteur donné placés sour la direction d'un ministre, ex: intérieur, affaires sociales, economie,... @fr
definition: Divisões de um governo que se concentram em áreas específicas, como saúde, bem-estar, economia ou guerra. @pt-br
definition: Divisions of a government that concentrate on specific areas such as health, welfare, economy or war @en-gb
note: nessuno
in scheme: Subject Code
created: 2003-04-05T12:00:00+00:00
modified: 2012-07-10T12:00:00+00:00
broader: Governo

Cariche pubbliche
type: Concept
preferred label: Hauts fonctionnaires @fr
preferred label: 議員 @ja-jp
preferred label: detentores de cargos públicos @pt-pt
preferred label: public officials @en-gb
preferred label: funcionários públicos @pt-br
preferred label: Ministerialbeamter @de
preferred label: funcionarios públicos @es
definition: Individuen, meist gewählt, die im öffentlichen Dienst stehen oder öffentliche Interessen vertreten. @de
definition: Individuals, usually elected, who are in public service or commonly in the public eye. @en-gb
definition: Pessoas, geralmente eleitas para cargos políticos, que estão no serviço público ou frequentemente na opinião pública. @pt-br
definition: Personnes,élues ou nommées, exercant une charge publique @fr
definition: Importanti ed alte cariche pubbliche e nella pubblica amministrazione rette da alti funzionari, generalmente di nomina governativa
definition: 公共サービスまたは広く世間の注目を浴びていることに、通常選出された個人 @ja-jp
definition: Qualquer pessoa eleita ou nomeada que ocupa um cargo público e com funções relativas aos poderes soberanos do governo. @pt-pt
definition: Personas generalmente elegidas, quienes están al servicio publico o generalmente en la opinión publica. @es
note: nessuno
in scheme: Subject Code
created: 2003-04-05T12:00:00+00:00
modified: 2012-07-10T12:00:00+00:00
broader: Governo

Ministri
type: Concept
preferred label: ministros @pt-pt
preferred label: Ministres @fr
preferred label: ministros (gobierno) @es
preferred label: 閣僚 @ja-jp
preferred label: ministers (government) @en-gb
preferred label: Minister @de
definition: Responsabili di distinti ministeri, ma anche il primo ministro o il premier, che coordina e presiede l'attività del governo
definition: Membre d'un gouvernement à la tête d'un ministère. Leur chef est le premier ministre ou le président du conseil @fr
definition: 補佐官等、各種の政府部門のうちのあるレベルの代表。もう1つのレベルでは、立法府を構成する。首席の大臣は、首相あるいは総理大臣 @ja-jp
definition: Heads of various government departments at one level, also known as secretaries. At another level they form a legislative body. The chief minister is either prime minister or premier. @en-gb
definition: Führungsebene verschiedener Regierungsministerien, auch bekannt als Staatssekretäre. Auf anderen Ebenen bilden sie die Legislative. Der oberste Minister ist entweder der Bundeskanzler oder der Vizekanzler. @de
definition: Jefes de distintos ministerios del gobiernos en un nivel, también conocidos como ministros. En otro nivel, ellos componen un cuerpo legislativo. El ministro principal es el primer ministro o el presidente. @es
definition: Chefes de vários departamentos governamentais, também conhecidos como ministros. A outro nível formam o corpo legislativo. O mais importante entre eles é o primeiro-ministro. @pt-br
definition: Membro de um gabinete ou conselho de ministros (governo), geralmente responsável por um ministério. @pt-pt
note: nessuno
in scheme: Subject Code
created: 2003-04-05T12:00:00+00:00
modified: 2012-07-10T12:00:00+00:00
broader: Governo

Impiegato pubblico
type: Concept
preferred label: funcionários públicos @pt-br
preferred label: empleos públicos @es
preferred label: Fonctionnaires @fr
preferred label: Beamter @de
preferred label: 公務員 @ja-jp
preferred label: public employees @en-gb
definition: Menschen auf allen Ebenen, die im Dienst der Regierung stehen. @de
definition: People employed by a government at all levels @en-gb
definition: Pessoas contratadas por um governo para cargos públicos. @pt-br
definition: Gente contratada por el gobierno en todos los niveles. @es
definition: Chi lavora nella pubblica amministrazione
definition: すべてのレベルにおいて、政府によって雇用された人々 @ja-jp
definition: Personnes employées par l'Etat @fr
note: nessuno
in scheme: Subject Code
created: 2003-04-05T12:00:00+00:00
modified: 2012-07-10T12:00:00+00:00
broader: Governo

Privatizzazioni
type: Concept
preferred label: privatizações @pt-pt
preferred label: 民営化政策 @ja-jp
preferred label: Privatisierung @de
preferred label: privatización @es
preferred label: privatisation @en-gb
preferred label: Privatisation @fr
definition: Transfert au domaine privé d'entreprises ou de biens propriétés de l'état @fr
definition: La privatización de compañias o propiedades pertenecientes al estado. @es
definition: Privatização de empresas ou propriedades estatais. @pt-br
definition: Processo de venda de uma empresa do setor público ao setor privado. @pt-pt
definition: The privatisation of state-owned companies or property @en-gb
definition: La privatizzazione di società, beni o imprese possedute dallo Stato
definition: Private Übernahme von staatlichen Unternehmen oder Staatseigentum. @de
definition: 国有会社あるいは資産の民営化 @ja-jp
note: nessuno
in scheme: Subject Code
created: 2003-11-26T12:00:00+00:00
modified: 2012-07-10T12:00:00+00:00
broader: Governo

Nazionalizzazioni
type: Concept
preferred label: 国営化 @ja-jp
preferred label: Nationalisation @fr
preferred label: nationalisation @en-gb
preferred label: Verstaatlichung @de
preferred label: nacionalización @es
preferred label: nacionalizações @pt-br
definition: 民間企業あるいは資産の取得 @ja-jp
definition: Übernahme von privaten Unternehmen oder Eigentum durch den Staat. @de
definition: State takeover of private companies or property @en-gb
definition: Tomada de posse de empresas ou propriedades privadas por parte do estado. @pt-pt
definition: Transfert au domaine public d'entreprises ou de biens ou de moyens de production privés @fr
definition: El estado se hace cargo de compañias o propiedades privadas. @es
definition: La rilevazione da parte dello stato di società, beni o imprese private
note: nessuno
in scheme: Subject Code
created: 2003-11-26T12:00:00+00:00
modified: 2012-07-10T12:00:00+00:00
broader: Governo

Impeachment
type: Concept
preferred label: impugnação @pt-br
preferred label: 弾劾 @ja-jp
preferred label: Procédure de destitution @fr
preferred label: acusación @es
preferred label: impeachment @en-gb
preferred label: Amtsvergehen @de
definition: Processo em que uma autoridade oficial é levada a tribunal para responder por acusações de irregularidades. @pt-pt
definition: Verfahren zur Anklage wegen Amtsvergehen von Amtsträgern vor einem Tribunal. @de
definition: Procédure pour traduire un haut responsable devant un tribunal pour y répondre d'accusations de manquements @fr
definition: El proceso que presenta a una autoridad oficial ante un tribunal para responder a cargos de actividades ilícitas. @es
definition: 不正を告発し、法廷の前で答弁させるために官職(公務員)を訴える手続き @ja-jp
definition: The process of bringing a public official before a tribunal to answer charges of wrongdoing @en-gb
definition: Messa in stato d'accusa di titolari di importanti cariche pubbliche, che abbiano commesso determinati illeciti nell'esercizio delle loro funzioni
note: nessuno
in scheme: Subject Code
created: 2004-10-13T12:00:00+00:00
modified: 2012-07-10T12:00:00+00:00
broader: Governo

Senato
type: Concept
preferred label: cámara alta @es
preferred label: Chambre haute @fr
preferred label: câmara alta @pt-br
preferred label: Oberhaus @de
preferred label: 上院 @ja-jp
preferred label: upper house @en-gb
definition: Câmara superior de um corpo legislativo. @pt-br
definition: Senior chamber of a legislative body @en-gb
definition: 立法機関の上級議会 @ja-jp
definition: Chambre haute d'un Parlement législatif (Sénat) @fr
definition: Obere Kammer der Legislative. @de
definition: Cuerpo superior del Poder Legislativo. @es
definition: Camera alta di un corpo legislativo
note: nessuno
in scheme: Subject Code
created: 2004-10-13T12:00:00+00:00
modified: 2012-07-10T12:00:00+00:00
broader: Parlamento

Camera
type: Concept
preferred label: lower house @en-gb
preferred label: câmara baixa @pt-pt
preferred label: Chambre basse @fr
preferred label: cámara baja @es
preferred label: Unterhaus @de
preferred label: 下院 @ja-jp
definition: 立法機関の下級議会 @ja-jp
definition: Camera bassa di un corpo legislativo
definition: Chambre basse d'un Parlement législatif (Assemblée) @fr
definition: Câmara inferior de um corpo legislativo. @pt-br
definition: Cuerpo Inferior del Poder Legislativo. @es
definition: The lower chamber of a legislative body @en-gb
definition: Untere Kammer der Legislative. @de
note: nessuno
in scheme: Subject Code
created: 2004-10-13T12:00:00+00:00
modified: 2012-07-10T12:00:00+00:00
broader: Parlamento

Organizzazioni non governative (ONG)
type: Concept
preferred label: organizaciones no gubernamentales @es
preferred label: ONG @fr
preferred label: ＮＧＯ @ja-jp
preferred label: Regierungsunabhängige Organisation @de
preferred label: non government organizations (NGO) @en-gb
definition: Grupos que generalmente no son del gobierno que presionan, demuestran o hacen campaña acerca de un amplia gama de temas como economía, medioambiente, etc. @es
definition: Gruppi indipendenti dall'autorità di governo che fanno campagne o danno vita ad iniziative autonome o coordinate su una vasta gamma di argomenti come economia, ambiente, assistenza sanitaria, ecc...
definition: 政府外の公式団体。経済、環境、ヘルスケア等の広範囲の問題に関して働きかけ、デモンストレーションを行う @ja-jp
definition: Associations privées agissant comme groupes de pression auprès des gouvernements (ex : les ONG altermondialistes) et/ou menant des campagnes de sensibilisation pour venir notamment en aide aux populations menacées par la famine, la guerre… @fr
definition: Gruppen, offiziell außerhalb der Regierung stehend, die in einem größeren Themenspektrum Einfluss ausüben, demonstrieren, agieren wie Ökonomie, Umwelt, Gesundheit etc. @de
definition: Grupos não pertencentes ao governo que pressionam, protestam ou fazem campanha sobre vários assuntos como economia, meio ambiente, cuidados de saúde, etc. @pt-pt
definition: Groups officially outside of government that lobby, demonstrate or campaign on a wide range of issues such as economics, environment healthcare etc. @en-gb
note: nessuno
in scheme: Subject Code
created: 2003-04-05T12:00:00+00:00
modified: 2012-07-10T12:00:00+00:00
broader: Partiti, Movimenti

Finanze, Tasse
type: Concept
preferred label: finanzas públicas @es
preferred label: finanças públicas @pt-pt
preferred label: Finances publiques @fr
preferred label: public finance @en-gb
preferred label: Öffentliche Gelder @de
preferred label: 歳出 @ja-jp
definition: The money of government used for paying for public programs and services and public debt @en-gb
definition: Dinheiro que o governo usa para financiar programas e serviços públicos e pagar a dívida pública. @pt-br
definition: Regierungsgelder, die für öffentliche Programme, Dienstleistungen und öffentliche Schulden ausgegeben werden. @de
definition: L'argent utilisé pour le financement des programmes et services publics et le remboursement de la dette @fr
definition: 公共事業、公的サービスや公債などの支出を目的とした政府のお金 @ja-jp
definition: Dinero que el gobierno usa para financiar [ programas, deudas y servicios públicos) @es
definition: Denaro utilizzato per finanziare programmi e servizi pubblici, ma anche il debito pubblico
note: nessuno
in scheme: Subject Code
created: 2003-04-05T12:00:00+00:00
modified: 2012-07-10T12:00:00+00:00
broader: Bilancio Statale

Relazioni internazionali – ANNULLATO
type: Concept
preferred label: relaciones internacionales @es
preferred label: international relations-DEPRECATED @en-gb
preferred label: Relations internationales @fr
preferred label: relações internacionais-INATIVO @pt-pt
preferred label: Internationale Beziehungen-GELÖSCHT @de
preferred label: 国際関係-使用不可 @ja-jp
definition: --- @de
definition: INATIVO-Relações não violentas entre nações através de negociações, tratados ou reuniões pessoais. @pt-br
definition: NA @en-gb
definition: Relaciones pacificas entre países por medio de la negociación, acuerdos o reuniones personales. @es
definition: 交渉、条約、あるいは私的会議を通しての非暴力による国家間の関係 @ja-jp
definition: Les rapports entre états à travers les relations diplomatiques, les négociations, traités ou rencontres au sommet @fr
definition: Rapporti fra gli stati per mezzo di relazioni diplomatiche, trattati o incontri - ANNULLATO
note: moved to SubjectMatter 11002 in V16 @en-gb
note: Hier gelöscht, unter 11002000 verschoben @de
note: ANNULLATO e spostato in SubjectMatter 11002 in V16
in scheme: Subject Code
created: 2003-04-05T12:00:00+00:00
retired: 2005-08-26T00:00:00+00:00
modified: 2012-07-10T12:00:00+00:00
broader: Trattati, Organizzazioni internazionali – ANNULLATO
broad match: http://cv.iptc.org/newscodes/mediatopic/20000639

Negoziati Pace – ANNULLATO
type: Concept
preferred label: Négociations de paix @fr
preferred label: 平和交渉-使用不可 @ja-jp
preferred label: negociaciones de paz @es
preferred label: Friedensvertrag-GELÖSCHT @de
preferred label: negociações de paz-INATIVO @pt-pt
preferred label: peace negotiations-DEPRECATED @en-gb
definition: INATIVO-Negociações para pôr fim a um conflito armado. @pt-br
definition: 対立の終結を意図した交渉 @ja-jp
definition: Négociations visant à mettre fin à un conflit @fr
definition: NA @en-gb
definition: --- @de
definition: Negoziati avviati per porre fine ad un conflitto – ANNULLATO
definition: Negociaciones que tienen como objetivo poner fin a un conflicto armado. @es
note: Hier gelöscht, unter 11002000 verschoben @de
note: ANNULLATO e spostato in SubjectMatter 11002 in V16
note: moved to SubjectMatter 11002 in V16 @en-gb
in scheme: Subject Code
created: 2003-04-05T12:00:00+00:00
retired: 2005-08-26T00:00:00+00:00
modified: 2012-07-10T12:00:00+00:00
broader: Trattati, Organizzazioni internazionali – ANNULLATO
broad match: http://cv.iptc.org/newscodes/mediatopic/20000639

Alleanze – ANNULLATO
type: Concept
preferred label: alianças-INATIVO @pt-pt
preferred label: 同盟-使用不可 @ja-jp
preferred label: Bündnisse-GELÖSCHT @de
preferred label: Alliances @fr
preferred label: alianzas @es
preferred label: alliances-DEPRECATED @en-gb
definition: Coalizioni di gruppi che la pensano alla stessa maniera per presentare una forza maggiore contro ogni sfida - ANNULLATO
definition: NA @en-gb
definition: INATIVO-Coligações entre grupos com ideais semelhantes, formadas para apresentar uma força mais robusta contra qualquer desafio. @pt-br
definition: どんな挑戦に対しても、より強い力を示すための同種の考え方をもつ組織同志の提携 @ja-jp
definition: Coaliciones dispuestas a imponerse en contra cualquier tipo de desafíos. @es
definition: --- @de
definition: Pacte, entente, entre plusieurs partis ou puissances @fr
note: moved to SubjectMatter 11002 in V16 @en-gb
note: DEPRECATED in V 16, split to SubjectMatters 11027 and 11028 @fr
note: Hier gelöscht, unter 11002000 verschoben @de
note: ANNULLATO e spostato in SubjectMatter 11002 in V16
in scheme: Subject Code
created: 2003-04-05T12:00:00+00:00
retired: 2005-08-26T00:00:00+00:00
modified: 2012-07-10T12:00:00+00:00
broader: Trattati, Organizzazioni internazionali – ANNULLATO
broad match: http://cv.iptc.org/newscodes/mediatopic/20000639

Protezione dati personali
type: Concept
preferred label: proteção de dados @pt-br
preferred label: 個人情報保護 @ja-jp
preferred label: data protection @en-gb
preferred label: Datenschutz @de
preferred label: protección de datos @es
preferred label: Confidentialité des données @fr
definition: Efforts to protect personal information in either written, oral or electronic form @en-gb
definition: Esforços para proteger dados pessoais sob forma escrita, oral ou eletrónica. @pt-pt
definition: Esforços para proteger dados pessoais sob forma escrita, oral ou eletrônica. @pt-br
definition: Efforts pour protéger les données personnelles sous forme écrite, orale ou électronique @fr
definition: Bemühungen, persönliche Informationen in geschriebener, gesprochener oder elektronischer Form zu schützen. @de
definition: Attività riguardante la protezione dei dati personali; Legge Privacy
definition: 記述や口頭、または電子書類での個人情報を保護するための努力 @ja-jp
definition: Esfuerzos para proteger información personalen cualquiera de sus formas: escrita, oral o electrónica. @es
note: nessuno
note: moved to SubjectMatter 11002 in V16 @fr
in scheme: Subject Code
created: 2000-10-30T12:00:00+00:00
modified: 2010-12-15T17:01:09+00:00
broader: Politica interna

Aree Urbane
type: Concept
preferred label: vivienda y planificación urbana @es
preferred label: Wohnungs- und Städtebau @de
preferred label: 住宅・都市計画 @ja-jp
preferred label: housing and urban planning @en-gb
preferred label: habitação e urbanismo @pt-br
preferred label: Urbanisme @fr
definition: 都市、郊外地域、およびそれら地域の住宅の組織的計画 @ja-jp
definition: Progettazione e governo delle aree urbane e sub-urbane in ogni suo aspetto
definition: Planeamento sistemático de áreas urbanas ou suburbanas e de habitação dentro dessas áreas. @pt-pt
definition: Systematisches Planen von städtischen und vorstädtischen Gebieten und deren Bebauung. @de
definition: Planeamientos sistemáticos de área urbanas o suburbanas y de viviendas dentro de esas áreas. @es
definition: Planejamento sistemático de áreas urbanas ou suburbanas e de vivendas dentro dessas áreas. @pt-br
definition: Le plan d'urbanisme et d'occupation des sols en zone urbaine et suburbaine @fr
definition: Systematic planning of urban and suburban areas and the housing within those areas @en-gb
note: nessuno
in scheme: Subject Code
created: 2000-10-30T12:00:00+00:00
modified: 2010-12-15T17:01:09+00:00
broader: Politica interna

Welfare
type: Concept
preferred label: Sozialpolitik @de
preferred label: 年金・福祉 @ja-jp
preferred label: benefícios sociais (pensões e subsídios) @pt-br
preferred label: pensiones y asistencia social @es
preferred label: Assistance sociale @fr
preferred label: pension and welfare @en-gb
definition: 失業手当、年金および類似の支払いを通しての国民福祉に関わる政府政策 @ja-jp
definition: Políticas gubernamentales que afectan el bienestar de los ciudadanos a través de beneficios de cesantía, pensiones estatales y otros pagos similares. @es
definition: Políticas governamentais que afetam o bem-estar dos cidadãos através de benefícios de desemprego, pensões e outros pagamentos similares. @pt-br
definition: Government policies affecting the well being of its citizens through unemployment benefits, state pensions and other similar payments @en-gb
definition: Les politiques gouvernementales en matières d'allocations sociales, de chômage, de retraite ou de pension, etc. @fr
definition: Politik der Regierung das Wohlbefinden der Bürger zu unterstützen durch Arbeitslosengeld, Sozialhilfe und vergleichbare Zahlungen. @de
definition: Politiche del governo riguardanti pensioni, assistenza sociale ecc.
note: nessuno
in scheme: Subject Code
created: 2000-10-30T12:00:00+00:00
modified: 2010-12-15T17:01:09+00:00
broader: Politica interna

Controllo armi personali
type: Concept
preferred label: controlo de armas pessoais @pt-pt
preferred label: control de armas personales @es
preferred label: Contrôle des armes personnelles @fr
preferred label: 銃規制 @ja-jp
preferred label: controle de armas pessoais @pt-br
preferred label: personal weapon control @en-gb
preferred label: Waffenkontrolle @de
definition: Le contrôle visant la possession d'armes y compris les licences sportives @fr
definition: Kontrolle der Regierung über den persönlichen Besitz von Gewehren und anderen Waffen, umfasst die Kontrolle von Sportwaffen über Lizenzen und andere Mittel. @de
definition: Control gubernamental de la tenencia de armas de fuego y otras armas ofensivas, incluyendo el control de armas utilizadas para deportes, a través de permisos y otros medios. @es
definition: Controllo sulla detenzione personale di armi da fuoco e altre armi d'offesa, comprese le licenze sportive
definition: Government control of personal ownership of firearms and other offensive weapons, including control of weapons used for sports through licenses and other means @en-gb
definition: Controle governamental da posse de armas de fogo e de outras armas ofensivas, incluindo controle de armas usadas em esportes, através de licenças e outros meios. @pt-br
definition: Controlo governamental da posse de armas de fogo e de outras armas ofensivas, incluindo controlo de armas usadas em desportos, através de licenças e outros meios. @pt-pt
definition: 火器およびその他攻撃を目的とする武器の個人的所有権の管理。許可や他の方法を通してスポーツのために使われる武器の管理を含む @ja-jp
note: nessuno
in scheme: Subject Code
created: 2000-10-30T12:00:00+00:00
modified: 2010-12-15T17:01:09+00:00
broader: Politica interna

Popolazione
type: Concept
preferred label: indigenas @es
preferred label: Autochtones @fr
preferred label: indigenous people @en-gb
preferred label: povos indígenas @pt-br
preferred label: Ausländerpolitik @de
preferred label: 先住民 @ja-jp
definition: Políticas governamentais relativas a povos indígenas. @pt-br
definition: Politique gouvernementale concernant les populations autochtones @fr
definition: Políticas gubernamentales hacia los pueblos indigenas. @es
definition: Politiche del governo riguardanti la popolazione
definition: Politik der Regierung in Bezug auf ausländische Mitbürger. @de
definition: Government policies toward indigenous peoples @en-gb
definition: 先住民に対する政府の政策 @ja-jp
note: nessuno
in scheme: Subject Code
created: 2004-04-22T12:00:00+00:00
modified: 2012-07-10T12:00:00+00:00
broader: Politica interna

Raccolta dati personali
type: Concept
preferred label: colector de datos personales @es
preferred label: dados pessoais @pt-pt
preferred label: Volkszählung @de
preferred label: Données personnelles @fr
preferred label: 個人情報収集 @ja-jp
preferred label: personal data collection @en-gb
definition: La colección de información sobre individuos de parte del Gobierno u otras entidades. @es
definition: The collection, by government or other entities of information on individuals @en-gb
definition: Recolha de informação sobre indivíduos, por parte do governo ou de outras entidades. @pt-br
definition: Datensammlung über Einzelpersonen durch die Regierung und andere Behörden. @de
definition: Les initiatives et suggestions des citoyens pour faire évoluer ou changer les réglements publics @fr
definition: 政府またはその他による個人情報の収集 @ja-jp
definition: Raccolta di informazioni sugli individui da parte del governo o altri enti
note: nessuno
in scheme: Subject Code
created: 2004-10-13T12:00:00+00:00
modified: 2012-07-10T12:00:00+00:00
broader: Politica interna

Inchieste su Utilità pubblica
type: Concept
preferred label: Enquête d'utilité publique @fr
preferred label: investigações de planeamento @pt-pt
preferred label: Planfeststellungsverfahren @de
preferred label: investigações de planejamento @pt-br
preferred label: planning inquiries @en-gb
preferred label: investigaciones del planeamiento @es
preferred label: 公聴会 @ja-jp
definition: Public hearings or planning inquiries on proposed constructions, e.g. Construction of water driven power station in a National Park. @en-gb
definition: Enquête pour déterminer l'utilité publique de travaux d'aménagement @fr
definition: Audiencias públicas o investigaciones del planeamiento acerca de las construcciones propuestas, ej. la construcción de una central eléctrica en las aguas en un parque nacional. @es
definition: Audiências públicas ou investigações de planeamento sobre construções propostas, como a construção de uma central elétrica em um parque nacional. @pt-br
definition: 国立公園内に水力発電所を建設するというような、建設物の提案に対して開かれる公聴会または計画的な審理 @ja-jp
definition: Öffentliche Anhörungen oder Planverfahren über beabsichtigte Bauvorhaben, wie z.B. der Bau eines Wasserkraftwerkes in einem Nationalpark. @de
definition: Inchieste o Assemblee per valutare l'utilità pubblica o meno riguardo lavori di interesse pubblico
definition: Audições ou inquéritos públicos sobre propostas de obras públicas, como a construção de uma central elétrica num parque nacional. @pt-pt
note: nessuno
in scheme: Subject Code
created: 2004-10-13T12:00:00+00:00
modified: 2012-07-10T12:00:00+00:00
broader: Politica interna

Sistemi politici
type: Concept
preferred label: Systèmes politiques @fr
preferred label: sistemas políticos @pt-br
preferred label: 政治制度 @ja-jp
preferred label: political systems @en-gb
preferred label: Politisches System @de
definition: Système d'organisation politique @fr
definition: Sistemas desenvolvidos para a organização do governo. @pt-pt
definition: 政府に規律を規定するよう計画されたシステム @ja-jp
definition: Sistemi d'organizzazione politica
definition: Sistema diseñado para brindar orden al gobierno. @es
definition: Systeme, die geschaffen sind um der Regierung ein Regelwerk zur Verfügung zu stellen. @de
definition: Systems designed to provide order to government @en-gb
note: nessuno
in scheme: Subject Code
created: 2003-04-05T12:00:00+00:00
modified: 2012-07-10T12:00:00+00:00
broader: Politica (generico)

Democrazia
type: Concept
preferred label: democracia @pt-br
preferred label: democracy @en-gb
preferred label: 民主主義 @ja-jp
preferred label: Démocratie @fr
preferred label: Demokratie @de
definition: Regierung, in der entweder die Menschen die direkte Macht innehaben, oder durch gewählte Vertreter. @de
definition: Governo no qual o povo detém o poder de maneira direta ou por meio de representantes governamentais eleitos. @pt-pt
definition: Forma di governo in cui la sovranità è esercitata direttamente dal popolo o da suoi rappresentanti da esso eletti
definition: 国民が直接か、あるいは選出した公務員を通して力を持つ政権 @ja-jp
definition: Régime politique ou la souveraineté est exercée par le peuple soit directement soit par l'intermédiaire de ses représentants élus @fr
definition: Gobierno en el cual el pueblo tiene el poder de manera directa, o por medio de funcionarios de gobierno elegidos. @es
definition: Government in which the people hold the power either directly, or through elected officials. @en-gb
note: nessuno
in scheme: Subject Code
created: 2003-04-05T12:00:00+00:00
modified: 2012-07-10T12:00:00+00:00
broader: Politica (generico)

Sviluppo politico
type: Concept
preferred label: political development @en-gb
preferred label: desarrollo político @es
preferred label: 政治史 @ja-jp
preferred label: desenvolvimento político @pt-pt
preferred label: Histoire politique @fr
preferred label: Politikgeschichte @de
definition: The creation and rise of political systems and the history of the people and nations that are associated with those systems. @en-gb
definition: La creación o nacimiento de sistemas políticos en la historial de los pueblos y naciones y que estan asociados a esos sistemas. @es
definition: 政治的な仕組みの創造や隆盛、およびそれらの仕組みに関連した人々や国家の歴史 @ja-jp
definition: La création et l'évolution des sytèmes politiques et l'histoire des peuples et des nations vivant sous ces systèmes @fr
definition: Criação e evolução de sistemas políticos e a história dos povos e nações que estão associados a esses sistemas. @pt-pt
definition: Nascita e crescita di sistemi politici e storia delle nazioni che sono associate a quei sistemi
definition: Entstehung und Entwicklung politischer Systeme und die Geschichte der Menschen und Nationen, die mit diesen in Zusammenhang stehen. @de
note: nessuno
in scheme: Subject Code
created: 2004-04-22T12:00:00+00:00
modified: 2012-07-10T12:00:00+00:00
broader: Politica (generico)

Religioni, Fedi
type: Concept
preferred label: religión y credos @es
preferred label: religião @pt-br
preferred label: 宗教・思想 @ja-jp
preferred label: Religion et croyance @fr
preferred label: religion and belief @en-gb
preferred label: Religion, Weltanschauung @de
definition: Todos los aspectos de la existencia humana que involucran teología, filosofía, ética y espiritualidad. @es
definition: All aspects of human existence involving theology, philosophy, ethics and spirituality. @en-gb
definition: Alle Aspekte des menschlichen Lebens, die Religion, Philosophie, Ethik und Spiritualität beinhalten. @de
definition: 神学、哲学、倫理学、および精神に関係する、人間生活のあらゆる面 @ja-jp
definition: Ensemble des croyances, des dogmes relatifs à la théologie, la philosophie, l'éthique et la spiritualité @fr
definition: Todos os aspectos da existência humana que envolvem teologia, filosofia, ética e espiritualidade. @pt-br
definition: Insieme dei dogmi, dei riti, delle credenze e delle tradizioni riguardanti la teologia, filosofia, etica e spiritualità.
definition: Todos os aspetos da existência humana que envolvem teologia, filosofia, ética e espiritualidade. @pt-pt
note: nessuno
in scheme: Subject Code
created: 2000-10-30T12:00:00+00:00
modified: 2010-12-15T17:01:09+00:00
narrower: Culti, Sette
narrower: Credo
narrower: Massoneria
narrower: Religioni - ANNULLATO
narrower: Chiese - ANNULLATO
narrower: Principi morali
narrower: Rapporti Stato/Chiesa
narrower: Filosofia
narrower: Chiese Cristiane
narrower: Islam
narrower: Ebraismo
narrower: Buddismo
narrower: Induismo
narrower: Festività religiose
narrower: Leader religiosi
narrower: Religione naturale
narrower: Taoismo
narrower: Scintoismo
narrower: Sikismo
narrower: Giainismo
narrower: Parsi
narrower: Confucianesimo
narrower: Testi Religiosi
narrower: Dialogo interreligioso
narrower: Evento religioso
narrower: Concordato
narrower: Ecumenismo

Culti, Sette
type: Concept
preferred label: cultos e seitas @pt-br
preferred label: cult and sect @en-gb
preferred label: カルト @ja-jp
preferred label: Cultes et sectes @fr
preferred label: cultos y sectas @es
preferred label: Kult, Sekte @de
definition: Offshoots of established religious bodies, or small narrow-focused group promulgated by one or two individuals @en-gb
definition: Ramificación de cuerpos religiosos establecidos o grope pequeño promulgado por uno o dos individuos. @es
definition: Varianti o derivazioni da corpi religiosi principali, comunità di minore entità o organizzazioni che seguono le indicazioni di una loro guida
definition: 正統派の宗教団体からの分派、あるいは一人か二人の人物によって導かれる視野の狭い小団体 @ja-jp
definition: Ramificações de corpos religiosos estabelecidos ou grupo ideológico e místico promulgado por um ou dois indivíduos. @pt-pt
definition: Randerscheinungen von anerkannten religiösen Einheiten, oder kleine eng konzentrierte Gruppen, verbreitet durch ein oder zwei Einzelpersonen. @de
definition: Ramification d'une religion établie et/ou groupe idéologique et mystique vivant souvent en communauté et sous l'influence d'un guide @fr
note: nessuno
in scheme: Subject Code
created: 2000-10-30T12:00:00+00:00
modified: 2010-12-15T17:01:09+00:00
broader: Religioni, Fedi

Credo
type: Concept
preferred label: Glaube @de
preferred label: 信仰 @ja-jp
preferred label: crenças e fé @pt-pt
preferred label: credo (fe) @es
preferred label: belief (faith) @en-gb
preferred label: Croyances @fr
definition: Crenças estabelecidas da religião de um indivíduo. @pt-br
definition: Anerkannte Glaubensinhalte der Religion einzelner. @de
definition: それぞれの宗教の確立した信仰 @ja-jp
definition: Adhésion de l'esprit à une vérité révélée @fr
definition: The established beliefs of an individuals religion @en-gb
definition: Verità rivelata da una religione ai suoi fedeli
definition: Las creencias establecidas por las religiones de los individuos. @es
note: replaced *censorship* in V12, added as new Topic in V13 @fr
note: nessuno
in scheme: Subject Code
created: 2000-10-30T12:00:00+00:00
modified: 2010-12-15T17:01:09+00:00
broader: Religioni, Fedi
narrower: Chiesa dell'Unificazione
narrower: サイエントロジー

Massoneria
type: Concept
preferred label: Freimaurer @de
preferred label: freemasonry @en-gb
preferred label: フリーメーソン @ja-jp
preferred label: maçonaria @pt-pt
preferred label: Franc-maçonnerie @fr
preferred label: masonería @es
definition: Sociedade secreta internacional baseada nos princípios de irmandade, caridade e ajuda mútua. @pt-pt
definition: Eine geheime internationale Gemeinschaft, die auf den Prinzipien von Brüderlichkeit, Wohltätigkeit und gegenseitiger Hilfe basiert. @de
definition: Una sociedad secreta internacional basada en los principios de la hermandad, caridad y ayuda mutua. @es
definition: Sociétés autrefois secrètes, aux ramifications internationales, formées de personnes qu'unit un idéal de fraternité, de charité et de solidarité et qui pratiquent des rites symboliques @fr
definition: Società iniziatica con un'organizzazione internazionale i cui affiliati condividono gli stessi ideali nel perseguimento dei principi di amore fraterno, soccorso e verità
definition: 教団原理と、寄付、相互扶助をベースにした国際的秘密結社 @ja-jp
definition: A secret international society based on the principles of brotherhood, charity and mutual aid @en-gb
note: nessuno
in scheme: Subject Code
created: 2000-10-30T12:00:00+00:00
modified: 2010-12-15T17:01:09+00:00
broader: Religioni, Fedi

Religioni - ANNULLATO
type: Concept
preferred label: religiones-ANULADO @es
preferred label: religião-INATIVO @pt-br
preferred label: religion-DEPRECATED @en-gb
preferred label: Religion-GELÖSCHT @de
preferred label: Religion-DEPRECATED @fr
preferred label: 宗教団体-使用不可 @ja-jp
definition: 確定した信仰制度を備えた確立した神学 @ja-jp
definition: INATIVO-Teologias estabelecidas com sistemas de crenças fixos. @pt-pt
definition: ANULADO @es
definition: Insieme delle credenze, dogmi, pratiche cultuali alla base del rapporto dell'uomo con la rivelazione divina
definition: NA @en-gb
definition: Ensemble des croyances, des dogmes et des pratiques cultuelles régissant les rapports de l'homme avec la puissance divine ou les puissances surnaturelles @fr
definition: --- @de
note: Hier gelöscht, Unterbegriffe zu anderen Hauptbegriffen verschoben @de
note: SubjectMatter deprecated, SubjectDetails moved to other SubjectMatter @es
note: SubjectMatter ANNULLATO, SubjectDetails spostato ad altro SubjectMatter
in scheme: Subject Code
created: 2003-04-05T12:00:00+00:00
retired: 2004-08-27T00:00:00+00:00
modified: 2012-07-10T12:00:00+00:00
broader: Religioni, Fedi
narrower: Cristiana - ANNULLATO
narrower: Islamica - ANNULLATO
narrower: Ebraica - ANNULLATO
narrower: Buddista - ANNULLATO
narrower: Induista - ANNULLATO

Chiese - ANNULLATO
type: Concept
preferred label: Kirche-GELÖSCHT @de
preferred label: igreja (organização)-INATIVO @pt-br
preferred label: église-DEPRECATED @fr
preferred label: 教会(組織)-使用不可 @ja-jp
preferred label: inglesia (organización) cancelado @es
preferred label: church (organisation)-DEPRECATED @en-gb
definition: NA @en-gb
definition: ANULADO @es
definition: Edifici consacrati al culto divino per i cristiani
definition: Edifice consacré au culte divin pour les chrétiens @fr
definition: --- @de
definition: INATIVO-Edifício geralmente identificado como lugar de culto da religião cristã. @pt-pt
definition: 概してキリスト教を崇拝する場所として同一視できる建物 @ja-jp
note: moved to 12000001/SubjectQualifier @es
note: SubjectMatter deprecated, SubjectDetails moved to other SubjectMatter @fr
note: spostato in 12000001 SubjectQualifier
note: Verschoben als 12000001/SubjectQualifier @de
in scheme: Subject Code
created: 2000-10-30T12:00:00+00:00
retired: 2004-08-27T00:00:00+00:00
modified: 2010-12-15T17:01:09+00:00
broader: Religioni, Fedi
narrower: Edifici Religiosi - ANNULLATO

Principi morali
type: Concept
preferred label: valores @pt-pt
preferred label: Valeurs @fr
preferred label: values @en-gb
preferred label: 価値観 @ja-jp
preferred label: Wertvorstellung @de
definition: Níveis pessoais de conduta social. @pt-pt
definition: Niveles personales de conducta social. @es
definition: Persönliche Stufen sozialen Verhaltens. @de
definition: 社会行動の個人的なレベル @ja-jp
definition: Principes, idéaux de référence, qui guident une conduite @fr
definition: Principi, ideali di riferimento, convinzioni che guidano l'esistenza dell'individuo
definition: Personal levels of social behaviour @en-gb
note: moved to 12010000 @fr
note: nessuno
in scheme: Subject Code
created: 2000-10-30T12:00:00+00:00
modified: 2010-12-15T17:01:09+00:00
broader: Religioni, Fedi
narrower: Etica
narrower: Comportamenti Immorali

Rapporti Stato/Chiesa
type: Concept
preferred label: Beziehung Kirche und Staat @de
preferred label: estado e igreja (relação) @pt-br
preferred label: 政教分離 @ja-jp
preferred label: división entre religión y estado @es
preferred label: church and state relations @en-gb
preferred label: Relations entre l'église et l'Etat @fr
definition: Trennung von Kirche und Staat. @de
definition: Divisão legal e social entre instituições religiosas e assuntos de estado. @pt-br
definition: División social y legal entre instituciones religiosas y asuntos de estado. @es
definition: 宗教団体と国家との間の法律上や社会的な区分 @ja-jp
definition: Les lois régissant les rapports entre les institutions religieuses et l'état @fr
definition: Norme che regolano i rapporti fra lo Stato e la Chiesa e fra le istituzioni laiche dello stato e quelle religiose
definition: The legal and social division between religious institutions and the affairs of state @en-gb
note: moved to 12013000 @fr
note: nessuno
in scheme: Subject Code
created: 2003-04-05T12:00:00+00:00
modified: 2012-07-10T12:00:00+00:00
broader: Religioni, Fedi

Filosofia
type: Concept
preferred label: Philosophie @fr
preferred label: filosofía @es
preferred label: filosofia @pt-pt
preferred label: philosophy @en-gb
preferred label: 哲学 @ja-jp
preferred label: Weltanschauung @de
definition: 世の中が機能する方法についての様々な考え @ja-jp
definition: Les différentes doctrines qui se proposent d'organiser les connaissances en un système cohérent @fr
definition: Verschiedene Gedanken, über die Art und Weise, wie die Welt funktioniert. @de
definition: Different thoughts about the way the world works @en-gb
definition: Diferentes doutrinas sobre a forma como o mundo funciona. @pt-pt
definition: Distintos pensamientos acerca de cómo el mundo de trabaja. @es
definition: Studio del significato della conoscenza del mondo e del trascendente
note: moved to 12000001/SubjectQualifier @fr
note: nessuno
in scheme: Subject Code
created: 2003-04-05T12:00:00+00:00
modified: 2012-07-10T12:00:00+00:00
broader: Religioni, Fedi

Chiese Cristiane
type: Concept
preferred label: Christianisme @fr
preferred label: キリスト教 @ja-jp
preferred label: cristianismo @es
preferred label: christianity @en-gb
preferred label: Christentum @de
definition: Le chiese che hanno posto l'insegnamento di Gesù Cristo al centro del loro credo
definition: Aqueles que usam Jesus Cristo e os seus ensinamentos como centro da sua crença religiosa. @pt-pt
definition: Menschen, die Jesus Christus und seine Lehren als das Zentrum ihres Glaubens sehen. @de
definition: Aqueles que usam Jesus Cristo e seus ensinamentos como centro de sua crença religiosa. @pt-br
definition: Aquellos que utilizan a Jesucristo y sus enseñanzas como centro de su s creencias. @es
definition: Les disciples de Jésus Christ @fr
definition: Those that use Jesus Christ and his teachings as their centre of belief @en-gb
definition: イエスキリストとその教えを信仰の中心とする人たち @ja-jp
note: spostato da 12004001
note: moved from 12004001 @en-gb
note: Hierher verschoben von 12004001 @de
note: moved to 12000002/SubjectQualifier @fr
in scheme: Subject Code
created: 2000-10-30T12:00:00+00:00
modified: 2010-12-15T17:01:09+00:00
broader: Religioni, Fedi
narrower: Protestante
narrower: Luterana
narrower: Riformata
narrower: Anglicana
narrower: Metodista
narrower: Battista
narrower: Mennonita
narrower: Mormone
narrower: Cattolico Romana
narrower: Veterocattolica
narrower: Ortodossa
narrower: Esercito Salvezza

Islam
type: Concept
preferred label: islão @pt-pt
preferred label: islã @pt-br
preferred label: islam @en-gb
preferred label: イスラム教 @ja-jp
definition: Religion fondée par le prophète arabe Mahomet au 7e siècle @fr
definition: Aqueles que usam Alá e seus ensinamentos como centro de sua crença religiosa. @pt-br
definition: Aqueles que usam Alá e os seus ensinamentos como centro da sua crença religiosa. @pt-pt
definition: Religione che pone al centro della sua fede l'insegnamento di Allah, fondata dal profeta Maometto
definition: Those who use Allah and his teachings as their centre of belief @en-gb
definition: Aquellos que utilizan las enseñanzas de Alá como centro de sus creencias. @es
definition: アラーとその教えを信仰の中心とする人たち @ja-jp
definition: Diejenigen die Allah und seine Lehren als Zentrum ihres Glaubens betrachten. @de
note: Hierher verschoben von 12004002 @de
note: moved from 12004002 @en-gb
note: spostato da 12004002
in scheme: Subject Code
created: 2004-08-27T12:00:00+00:00
modified: 2012-07-10T12:00:00+00:00
broader: Religioni, Fedi

Ebraismo
type: Concept
preferred label: ユダヤ教 @ja-jp
preferred label: judaísmo @pt-br
preferred label: Judentum @de
preferred label: Judaïsme @fr
preferred label: judaism @en-gb
definition: 経典やタルムードに書かれた、メシヤの処女降誕を含む信念に基づいて、唯一神を信じているグループ @ja-jp
definition: Grupo que cree en un dios, basando sus creencias en escrituras y en el Talmud, incluyendo la venida del segundo Mesías. @es
definition: A group believing in one god, basing their beliefs on written scriptures and the Talmud, including the first coming of the Messiah @en-gb
definition: Grupo que acredita em um só deus, baseando suas crenças nas escrituras e no Talmude, incluindo a primeira vinda do Messias. @pt-br
definition: Religion des juifs et première des grandes religions monothéistes qui a pour fondement l'Alliance inaugurée par Dieu avec le prophète Abraham et la Loi (Torah) donnée à Moïse. @fr
definition: Eine Gruppe, die an einen Gott glaubt, deren Glauben auf den geschriebene heiligen Schriften und dem Talmud beruht, die das erste Erscheinen des Messias beinhalten. @de
definition: Grupo que acredita em um só deus, baseando as suas crenças nas escrituras e no Talmude, incluindo a primeira vinda do Messias. @pt-pt
definition: Religione che vede il suo fondamento nell'alleanza voluta da Dio con il profeta Abramo e pone al centro della sua fede le sacre scritture e il Talmud
note: moved from 12004003 @es
note: spostato da 12004003
note: Hierher verschoben von 12004003 @de
in scheme: Subject Code
created: 2004-08-27T12:00:00+00:00
modified: 2012-07-10T12:00:00+00:00
broader: Religioni, Fedi

Buddismo
type: Concept
preferred label: budismo @pt-pt
preferred label: Bouddhisme @fr
preferred label: 仏教 @ja-jp
preferred label: buddhism @en-gb
preferred label: Buddhismus @de
definition: Principale religione asiatica fondata da Budda nel VI secolo a.C. in India
definition: Importante religião asiática fundada por Buda (Siddhartha Gautama) no séc. VI, na Índia, que prega que o bom uso da razão e a abnegação conduzem a um estado divino sem desejo. @pt-pt
definition: Eine verbreitete asiatische Religion, gegründet von Buddha im 6ten Jahrhundert vor Christus in Indien, die verkündet, dass richtiges Denken und Selbstverleugnung in einen göttlichen Geisteszustand frei von Wünschen führt. @de
definition: Religion originaire de l'Inde prêchée au 6ème siècle par le Bouddha selon laquelle le sage doit anéantir en lui le désir pour atteindre le nirvana. @fr
definition: インドで紀元前6世紀に仏陀によって設立された主要なアジアの宗教で、正しい思考と自制は、欲望のない神の状態へと導くであろうことを説いている @ja-jp
definition: A major Asian religion founded by Buddha in the 6th century BC in India and preaching that right thinking and self denial will lead to a divine state without desire @en-gb
definition: Importante religião asiática fundada por Buda no séc. VI, na Índia, que prega que o bom uso da razão e a abnegação conduzem a um estado divino sem desejo. @pt-br
definition: El mayor grupo religio de Asia, fundado por Buda en el sigle 6 antes de Cristo en la India, y que predica que pensar correctamente y auto controlarce llevará a un estado de divinidad sin deseo. @es
note: moved from 12004004 @es
note: Hierher verschoben von 12004004 @de
note: spostato da 12004004
in scheme: Subject Code
created: 2004-08-27T12:00:00+00:00
modified: 2012-07-10T12:00:00+00:00
broader: Religioni, Fedi

Induismo
type: Concept
preferred label: hinduísmo @pt-br
preferred label: hinduism @en-gb
preferred label: ヒンズー教 @ja-jp
preferred label: hinduismo @es
preferred label: Hindouisme @fr
preferred label: Hinduismus @de
definition: A religious and social system, believing in a caste system with the Brahmans the highest and untouchables the lowest. @en-gb
definition: Ein religiöses und soziales System, Glaube an ein Kastensystem, in dem der Brahmane die Höchste und die Unberührbahren die niedrigste Stufe darstellen. @de
definition: 宗教的、社会的な制度で、バラモンの地位が最も高く、不可触民の地位が最も低いとするカースト制度を信じる @ja-jp
definition: Religione e sistema sociale che crede nel sistema delle caste con i Bramini nella più alta e gli intoccabili nella più bassa
definition: Sistema religioso e social que acredita numa organização da sociedade por castas, dos brâmanes (a casta mais alta) aos intocáveis (a casta mais baixa). @pt-pt
definition: Sistema religioso e social que acredita em uma organização da sociedade por castas, dos brâmanes (a casta mais alta) aos intocáveis (a casta mais baixa). @pt-br
definition: Un sistema religioso y social que cree en la castidad con el brahmanismo como lo más alto y los intocables como lo más bajo. @es
definition: Ensemble de courants religieux reposant notamment sur une organisation sociale en système de castes, des intouchables (la plus basse) aux Brahmanes (la plus haute) @fr
note: moved from 12004005 @en-gb
note: Hierher verschoben von 12004005 @de
note: spostato da 12004005
in scheme: Subject Code
created: 2004-08-27T12:00:00+00:00
modified: 2012-07-10T12:00:00+00:00
broader: Religioni, Fedi

Festività religiose
type: Concept
preferred label: Religiöses Fest oder Feiertag @de
preferred label: festivales o festivades religiosas @es
preferred label: religious festival or holiday @en-gb
preferred label: festas e feriados religiosos @pt-pt
preferred label: 宗教祭・祭日 @ja-jp
preferred label: Fête religieuse @fr
definition: Giorno sacro o comunque di osservanza di un dato precetto che talvolta corrisponde anche ad un giorno festivo
definition: Holy day or day of observance in a religion which sometimes is a public holiday as well @en-gb
definition: Dia festivo ou dia de prática religiosa que por vezes também é um feriado público. @pt-br
definition: 時には公休日となる祝祭日、または宗教上の祝いの日 @ja-jp
definition: Jour de fête religieuse ou de rite particulier dans une religion, parfois un jour férié @fr
definition: Días festivo o dia de práctica religiosa el cual a veces es un día festivo público. @es
definition: Feiertag oder religiöser Anlass, der manchmal auch ein öffentlicher Feiertag ist. @de
note: nessuno
in scheme: Subject Code
created: 2004-08-27T12:00:00+00:00
modified: 2012-07-10T12:00:00+00:00
broader: Religioni, Fedi
narrower: Natale
narrower: Pasqua
narrower: Pentecoste
narrower: Ramadan
narrower: Yom Kippur

Leader religiosi
type: Concept
preferred label: líder religioso @es
preferred label: Religiöses Oberhaupt @de
preferred label: líderes religiosos @pt-pt
preferred label: Chefs religieux @fr
preferred label: 宗教指導者 @ja-jp
preferred label: religious leader @en-gb
definition: それぞれの教会や宗教において、儀式の上で、または、宗法上、もしくはその他の指導的役割を持つ人物ないしはその一団 @ja-jp
definition: Person or persons who have a ritual, juridical or otherwise leading role in their respective church or religion @en-gb
definition: Personnes qui exercent un rôle de leader sur le plan rituel et/ou juridique dans une religion donnée @fr
definition: Pessoa ou pessoas que têm um papel de liderança ritual, judicial nas suas respetivas igrejas ou religiões. @pt-pt
definition: Person oder Personen, die eine rituelle oder führende Rolle in ihrer jeweiligen Religion oder Kirche haben. @de
definition: Persona o personas que tienen un rol de liderazgo ritual o judicial en sus respectivas iglesias o religiones. @es
definition: Pessoa ou pessoas que têm um papel de liderança ritual, judicial em suas respectivas igrejas ou religiões. @pt-br
definition: Chi ricopre un ruolo di leader rituale, giuridico, spirituale o di altro genere nella propria fede o religione
note: nessuno
in scheme: Subject Code
created: 2004-08-27T12:00:00+00:00
modified: 2012-07-10T12:00:00+00:00
broader: Religioni, Fedi
narrower: Papa

Religione naturale
type: Concept
preferred label: 自然宗教 @ja-jp
preferred label: Naturreligion @de
preferred label: Animisme @fr
preferred label: religião natural @pt-br
preferred label: nature religion @en-gb
preferred label: religión natural @es
definition: Adoração de elementos naturais como fogo, água, árvores, montanhas, etc. @pt-br
definition: Adoración de elementos naturales como fuego, agua, árboles y montañas. @es
definition: Worship of natural elements like fire, water, trees, mountains @en-gb
definition: Verehrung von Naturelementen wie Feuer, Wasser, Bäume, Berge. @de
definition: Culte des éléments naturels comme le feu, l'eau, les arbres, les montagnes @fr
definition: 火や水、木々、山などの自然の要素を崇拝すること @ja-jp
definition: Culto degli elementi naturali come fuoco, acqua, alberi, montagne; Animismo
note: nessuno
in scheme: Subject Code
created: 2004-08-27T12:00:00+00:00
modified: 2012-07-10T12:00:00+00:00
broader: Religioni, Fedi

Taoismo
type: Concept
preferred label: taoismo @es
preferred label: Taoismus @de
preferred label: Taoïsme @fr
preferred label: 道教 @ja-jp
preferred label: taoism @en-gb
definition: Tradição indígena religiosa e filosófica que molda a cultura chinesa há mais de 2000 anos. @pt-br
definition: Tradição religiosa e filosófica que molda a cultura chinesa há mais de 2000 anos. @pt-pt
definition: Indigenous religio-philosophical tradition that has shaped Chinese life for more than 2000 years @en-gb
definition: 2000年以上に渡って中国人の生活を形成してきた、固有の宗教哲学的な伝統 @ja-jp
definition: Religion et tradition philosophique originaire de Chine voici plus de 2000 ans @fr
definition: Tradizione filosofico-religiosa originaria della Cina
definition: Tradición indigena reliosa/filosófica que ha formado la vida cultura de China por mas de 2000 años. @es
definition: Ursprüngliche chinesische religiöse und philosophische Tradition, die seit mehr als 2000 Jahren das chinesische Leben beeinflusst. @de
note: nessuno
in scheme: Subject Code
created: 2004-08-27T12:00:00+00:00
modified: 2012-07-10T12:00:00+00:00
broader: Religioni, Fedi

Scintoismo
type: Concept
preferred label: Schintoismus @de
preferred label: shintoismo @es
preferred label: shintoism @en-gb
preferred label: Shintoïsme @fr
preferred label: xintoísmo @pt-br
preferred label: 神道 @ja-jp
definition: *Crenças e práticas religiosas indígenas do Japão. A palavra **shinto** (xintó, caminho dos deuses) foi adotada para diferenciar as crenças indígenas japonesas do budismo.* @pt-br
definition: 日本固有の宗教的信仰や習慣。神道という単語は日本固有の信仰と仏教を区別するために使用されるようになった @ja-jp
definition: Creencia religiosa indigena practicada en Japón. La palabra Shinto fue adoptada en orden a diferenciar creencias indígenas japonesas del Budismo. @es
definition: Ursprünglicher religiöser praktizierter Glaube in Japan. Die Bezeichnung Shinto wurde eingeführt um den ursprünglichen japanischen Glauben vom Buddhismus zu trennen. @de
definition: Tradition et pratique religieuse autochtone du Japon @fr
definition: Tradizione e pratica religiosa originaria del Giappone.
definition: Indigenous religious beliefs and practices of Japan. The word Shinto came into use in order to distinguish indigenous Japanese beliefs from Buddhism. @en-gb
note: nessuno
in scheme: Subject Code
created: 2004-08-27T12:00:00+00:00
modified: 2012-07-10T12:00:00+00:00
broader: Religioni, Fedi

Sikismo
type: Concept
preferred label: sikhism @en-gb
preferred label: siquismo @pt-pt
preferred label: Sikhismus @de
preferred label: sikhismo @es
preferred label: Sikhisme @fr
preferred label: シーク教 @ja-jp
definition: The religion of an Indian group, combining Hindu and Islamic elements, founded in the Punjab (or Panjab) in the late 15th century AD by Guru Nanak. @en-gb
definition: Groupe religieux indien, combinant des éléments hindous et islamiques, fondé au Punjab au 15e siècle @fr
definition: Religião de um grupo indiano, combinando elementos hindus e islâmicos, fundada no Punjab (ou Panjab) no final do séc. XV por Guru Nanak. @pt-pt
definition: Religião de um grupo índio, combinando elementos hindus e islâmicos, fundada no Punjab (ou Panjab) no final do séc. XV por Guru Nanak. @pt-br
definition: Tradizione religiosa indiana che combina elementi Indu e Islamici, fondata nel Punjab alla fine del XV secolo
definition: 導師(グル)ナーナクによって15世紀終わりにインド北西部のパンジャブ地域で設立された、ヒンドゥー教とイスラム教の要素を併せ持つ、インドの宗教 @ja-jp
definition: La Religión de un grupo indio, combinando Hinduismo y elementos Islámicos, fundada en el Punjab (o Panjab), al final del siglo 15 DC, por el Guru Nanak. @es
definition: Religion einer indischen Gruppe, die Hinduismus und islamische Elemente verbindet, die in Punjab entdeckt wurde im späten 15. Jahrhundert von Guru Nanak. @de
note: nessuno
in scheme: Subject Code
created: 2004-08-27T12:00:00+00:00
modified: 2012-07-10T12:00:00+00:00
broader: Religioni, Fedi

Giainismo
type: Concept
preferred label: jainismo @es
preferred label: Jainismus @de
preferred label: jainism @en-gb
preferred label: Jaïnisme @fr
preferred label: ジャイナ教 @ja-jp
definition: Religião da Índia que ensina o caminho para a pureza e a iluminação espirituais através de um modo de vida disciplinado fundado na tradição de ahimsa, não violência para todas as criaturas vivas. Teve origem nos séculos VII-V A.C. @pt-pt
definition: Una religión de la India que enseña los caminos de pureza espiritual y direcciones a través de un modo disciplinado de vida fundado bajo la tradición de ahimsa, no violencia, para todos los seres vivientes. Comenzpo en los siglos Séptimo y Quinto AC. @es
definition: Eine indische Religion, die einen Weg lehrt zu spiritueller Reinheit und Erleuchtung, durch einen disziplinierten Lebensstil auf der Tradition von Gewaltlosigkeit gegenüber allen Lebewesen. Begann im 7.-5. Jahrhundert vor Christus. @de
definition: 精神的純粋さへの道を教え、すべての生き物を殺さないというアヒームサのしきたりを悟るため、戒律ある生活様式を貫くことを啓蒙するインドの宗教。紀元前7-5世紀に始まった @ja-jp
definition: Religion indienne qui prône un chemin spirituel basé notamment sur les concepts de non-violence et d'ascétisme. @fr
definition: Religione dell'India che insegna un cammino spirituale basato sostanzialmente sui concetti di non violenza e di ascetismo. La sua origine risale al VII-V secolo a.C.
definition: A religion of India that teaches a path to spiritual purity and enlightenment through a disciplined mode of life founded upon the tradition of ahimsa, non-violence to all living creatures. It began in the 7th-5th century BC. @en-gb
note: nessuno
in scheme: Subject Code
created: 2004-08-27T12:00:00+00:00
modified: 2012-07-10T12:00:00+00:00
broader: Religioni, Fedi

Parsi
type: Concept
preferred label: parsismo @pt-pt
preferred label: Zoroastrismus @de
preferred label: Parsasm @fr
preferred label: パルシー教 @ja-jp
preferred label: parsasm @en-gb
definition: Religion indienne des partisans du prophète iranien Zoroastre @fr
definition: Religión de la India que sigue al profeta iraní Zoroaster, principalmente en Bombay, pero tambien en karachi, Paquistan. @es
definition: イランの予言者ゾロアスターが受け継いだインドの宗教。主にボンベイやカラチ(パキスタン)で広まった @ja-jp
definition: Religione dell'India che segue il profeta iraniano Zoroaster, principalmente a Bombay, ma anche a Karachi (Pakistan)
definition: A religion in India following the Iranian prophet Zoroaster, mainly in Bombay, but also in Karachi (Pakistan). @en-gb
definition: Religião da Índia que segue o profeta iraniano Zoroastro, ou Zaratustra, sobretudo em Bombaim, mas também em Carachi (Paquistão). @pt-pt
definition: Religião da Índia que segue o profeta iraniano Zoroastro, ou Zaratustra, sobretudo em Bombaim, mas também em Karachi (Paquistão). @pt-br
definition: Eine indische Religion, die der Lehre von Zarathustra folgt, meistens in Bombay, aber auch in (Karachi) Pakistan. @de
note: nessuno
in scheme: Subject Code
created: 2004-08-27T12:00:00+00:00
modified: 2012-07-10T12:00:00+00:00
broader: Religioni, Fedi

Confucianesimo
type: Concept
preferred label: Konfuzianismus @de
preferred label: confucianism @en-gb
preferred label: 儒教 @ja-jp
preferred label: confucionismo @pt-pt
preferred label: Confucianisme @fr
preferred label: confucismo. @es
definition: Doutrina de vida propagada por Confúcio no séc. VI-V A.C. e seguida pelo povo chinês por mais de 2000 anos. Sua influência se estendeu até a Coreia, Japão e Vietnã. @pt-br
definition: Philosophie, éthique et politique basée sur les enseignements du sage chinois Confucius @fr
definition: Insegnamento di vita e filosofico, etico e politico derivato dal saggio cinese Confucio (VI-V secolo a.C.).
definition: 紀元前6-5世紀頃、孔子によって広められ、2000年以上に渡って中国人に受け継がれてきた生き方。その影響は朝鮮、日本およびベトナムにまで及んだ @ja-jp
definition: The way of life propagated by Confucius in the 6th-5th century BC and followed by the Chinese people for more than 2000 years. Its influence has extended to Korea, Japan, and Vietnam. @en-gb
definition: Der Weg des Lebens, der durch Konfuzius propagiert wurde im 6.-5. Jahrhundert vor Christus und den die chinesische Bevölkerung seit mehr als 2000 Jahren befolgt. Die Einflüsse haben sich ausgedehnt nach Korea, Japan und Vietnam. @de
definition: Doutrina de vida propagada por Confúcio no séc. VI-V A.C. e seguida pelo povo chinês há mais de 2000 anos. A sua influência estendeu-se até à Coreia, Japão e Vietname. @pt-pt
definition: La forma de vida propagada por Confucios en los siglos sexto y quinto AC, y seguida por el prueblo de China por más de 2000 años. Sus influencias se extendieron hasta Corea, Japón y Vietnam. @es
note: nessuno
in scheme: Subject Code
created: 2004-08-27T12:00:00+00:00
modified: 2012-07-10T12:00:00+00:00
broader: Religioni, Fedi

Testi Religiosi
type: Concept
preferred label: textos religiosos @pt-pt
preferred label: Textes religieux @fr
preferred label: religious text @en-gb
preferred label: 聖典 @ja-jp
preferred label: Religiöse Schrift @de
definition: 教会もしくは宗教にとって神聖あるいは重要な聖典 @ja-jp
definition: Escrituras Sagradas o importantes para una iglesia o religión @es
definition: Schriften die heilig oder wichtig für eine Kirche oder Religion sind. @de
definition: Testi sacri che sono fondamento o comunque importanti per una chiesa o religione
definition: Escrituras sagradas ou importantes para uma igreja ou religião. @pt-br
definition: Textes sacrés ou importants pour une religion @fr
definition: Scriptures holy or important for a church or religion @en-gb
note: nessuno
in scheme: Subject Code
created: 2004-08-27T12:00:00+00:00
modified: 2012-07-10T12:00:00+00:00
broader: Religioni, Fedi
narrower: Bibbia
narrower: Corano
narrower: ユダヤ聖典

Dialogo interreligioso
type: Concept
preferred label: 宗教間の対話 @ja-jp
preferred label: diálogo inter-religioso @pt-pt
preferred label: interreligious dialogue @en-gb
preferred label: dialogo inter-religoso @es
preferred label: Dialogue interreligieux @fr
preferred label: Interreligiöser Dialog @de
definition: Beziehungen zwischen verschiedenen Religionen. @de
definition: Qualquer forma de comunicação entre religiões. @pt-pt
definition: Any form of communication between religions @en-gb
definition: Ogni forma di comunicazione tra le diverse religioni
definition: あらゆる形式の宗教間の対話 @ja-jp
definition: Toute forme de communication entre les religions @fr
definition: Toda forma de comunicação entre religiões. @pt-br
definition: Cualquier forma de comunicación entre las religiones. @es
note: nessuno
in scheme: Subject Code
created: 2004-08-27T12:00:00+00:00
modified: 2012-07-10T12:00:00+00:00
broader: Religioni, Fedi

Evento religioso
type: Concept
preferred label: religious event @en-gb
preferred label: Religiöses Ereignis @de
preferred label: acontecimento religioso @pt-pt
preferred label: 宗教行事 @ja-jp
preferred label: Evénement religieux @fr
preferred label: evento religioso @es
definition: Avvenimento con caratteristiche di tipo religioso, ma non festivo
definition: News regarding a religious event but not a festival or holiday @en-gb
definition: Artikel, die sich auf ein religiöses Ereignis beziehen, aber keine Feste oder Feiertage. @de
definition: Informations concernant un événement religieux sans être un festival ou une fête religieuse @fr
definition: Noticias relacionadas a un evento religioso, pero no una festival o feriado. @es
definition: Notícias relativas a acontecimentos religiosos mas não a feriados ou festas religiosas. @pt-br
definition: 祝祭や休日ではない宗教的な行事に関するニュース @ja-jp
note: nessuno
in scheme: Subject Code
created: 2004-08-27T12:00:00+00:00
modified: 2012-07-10T12:00:00+00:00
broader: Religioni, Fedi
narrower: Incontri cattolici
narrower: Incontri protestanti
narrower: Riti

Concordato
type: Concept
preferred label: concordata @pt-br
preferred label: 政教条約 @ja-jp
preferred label: concordat @en-gb
preferred label: Konkordat @de
preferred label: Concordat @fr
definition: Treaty between the Holy See and another country for the regulation of ecclesiastical affairs in the territory of the latter @en-gb
definition: Völkerrechtlich verbindlicher Vertrag zwischen dem Heiligen Stuhl und einem anderen Land. @de
definition: Tratado entre a Santa Sé e um país para a regulação de assuntos eclesiásticos nesse país. @pt-br
definition: Trattato tra la Santa Sede e un'altra nazione per regolare l'attività ecclesiastica nel territorio di quest'ultima
definition: Traité entre le Saint-Siège et un autre pays pour réglementer les affaires écclésiastiques dans ce dernier @fr
definition: Tratado entre la Santa Sede y otro país por las regulaciones de asuntos eclesiasticos en los terrotorios de éste. @es
definition: 領土内の教会の問題調整を目的とした教皇庁と他国の間の条約 @ja-jp
note: nessuno
in scheme: Subject Code
created: 2004-08-27T12:00:00+00:00
modified: 2012-07-10T12:00:00+00:00
broader: Religioni, Fedi

Ecumenismo
type: Concept
preferred label: ecumenismo @pt-br
preferred label: キリスト教統一主義運動 @ja-jp
preferred label: Ökumene @de
preferred label: ecumenism @en-gb
preferred label: Oecuménisme @fr
definition: Relation entre les églises chrétiennes @fr
definition: Relations between christian churches @en-gb
definition: Relación entre las inglesias Cristianas. @es
definition: Relações entre igrejas cristãs. @pt-pt
definition: Beziehungen zwischen christlichen Kirchen. @de
definition: Relazioni tra chiese cristiane
definition: キリスト教会間の関係 @ja-jp
note: nessuno
in scheme: Subject Code
created: 2004-08-27T12:00:00+00:00
modified: 2012-07-10T12:00:00+00:00
broader: Religioni, Fedi

Chiesa dell'Unificazione
type: Concept
preferred label: Vereinigungsbewegung @de
preferred label: unificacionismo @pt-br
preferred label: 統一教会 @ja-jp
preferred label: unificationism @en-gb
preferred label: Eglise de l'Unification @fr
definition: Las creencias de los miembros de la Inglésia de la Unificación, establecida por el reverendo Sun Myung Moon. @es
definition: Sistema de crenças dos membros da Igreja da Unificação, estabelecida pelo reverendo Sun Myung Moon. @pt-br
definition: Les adeptes de la secte Moon @fr
definition: Chiesa creata dal reverendo Sun Myung Moon
definition: Das Glaubenssystem der Mitglieder der Vereinigungskirche, das von Rev. Sun Myung Moon festgelegt wurde. @de
definition: 文鮮明師(Rev. Sun Myung Moon)によって創出された統一教会のメンバーたちの信仰体系 @ja-jp
definition: The belief system of members of the Unification Church established by the Rev. Sun Myung Moon. @en-gb
note: nessuno
in scheme: Subject Code
created: 2003-11-26T12:00:00+00:00
modified: 2012-07-10T12:00:00+00:00
broader: Credo

サイエントロジー
type: Concept
preferred label: Scientologie @fr
preferred label: Scientology
preferred label: cientologia @pt-pt
preferred label: scientology @en-gb
preferred label: cientología @es
definition: Creencia de que el Hombre es un ser espiritual dotado con abilidades más allá de lo imaginado; él es capaz de resolver sus propios problemas, alcanzar sus metas y obtener la felicidad eterna. @es
definition: Religione fondata da L.Ron Hubbard che vede l'uomo come essere spirituale che migliora quando riesce a conservare la sua integrità spirituale e i suoi valori.
definition: 人間は自身が通常想像するより十分な才能に恵まれた精神的な存在だと信じる。なぜなら彼は彼自身の問題を解決し、彼の目標と永遠の幸せを手に入れることができる @ja-jp
definition: *Crença de que o homem é um ser espiritual dotado de capacidades que vão além do que ele normalmente imagina; ele é capaz de resolver os seus próprios problemas, alcançar os seus objetivos e atingir a felicidade eterna.* @pt-pt
definition: Ceux qui croient que l'Homme a des capacités allant au-delà de celles qu'il envisage, qu'il est capable de résoudre ses problèmes, d'atteindre ses buts et finalement de gagner son bonheur @fr
definition: Believe that man is a spiritual being endowed with abilities well beyond those which he normally envisages; he's able to solve his own problems, accomplish his goals and gain lasting happiness. @en-gb
definition: Der Gaube dass der Mensch ein spirituelles Wesen ist, ausgestattet mit Fähigkeiten, hinter den für gewöhnlich sichtbaren, er ist in der Lage seine eigenen Probleme zu lösen, Großes zu schaffen und dauerhaftes Glück zu erlangen. @de
definition: *Crença de que o homem é um ser espiritual dotado de capacidades que vão além do que ele normalmente imagina; ele é capaz de resolver seus próprios problemas, alcançar seus objetivos e atingir a felicidade eterna.* @pt-br
note: nessuno
in scheme: Subject Code
created: 2003-11-26T12:00:00+00:00
modified: 2012-07-10T12:00:00+00:00
broader: Credo

Cristiana - ANNULLATO
type: Concept
preferred label: cristianismo-INATIVO @pt-pt
preferred label: キリスト教-使用不可 @ja-jp
preferred label: cristianismo-ANULADO @es
preferred label: christianity-DEPRECATED @en-gb
preferred label: Christianisme-DEPRECATED @fr
preferred label: Christentum-GELÖSCHT @de
definition: Les disciples de Jésus Christ @fr
definition: La fede in Gesù Cristo
definition: NA @en-gb
definition: --- @de
definition: イエスキリストとその教えを信仰の中心とする人たち @ja-jp
definition: INATIVO-Aqueles que usam Jesus Cristo e os seus ensinamentos como centro da sua crença religiosa. @pt-pt
definition: ANULADO @es
definition: INATIVO-Aqueles que usam Jesus Cristo e seus ensinamentos como centro de sua crença religiosa. @pt-br
note: moved to 12009000 @es
note: verschoben zu 12009000 @de
note: spostato in 12009000
in scheme: Subject Code
created: 2003-04-05T12:00:00+00:00
retired: 2004-08-27T00:00:00+00:00
modified: 2012-07-10T12:00:00+00:00
broader: Religioni - ANNULLATO

Islamica - ANNULLATO
type: Concept
preferred label: Islam-GELÖSCHT @de
preferred label: islam-DEPRECATED @en-gb
preferred label: islam-ANULADO @es
preferred label: islão-INATIVO @pt-pt
preferred label: islã-INATIVO @pt-br
preferred label: Musulman-DEPRECATED @fr
preferred label: イスラム教-使用不可 @ja-jp
definition: INATIVO-Aqueles que usam Alá e os seus ensinamentos como centro da sua crença religiosa. @pt-pt
definition: アラーとその教えを信仰の中心とする人たち @ja-jp
definition: La religione fondata dal profeta Maometto
definition: --- @de
definition: NA @en-gb
definition: INATIVO-Aqueles que usam Alá e seus ensinamentos como centro de sua crença religiosa. @pt-br
definition: Disciple de la religion fondée par le prophète arabe Mahomet @fr
definition: ANULADO @es
note: verschoben zu 12010000 @de
note: spostato in 12010000
note: moved to 12010000 @en-gb
in scheme: Subject Code
created: 2003-04-05T12:00:00+00:00
retired: 2004-08-27T00:00:00+00:00
modified: 2012-07-10T12:00:00+00:00
broader: Religioni - ANNULLATO

Ebraica - ANNULLATO
type: Concept
preferred label: Judentum-GELÖSCHT @de
preferred label: judaísmo-INATIVO @pt-pt
preferred label: ユダヤ教-使用不可 @ja-jp
preferred label: judaísmo-ANULADO @es
preferred label: judaism-DEPRECATED @en-gb
preferred label: Judaïsme-DEPRECATED @fr
definition: ANULADO @es
definition: 経典やタルムードに書かれた、メシヤの処女降誕を含む信念に基づいて、唯一神を信じているグループ @ja-jp
definition: Religion des juifs et première des grandes religions monothéistes qui a pour fondement l'Alliance inaugurée par Dieu avec le prophète Abraham et la Loi (Torah) donnée à Moïse. @fr
definition: INATIVO-Grupo que acredita em um só deus, baseando as suas crenças nas escrituras e no Talmude, incluindo a primeira vinda do Messias. @pt-pt
definition: --- @de
definition: INATIVO-Grupo que acredita em um só deus, baseando suas crenças nas escrituras e no Talmude, incluindo a primeira vinda do Messias. @pt-br
definition: NA @en-gb
definition: La prima delle grandi religioni monoteiste, che si fonda nell'alleanza voluta da Dio con il profeta Abramo e nella Torah
note: spostato in 12011000
note: Verschoben unter 12011000 @de
note: moved to 12011000 @en-gb
in scheme: Subject Code
created: 2003-04-05T12:00:00+00:00
retired: 2004-08-27T00:00:00+00:00
modified: 2012-07-10T12:00:00+00:00
broader: Religioni - ANNULLATO

Buddista - ANNULLATO
type: Concept
preferred label: Boudhisme-DEPRECATED @fr
preferred label: budismo-INATIVO @pt-br
preferred label: buddhism-DEPRECATED @en-gb
preferred label: Buddhismus-GELÖSCHT @de
preferred label: 仏教-使用不可 @ja-jp
preferred label: budismo-ANULADO @es
definition: ANULADO @es
definition: インドで紀元前6世紀に仏陀によって設立された主要なアジアの宗教で、正しい思考と自制は、欲望のない神の状態へと導くであろうことを説いている @ja-jp
definition: INATIVO-Importante religião asiática fundada por Buda no séc. VI, na Índia, que prega que o bom uso da razão e a abnegação conduzem a um estado divino sem desejo. @pt-pt
definition: Religione originaria dell'India predicata da Buddah
definition: --- @de
definition: NA @en-gb
definition: Religion originaire de l'Inde prêchée au 6ème siècle par le Bouddha selon laquelle le sage doit anéantir en lui le désir pour atteindre le nirvana. @fr
note: moved to 12012000 @en-gb
note: Verschoben unter 12012000 @de
note: spostato in 12012000
in scheme: Subject Code
created: 2003-04-05T12:00:00+00:00
retired: 2004-08-27T00:00:00+00:00
modified: 2012-07-10T12:00:00+00:00
broader: Religioni - ANNULLATO

Induista - ANNULLATO
type: Concept
preferred label: hinduísmo-INATIVO @pt-pt
preferred label: Hindouisme-DEPRECATED @fr
preferred label: hinduism-DEPRECATED @en-gb
preferred label: Hinduismus-GELÖSCHT @de
preferred label: hinduismo-ANULADO @es
preferred label: ヒンズー教-使用不可 @ja-jp
definition: --- @de
definition: NA @en-gb
definition: ANULADO @es
definition: 宗教的、社会的な制度で、バラモンの地位が最も高く、不可触民の地位が最も低いとするカースト制度を信じる @ja-jp
definition: Insieme dei principi religiosi basati sostanzialmente su un'organizzazione sociale divisa in caste
definition: INATIVO-Sistema religioso e social que acredita numa organização da sociedade por castas, dos brâmanes (a casta mais alta) aos intocáveis (a casta mais baixa). @pt-pt
definition: INATIVO-Sistema religioso e social que acredita em uma organização da sociedade por castas, dos brâmanes (a casta mais alta) aos intocáveis (a casta mais baixa). @pt-br
definition: Ensemble de courants religieux reposant notamment sur une organisation sociale en système de castes, des intouchables (la plus basse) aux Brahmans (la plus haute) @fr
note: moved to 12013000 @en-gb
note: Verschoben unter 12013000 @de
note: spostato in 12013000
in scheme: Subject Code
created: 2003-04-05T12:00:00+00:00
retired: 2004-08-27T00:00:00+00:00
modified: 2012-07-10T12:00:00+00:00
broader: Religioni - ANNULLATO

Edifici Religiosi - ANNULLATO
type: Concept
preferred label: établissement religieux-DEPRECATED @fr
preferred label: Religiöse Einrichtung-GELÖSCHT @de
preferred label: instalações religiosas-INATIVO @pt-pt
preferred label: facilidades religiosas-cancelado @es
preferred label: 宗教施設-使用不可 @ja-jp
preferred label: religious facilities-DEPRECATED @en-gb
definition: ANULADO @es
definition: Ogni tipo di edificio o struttura nel quale i fedeli possano praticare i riti della loro religione: chiese, moschee, sinagoghe ecc.
definition: --- @de
definition: INATIVO-Qualquer instalação onde um grupo de crentes pode praticar os seus rituais religiosos: mesquita, igreja, sinagoga, templo, casa, tenda, etc. @pt-pt
definition: INATIVO-Toda instalação onde um grupo de crentes pode praticar seus rituais religiosos: mesquita, igreja, sinagoga, templo, casa, tenda, etc. @pt-br
definition: モスク、教会、家あるいはテントでも、グループがその宗教の儀式を行なうことができる任意の施設 @ja-jp
definition: Tout endroit où un groupe de croyants peut pratiquer ses rites religieux : mosquée, église, maison ou tente @fr
definition: NA @en-gb
note: moved to 12000002/SubjectQualifier @en-gb
note: Verschoben als 12000002/SubjectQualifier @de
note: moved to 12009000 @fr
note: moved to 12000002 SubjectQualifier
in scheme: Subject Code
created: 2003-04-05T12:00:00+00:00
retired: 2004-08-27T00:00:00+00:00
modified: 2012-07-10T12:00:00+00:00
broader: Chiese - ANNULLATO

Etica
type: Concept
preferred label: ética @es
preferred label: 倫理 @ja-jp
preferred label: ethics @en-gb
preferred label: Ethik @de
preferred label: éthique @fr
definition: Filosofia del comportamento secondo morale
definition: Sistema de crenças acerca de uma conduta aceitável. @pt-br
definition: Glaubenssystem aus akzeptablem Verhalten. @de
definition: 好ましい行動についての信念の体系 @ja-jp
definition: Sistema de creencias acerca de una conducta aceptable. @es
definition: A system of beliefs about acceptable behaviour @en-gb
definition: Science des mœurs et de la morale @fr
note: nessuno
note: moved to 12011000 @fr
in scheme: Subject Code
created: 2003-04-05T12:00:00+00:00
modified: 2012-07-10T12:00:00+00:00
broader: Principi morali

Comportamenti Immorali
type: Concept
preferred label: Corruption @fr
preferred label: 悪行 @ja-jp
preferred label: prácticas corruptas @es
preferred label: Korruptes Verhalten @de
preferred label: corrupção religiosa @pt-br
preferred label: corrupt practices @en-gb
definition: Comportamenti corrotti, contrari a principi morali e atti danneggiare qualcuno
definition: Cualquier acción que sea dañina para otros. @es
definition: Toda ação que seja nociva para os outros. @pt-br
definition: Qualquer ação que seja nociva para os outros. @pt-pt
definition: Moyens employés pour circonvenir quelqu'un @fr
definition: Any action which is harmful to others @en-gb
definition: 他人に有害な行動 @ja-jp
definition: Jedes Verhalten, was anderen schadet. @de
note: nessuno
note: moved to 12012000 @fr
in scheme: Subject Code
created: 2003-04-05T12:00:00+00:00
modified: 2012-07-10T12:00:00+00:00
broader: Principi morali

Protestante
type: Concept
preferred label: protestante @es
preferred label: Protestantisme @fr
preferred label: Evangelische Kirche @de
preferred label: プロテスタント @ja-jp
preferred label: protestant @en-gb
definition: 16世紀の宗教改革を通じて発現したキリスト教の教会や教団の総称 @ja-jp
definition: Oberbegriff für christliche Kirchen und religiöse Gemeinschaften, entstanden aus der Reformation des 16. Jahrhunderts. @de
definition: Communauté chrétienne suivant la Réforme au 16e siècle @fr
definition: Termo genérico que designa as igrejas cristãs e as comunidades religiosas que se formaram durante a Reforma Protestante do séc. XVI. @pt-pt
definition: Chiesa sviluppatasi con la Riforma del XVI secolo
definition: Término general para las iglésias Cristianas y comunidades religiosas que fueron creados durante las reformas del siglo 16. @es
definition: General term for christian churches and religious communities which developed through the reformation in the 16th century @en-gb
note: nessuno
in scheme: Subject Code
created: 2004-08-27T12:00:00+00:00
modified: 2012-07-10T12:00:00+00:00
broader: Chiese Cristiane

Luterana
type: Concept
preferred label: ルター派 @ja-jp
preferred label: Lutheraner @de
preferred label: luterano @pt-br
preferred label: lutheran @en-gb
preferred label: Luthérianisme @fr
definition: Cristianos que siguen las enseñanzas del reformista Martín Lutero. @es
definition: 宗教改革家マルチン･ルターの教えに従うキリスト教信者 @ja-jp
definition: Chiesa fondata sugli insegnamenti di Martin Lutero.
definition: Chrétiens qui suivent l'enseignement du réformateur Martin Luther @fr
definition: Christen, die der Lehre des Reformers Martin Luther folgen. @de
definition: Christians who follow the teaching of reformer Martin Luther @en-gb
definition: Cristãos que seguem os ensinamentos do reformista Martinho Lutero. @pt-pt
note: nessuno
in scheme: Subject Code
created: 2004-08-27T12:00:00+00:00
modified: 2012-07-10T12:00:00+00:00
broader: Chiese Cristiane

Riformata
type: Concept
preferred label: reformado @es
preferred label: calvinista @pt-pt
preferred label: Calvinisme @fr
preferred label: Reformierte @de
preferred label: 改革派 @ja-jp
preferred label: reformed @en-gb
definition: Cristãos que seguem os ensinamentos dos reformistas João Calvino e Ulrico Zuínglio. @pt-pt
definition: Chiesa fondata sugli insegnamenti di Johannes Calvin e Ulrich Zwingli
definition: Christen, die der Lehre der Reformer Johannes Calvin und Ulrich Zwingli folgen. @de
definition: Cristianos que siguen las enseñanzas de los reformistas Johannes Calvin y Ulrich Zwingli. @es
definition: Chrétiens qui suivent l'enseignement des réformateurs Jean Calvin et Ulrich Zwingli @fr
definition: Christians who follow the teaching of reformers Johannes Calvin and Ulrich Zwingli @en-gb
definition: 宗教改革家ジャン･カルヴァンやウルリッヒ･ツヴィングリの教えに従うキリスト教信者 @ja-jp
note: nessuno
in scheme: Subject Code
created: 2004-08-27T12:00:00+00:00
modified: 2012-07-10T12:00:00+00:00
broader: Chiese Cristiane

Anglicana
type: Concept
preferred label: anglicano @pt-pt
preferred label: anglican @en-gb
preferred label: Anglikaner @de
preferred label: Anglicanisme @fr
preferred label: 英国国教会（聖公会） @ja-jp
definition: Mitglieder der weltweiten anglikanischen Gemeinschaft, entstanden im 16. Jahrhundert in England nach dem Bruch mit der römisch-katholischen Kirche. @de
definition: Communauté chrétienne qui trouve son origine en Angleterre au 16e siècle comme scission de l'Eglise catholique romaine @fr
definition: Members of the worldwide anglican communion which started in the 16th century in England as a breakaway church from the roman catholic church @en-gb
definition: Miembros de la comunión mundial Anglicana que comenzó en el siglo 16 en Inglaterra dividiendose de la inglesia Católica Romana. @es
definition: Membros da comunhão anglicana mundial, que nasceu no séc. XVI na Inglaterra, em resultado da cisão com a igreja católica romana. @pt-br
definition: ローマカトリック教会から離脱し、16世紀の英国で始まった、世界的なアングリカン･コミュニオン(聖公会組織)のメンバー @ja-jp
definition: Chiesa nata dallo scisma in Inghilterra nel XVI secolo, sotto il regno di Enrico VIII, dalla chiesa cattolica
note: nessuno
in scheme: Subject Code
created: 2004-08-27T12:00:00+00:00
modified: 2012-07-10T12:00:00+00:00
broader: Chiese Cristiane

Metodista
type: Concept
preferred label: メソジスト派 @ja-jp
preferred label: Methodisten @de
preferred label: metodista @pt-br
preferred label: methodist @en-gb
preferred label: Méthodisme @fr
definition: Anhänger von John und Charles Wesley, die im 18. Jahrhundert die Kirche von England reformieren wollten und dadurch eine eigene Kirche gründeten. @de
definition: Followers of John and Charles Wesley who tried to reform the Church of England in the 18th century and turned into a separate church @en-gb
definition: Seguidores de John y Charles quienes trataron de reformar la inglesia en Ingaterra en el siglo 18 y que originó en una iglesia aparte. @es
definition: 18世紀に英国国教会を改革しようとし、別の教会に分離したジョン･ウェスレーとチャールズ･ウェスレーの追随者達 @ja-jp
definition: Movimento fondato da John e Charles Wesley che nel XVIII secolo provarono a riformare la chiesa d'Inghilterra e diedero vita ad una chiesa separata
definition: Partisans de John et Charles Wesley qui ont essayé de réformer l'Eglise d'Angleterre au 18e siècle @fr
definition: Seguidores de John e Charles Wesley, irmãos que tentaram reformar a igreja de Inglaterra no séc. XVIII e que formaram uma igreja separada. @pt-pt
note: nessuno
in scheme: Subject Code
created: 2004-08-27T12:00:00+00:00
modified: 2012-07-10T12:00:00+00:00
broader: Chiese Cristiane

Battista
type: Concept
preferred label: bautista @es
preferred label: baptist @en-gb
preferred label: batista @pt-pt
preferred label: Eglise Baptiste @fr
preferred label: バプティスト派 @ja-jp
preferred label: Baptisten @de
definition: Miembros de la Inglesia Católica que bautiza solamente a los adultosquienes relamente creen en Cristo. @es
definition: Chiesa nata nel solco della riforma e che sviluppa la riflessione del battesimo dei credenti, cioè di persone che confessano personalmente la propria fede e lo fanno con il battesimo per immersione
definition: Members of a christian church which only baptises adults who truly believe in Christ @en-gb
definition: Membros de uma igreja cristã que apenas batiza os adultos que creem verdadeiramente em Cristo. @pt-pt
definition: Mitglieder einer christlichen Kirche, die nur Erwachsene tauft. @de
definition: Eglise chrétienne qui ne baptise que des adultes qui croient réellement au Christ @fr
definition: 真にキリストを信仰する成人にのみ洗礼を施すキリスト教会のメンバー @ja-jp
note: nessuno
note: moved from 12004001 @fr
in scheme: Subject Code
created: 2004-08-27T12:00:00+00:00
modified: 2012-07-10T12:00:00+00:00
broader: Chiese Cristiane

Mennonita
type: Concept
preferred label: mennonite @en-gb
preferred label: Mennonisme @fr
preferred label: Mennoniten @de
preferred label: メノナイト派 @ja-jp
preferred label: menonita @pt-br
preferred label: mennonita @es
definition: Membros de uma igreja cristã do séc. XVI que é contra o serviço militar e o batismo de crianças. @pt-br
definition: Mitglieder einer aus dem 16. Jahrhundert stammenden christlichen Kirche, die gegen Militärdienst und Kindertaufe sind. @de
definition: Chiesa cristiana del XVI che secolo che ritiene la Bibbia come unica e sola ispirata da Dio, prende il suo nome da Menno Simons, dal quale origina una tradizione rigorosamente pacifista
definition: Eglise chrétienne datant du 16e siècle qui refuse le baptême des enfants et le service militaire @fr
definition: Members of a 16th century christian church which is against military service and baptising infants @en-gb
definition: Miembros de una Iglesia Cristiana nacida en el siglo 16, los cuales estan en contra de servir en las fuerzas armadas y bautizar a los niños. @es
definition: 兵役と幼児への洗礼に反対している16世紀のキリスト教会のメンバー @ja-jp
note: nessuno
in scheme: Subject Code
created: 2004-08-27T12:00:00+00:00
modified: 2012-07-10T12:00:00+00:00
broader: Chiese Cristiane

Mormone
type: Concept
preferred label: Mormon @fr
preferred label: mormón @es
preferred label: mormon @en-gb
preferred label: mórmon @pt-pt
preferred label: Mormonen @de
preferred label: モルモン教 @ja-jp
definition: Comunità religiosa che trova i suoi fondamenti nel “Libro dei Mormoni* e nelle rivelazioni ottocentesche del fondatore, il profeta M. J. Smith
definition: Miembros de la comunidad religiosa que cree en el [Libro del Mormón[ y en las revelaciones de su fundador M.J. Smith. @es
definition: Mitglieder einer christlichen Gemeinschaft, die an das Buch Mormon und die Visionen des Gründers M.J. Smith glauben. @de
definition: ｢モルモン書｣と始祖M.J.スミスの啓示を信仰する宗教団体のメンバー @ja-jp
definition: Communauté religieuse qui croit au *Livre des Mormons* et aux révélations de son fondateur M. J. Smith @fr
definition: Members of a religious community which believes in the *Book of Mormon* and the revelations of founder M.J. Smith @en-gb
definition: *Membros de uma comunidade religiosa que acredita no **Livro de Mórmon** e nas revelações do fundador M.J. Smith.* @pt-br
note: nessuno
in scheme: Subject Code
created: 2004-08-27T12:00:00+00:00
modified: 2012-07-10T12:00:00+00:00
broader: Chiese Cristiane

Cattolico Romana
type: Concept
preferred label: católico romano @pt-br
preferred label: カトリック @ja-jp
preferred label: Catholicisme romain @fr
preferred label: roman catholic @en-gb
preferred label: Römisch-katholische Kirche @de
definition: Maior igreja cristã do mundo, cuja origem se acredita remontar a Jesus Cristo. @pt-pt
definition: Principale église chrétienne sur le plan mondial @fr
definition: Biggest christian church worldwide tracing its origins back to Jesus Christ @en-gb
definition: La Iglesia Cristiana más grande del mundo que tiene sus orígines en Jesucristo. @es
definition: La maggiore delle Chiese cristiane nel mondo, che trae la sua origine nella rivelazione di Cristo e nel messaggio evangelico e si consolida nel processo che vede la sede papale di Roma come centro della Cristianità
definition: イエス･キリストの起源までさかのぼる世界的にもっとも巨大なキリスト教徒 @ja-jp
definition: Weltweit größte christliche Kirche, die ihre Ursprünge auf Jesus Christus zurückführt. @de
note: nessuno
in scheme: Subject Code
created: 2004-08-27T12:00:00+00:00
modified: 2012-07-10T12:00:00+00:00
broader: Chiese Cristiane

Veterocattolica
type: Concept
preferred label: Vieux Catholique @fr
preferred label: veterocatólico @pt-br
preferred label: antiguo católico @es
preferred label: 旧カトリック @ja-jp
preferred label: Altkatholiken @de
preferred label: old catholic @en-gb
definition: Confession catholique dont l'origine remonte à 1870 et qui conteste l'infallibilité du pape @fr
definition: Membros de uma igreja católica que começou em 1870 e que nega o dogma da infalibilidade do papa. @pt-pt
definition: Chiesa nata nel 1870 dopo il Primo Concilio Vaticano da comunità che tennero un concilio a Monaco di Baviera dove aderirono 23 congregazioni soprattutto della Germania e dell'Impero austroungarico
definition: Members of a catholic church which started in 1870 and denies the dogma of the infallibility of the pope @en-gb
definition: 1870年に発足したカトリック教会のメンバー。ローマ法王の不可謬(ふかびゅう)性の教義を否定する @ja-jp
definition: Mitglieder einer katholischen Kirche, die 1870 entstand und die die Lehre über die Unfehlbarkeit des Papstes ablehnt. @de
definition: Miembros de la Inglesia Católica que comenzó en 1870 y que deniega el dogma de la infalibilida del Papa. @es
note: nessuno
in scheme: Subject Code
created: 2004-08-27T12:00:00+00:00
modified: 2012-07-10T12:00:00+00:00
broader: Chiese Cristiane

Ortodossa
type: Concept
preferred label: 東方正教 @ja-jp
preferred label: ortodoxia @pt-pt
preferred label: ortodoxo @es
preferred label: Orthodoxie @fr
preferred label: orthodoxy @en-gb
preferred label: Orthodoxe @de
definition: Kirchen des byzantinischen Ritus, die in der apostolischen Tradition stehen, vor allem in Ost- und Südosteuropa sowie im Mittleren Osten. @de
definition: Iglesias Cristiamas que se caracterizan por su continuidad de los ritos de la inglesia apostólica, sus liturgias y sus iglesias territoriales, principalmente en el este y sudeste de Europa y el Medio Oriente. @es
definition: Igrejas cristãs que se caracterizam pela continuidade dos rituais da igreja apostólica, pela liturgia e pelas igrejas territoriais, sobretudo no sudeste da Europa e no Médio Oriente. @pt-pt
definition: Igrejas cristãs que se caracterizam pela continuidade dos rituais da igreja apostólica, pela liturgia e pelas igrejas territoriais, sobretudo no sudeste da Europa e no Oriente Médio. @pt-br
definition: Chiesa d'Oriente che accoglie tutti i credenti che hanno accettato i principi stabiliti nei Concili di Nicea, Efeso e Calcedonia
definition: Rite chrétien orthodoxe caractérisée par la continuité de l'église apostolique, principalement à l'Est de l'Europe et au Moyen Orient @fr
definition: 主に中東及び東･南東ヨーロッパにおいて、十二使徒教会や聖体礼儀や管轄区教会と密接な関連があると特徴づけられる東方正教会 @ja-jp
definition: Eastern rite churches which are characterised by their continuity with the apostolic church, their liturgy and their territorial churches, mainly in eastern and south-eastern Europe and the Middle East @en-gb
note: nessuno
in scheme: Subject Code
created: 2004-08-27T12:00:00+00:00
modified: 2012-07-10T12:00:00+00:00
broader: Chiese Cristiane

Esercito Salvezza
type: Concept
preferred label: Heilsarmee @de
preferred label: 救世軍 @ja-jp
preferred label: Armée du Salut @fr
preferred label: salvation army @en-gb
preferred label: exército de salvação @pt-pt
preferred label: ejército de salvación @es
definition: Communauté chrétienne organisée de manière militaire et dédiée au travail social @fr
definition: 伝道と社会事業を目的として組織された軍隊式キリスト教団体 @ja-jp
definition: Christian community organised in a military fashion which does missionary and social work @en-gb
definition: Comunidade cristã organizada de forma militar e que faz trabalho missionário e social. @pt-pt
definition: Organización Cristiana organizada en forma militar que practica el evenagelio y realiza trabajos sociales. @es
definition: Comunità cristiana organizzata in maniera militare che si occupa di missioni e lavori sociali
definition: Militärisch organisierte christliche Gemeinschaft, die missionarisch und sozial tätig ist. @de
note: nessuno
in scheme: Subject Code
created: 2004-08-27T12:00:00+00:00
modified: 2012-07-10T12:00:00+00:00
broader: Chiese Cristiane
broad match: http://cv.iptc.org/newscodes/mediatopic/20000659

Natale
type: Concept
preferred label: Noël @fr
preferred label: christmas @en-gb
preferred label: natal @pt-br
preferred label: Weihnachten @de
preferred label: クリスマス @ja-jp
preferred label: navidad @es
definition: Fête chrétienne de commémoration de la naissance de Jésus Christ @fr
definition: Festa cristã que comemora o nascimento de Jesus Cristo. @pt-pt
definition: Festa cristiana in cui si celebra la nascita di Gesù Cristo
definition: Días Cristianbo Festivo en conmemoración del nacimiento de Jesucristo. @es
definition: イエス･キリストの誕生を記念するキリスト教徒の祭日 @ja-jp
definition: Christian festival in commemorating the birth of Jesus Christ @en-gb
definition: Fest zur Erinnerung an die Geburt von Jesus Christus. @de
note: nessuno
in scheme: Subject Code
created: 2004-08-27T12:00:00+00:00
modified: 2012-07-10T12:00:00+00:00
broader: Festività religiose

Pasqua
type: Concept
preferred label: páscoa @pt-pt
preferred label: Ostern @de
preferred label: easter @en-gb
preferred label: 復活祭 @ja-jp
preferred label: Pâques @fr
preferred label: semana santa @es
definition: Festa cristiana in cui si celebra la resurrezione di Gesù Cristo
definition: Festividad Cristiana en conmemoración de la resurreción de Jesucristo. @es
definition: Festa cristã que comemora a ressurreição de Jesus Cristo. @pt-pt
definition: Christian festival in commemorating the resurrection of Jesus Christ @en-gb
definition: Fête chrétienne de commémoration de la résurrection de Jésus Christ @fr
definition: Fest zur Erinnerung an die Auferstehung von Jesus Christus. @de
definition: イエス･キリストの復活を記念するキリスト教徒の祭日 @ja-jp
note: nessuno
note: moved from 12004002 @fr
in scheme: Subject Code
created: 2004-08-27T12:00:00+00:00
modified: 2012-07-10T12:00:00+00:00
broader: Festività religiose

Pentecoste
type: Concept
preferred label: pentecostes @pt-br
preferred label: Pentecôte @fr
preferred label: pentecost @en-gb
preferred label: Pfingsten @de
preferred label: 聖霊降臨祭 @ja-jp
preferred label: pentecostal @es
definition: 50 Tage nach Ostern begangenes Fest zur Erinnerung an die Herabkunft des Heiligen Geistes. @de
definition: Celebración Cristiana celebrada en el Quincuagésimo día despues de Semana Santa, que conmemora el descenso del Espíritu Santo. @es
definition: キリスト教徒の祝日。聖霊の降誕を記念して、復活祭の50日後に祝う @ja-jp
definition: Festa cristã, celebrada no 50.º dia depois da Páscoa, que comemora a descida do Espírito Santo. @pt-pt
definition: Christian festival, celebrated on the 50th day after Easter commemorating the descent of the Holy Spirit @en-gb
definition: Festa cristiana in cui si celebra la discesa dello Spirito Santo nel cinquantesimo giorno dopo la Pasqua
definition: Fête chrétienne, célébrée 50 jours après Pâques, commémorant le retour de l'Esprit saint @fr
note: moved from 12004003 @fr
note: nessuno
in scheme: Subject Code
created: 2004-08-27T12:00:00+00:00
modified: 2012-07-10T12:00:00+00:00
broader: Festività religiose

Ramadan
type: Concept
preferred label: ramadão @pt-pt
preferred label: ramadã @pt-br
preferred label: ramadan @es
preferred label: 断食月 @ja-jp
definition: Mês sagrado de jejum no Islão. @pt-pt
definition: Holy month of fasting in Islam @en-gb
definition: Mês sagrado de jejum no Islã. @pt-br
definition: Mes Sagrado de ayuno en el Islamismo. @es
definition: Mois saint de jeûne pour l'Islam @fr
definition: イスラム教における、聖なる断食の月 @ja-jp
definition: Heiliger Fastenmonat des Islam. @de
definition: Mese sacro di digiuno nella religione islamica
note: moved from 12004004 @fr
note: nessuno
in scheme: Subject Code
created: 2004-08-27T12:00:00+00:00
modified: 2012-07-10T12:00:00+00:00
broader: Festività religiose

Yom Kippur
type: Concept
preferred label: yom kippur @es
preferred label: Jom Kippur @de
preferred label: 贖罪の日 @ja-jp
preferred label: Yom Kippour @fr
definition: ユダヤ教において、宗教上もっとも神聖な祭日。ユダヤ教徒たちは神との調和を求めて、太陰月(ユダヤ暦)であるティシュリー月(西暦では9～10月)の10日に祝う @ja-jp
definition: La fête religieuse juive la plus solennelle au 10e jour du mois lunaire de Tishri (entre Septembre et Octobre, lorsque les Juifs cherchent la réconcialiation avec Dieu) @fr
definition: Most solemn of Jewish religious holidays, observed on the 10th day of the lunar month of tishri (in the course of September and October, when Jews seek reconciliation with god @en-gb
definition: Höchster jüdischer Feiertag. @de
definition: EL más solmne de los feriados religiosos Judios observado en el décimo día lunar de tishri (En el curso de Septiembre y Octubre, cuando los judios buscan la reconciliación con Dios). @es
definition: La festività religiosa ebraica più solenne, osservata nel decimo giorno del mese lunare di tishri (tra settembre e ottobre, quando gli Ebrei cercano la riconciliazione con dio)
definition: O mais solene dos feriados religiosos judeus, celebrado no 10.º dia do mês lunar de tishri (entre setembro e outubro), quando os judeus buscam a reconciliação com deus. @pt-br
note: nessuno
note: moved from 12004005 @fr
in scheme: Subject Code
created: 2004-08-27T12:00:00+00:00
modified: 2012-07-10T12:00:00+00:00
broader: Festività religiose

Papa
type: Concept
preferred label: papa @pt-br
preferred label: ローマ法王 @ja-jp
preferred label: Papst @de
preferred label: Pape @fr
preferred label: pope @en-gb
definition: Chefe da igreja católica romana no mundo. @pt-pt
definition: Chef de l'Eglise romaine catholique @fr
definition: Cabeza de la Iglesia Católica Romana a nivel mundial. @es
definition: Capo della chiesa cattolica apostolica romana
definition: ローマカトリック教会の世界最高権威者 @ja-jp
definition: Weltweites Oberhaupt der römisch-katholischen Kirche. @de
definition: Head of the roman catholic church worldwide @en-gb
note: nessuno
in scheme: Subject Code
created: 2004-08-27T12:00:00+00:00
modified: 2012-07-10T12:00:00+00:00
broader: Leader religiosi

Bibbia
type: Concept
preferred label: 聖書 @ja-jp
preferred label: bíblia @pt-br
preferred label: Bibel @de
preferred label: biblia @es
preferred label: Bible @fr
preferred label: bible @en-gb
definition: Le Sacre Scritture della fede cristiana, composte dal Vecchio e Nuovo Testamento
definition: Escrituras Sagradas del Cristianismo consistentes de el Antiguo y Nuevo Testamento. @es
definition: 新約と旧約から成るキリスト教の聖典 @ja-jp
definition: Sacred scriptures of Christianity consisting of the old and new testament @en-gb
definition: Escrituras sagradas do cristianismo que consistem no Novo e no Velho Testamento. @pt-pt
definition: Livre saint de la Chrétienté @fr
definition: Heilige Schrift des Christentums, bestehend aus dem Alten und dem Neuen Testament. @de
note: nessuno
in scheme: Subject Code
created: 2004-08-27T12:00:00+00:00
modified: 2012-07-10T12:00:00+00:00
broader: Testi Religiosi

Corano
type: Concept
preferred label: quoram @es
preferred label: コーラン @ja-jp
preferred label: alcorão @pt-br
preferred label: qur'an @en-gb
preferred label: Coran @fr
preferred label: Koran @de
definition: Heiliges Buch des Islam. @de
definition: Libro Sagrado del Islamismo @es
definition: イスラム教の聖典 @ja-jp
definition: Livro sagrado do Islã. @pt-br
definition: Libro sacro della religione islamica
definition: Holy book of Islam @en-gb
definition: Livre saint de l'Islam @fr
definition: Livro sagrado do Islão. @pt-pt
note: nessuno
in scheme: Subject Code
created: 2004-08-27T12:00:00+00:00
modified: 2012-07-10T12:00:00+00:00
broader: Testi Religiosi

ユダヤ聖典
type: Concept
preferred label: toráh @es
preferred label: tora @pt-pt
preferred label: Thora @de
preferred label: Torah
preferred label: torá @pt-br
preferred label: torah @en-gb
definition: Escrituras sagradas do judaísmo. @pt-pt
definition: ユダヤ教の聖典(義にはモーゼの十戒および旧約聖書の冒頭のモーゼ五書を指す) @ja-jp
definition: Sacre scritture della religione ebraica
definition: Escrituras Sagradas del Judaísmo. @es
definition: Holy scriptures of Judaism @en-gb
definition: Livre saint du Judaïsme @fr
definition: Heilige Schriften des Judentums. @de
note: nessuno
in scheme: Subject Code
created: 2004-08-27T12:00:00+00:00
modified: 2012-07-10T12:00:00+00:00
broader: Testi Religiosi

Incontri cattolici
type: Concept
preferred label: Katholikentag @de
preferred label: convenção católica @pt-pt
preferred label: カトリック教大会 @ja-jp
preferred label: convención católica @es
preferred label: catholic convention @en-gb
preferred label: Réunion catholique @fr
definition: Eine Versammlung von Katholiken @de
definition: Informações relativas a uma convenção católica. @pt-pt
definition: Informations concernant une réunion catholique @fr
definition: Reportes concernientes o de una convención Católica. @es
definition: カトリック教大会からの報道、又はそれに関係する報道 @ja-jp
definition: A catholic convention @en-gb
definition: Incontri o Assemblee proprie del mondo cattolico
note: nessuno
in scheme: Subject Code
created: 2004-08-27T12:00:00+00:00
modified: 2012-07-10T12:00:00+00:00
broader: Evento religioso
broad match: http://cv.iptc.org/newscodes/mediatopic/20000689

Incontri protestanti
type: Concept
preferred label: protestant convention @en-gb
preferred label: convención protestante @es
preferred label: プロテスタント大会 @ja-jp
preferred label: convenção protestante @pt-pt
preferred label: Kirchentag @de
preferred label: Réunion protestante @fr
definition: Informações relativas a uma convenção protestante. @pt-br
definition: プロテスタント大会からの報道、又はそれに関係する報道 @ja-jp
definition: Eine Versammlung von evangelischen Christen. @de
definition: Reportes concernientes o de una convención Protestante. @es
definition: Informations concernant une réunion protestante @fr
definition: A protestant convention @en-gb
definition: Incontri o Assemblee proprie del mondo protestante
note: nessuno
in scheme: Subject Code
created: 2004-08-27T12:00:00+00:00
modified: 2012-07-10T12:00:00+00:00
broader: Evento religioso
broad match: http://cv.iptc.org/newscodes/mediatopic/20000689

Riti
type: Concept
preferred label: Rituel @fr
preferred label: ritual @pt-br
preferred label: 儀式 @ja-jp
preferred label: Ritual @de
definition: Rituales religiosos establecidos, tales como Misa, Bautismo, Oración en grupo. @es
definition: Cerimonie o Rituali religiosi di vario tipo, come ad es. messe, battesimi, incontri di preghiera ecc.
definition: Rituais religiosos estabelecidos, como missa, batismo, oração em grupo. @pt-pt
definition: ミサ、洗礼、祈祷会などの確立した宗教上の儀式 @ja-jp
definition: Rites religieux établis comme la messe, le baptême ou la prière @fr
definition: Etablierte religiöse Rituale, wie Messen, Taufen, Priestertreffen. @de
definition: Established religious rituals such as mass, baptism, prayer meetings @en-gb
note: nessuno
in scheme: Subject Code
created: 2004-10-13T12:00:00+00:00
modified: 2012-07-10T12:00:00+00:00
broader: Evento religioso

Scienza, Tecnologia
type: Concept
preferred label: Wissenschaft, Technik, Forschung @de
preferred label: science and technology @en-gb
preferred label: ciência e tecnologia @pt-br
preferred label: Science et technologie @fr
preferred label: 科学・技術 @ja-jp
preferred label: ciencia y tecnología @es
definition: Comprensione e conoscenza della natura e del mondo fisico e lo sviluppo e applicazione di tale sapere
definition: Tout ce qui contribue à la compréhension de la nature et du monde physique et l'application de ce savoir aux techniques industrielles notamment @fr
definition: Todos los aspectos relacionados con la interpretación humana de la naturaleza y el mundo físico, y el desarrollo y la aplicación de este conocimiento. @es
definition: Todos os aspetos relacionados com a interpretação humana da natureza e do mundo físico e com o desenvolvimento e aplicação desse conhecimento. @pt-br
definition: 人の自然や物理的世界に対する理解のあらゆる面、およびこの知識の発展や応用 @ja-jp
definition: Alle Aspekte die mit dem menschlichen Verständnis der Natur und der physikalischen Welt zusammenhängen und der Entwicklung und Anwendung dieses Wissens. @de
definition: All aspects pertaining to human understanding of nature and the physical world and the development and application of this knowledge @en-gb
note: nessuno
in scheme: Subject Code
created: 2000-10-30T12:00:00+00:00
modified: 2010-12-15T17:01:09+00:00
narrower: Scienza applicata
narrower: Ingegneria
narrower: Scienze umane
narrower: Scienze naturali
narrower: Scienze filosofiche
narrower: Ricerca
narrower: Esplorazioni scientifiche
narrower: Programmi aerospaziali
narrower: Scienza (generico)
narrower: Tecnologia (generico)
narrower: Standards
narrower: Scienza degli animali
narrower: Microscienza
narrower: Oceanografia
narrower: Climatologia, Meteorologia
narrower: Elettronica
narrower: Tecnologia Identificazione
narrower: Matematica
narrower: Biotecnologia
narrower: Ricerca, Tecnologia agricola
narrower: Nanotecnologia
narrower: Scienze informatiche
narrower: Istituzioni scientifiche

Scienza applicata
type: Concept
preferred label: applied science @en-gb
preferred label: ciências aplicadas @pt-pt
preferred label: ciencias aplicadas @es
preferred label: Angewandte Wissenschaft @de
preferred label: Sciences appliquées @fr
preferred label: 応用科学 @ja-jp
definition: Artikel über in der Praxis angewandtes Wissen im Umfeld der medizinischen Wissenschaft, Agrarwissenschaft, heimische Wissenschaften genauso wie Handel und Handwerk. @de
definition: Histórias sobre a aplicação do conhecimento científico na solução de questões práticas. @pt-pt
definition: Artículos acerca de dar al conocimiento científico un uso práctico en los campos de la ciencia médica, la agricultura, las ciencias domésticas, además de las artes y oficios. @es
definition: La mise en pratique du savoir scientifique appliquée à la médecine, à l'agriculture, etc. @fr
definition: Stories about putting scientific knowledge to practical uses in the fields of the medical sciences, agriculture, domestic sciences as well as trades and crafts @en-gb
definition: 通商や工学だけでなく、医学、農業、家政学の分野で実用となる科学的な知識を応用することに関する記事 @ja-jp
definition: Applicazione della conoscenza scientifica per usi pratici in medicina, agricoltura, o altro ma anche in arti e mestieri
definition: Histórias sobre a aplicação do conhecimento científico a fins práticos nas áreas das ciências médicas, agricultura, ciências domésticas, bem como artes e ofícios. @pt-br
note: nessuno
in scheme: Subject Code
created: 2000-10-30T12:00:00+00:00
modified: 2010-12-15T17:01:09+00:00
broader: Scienza, Tecnologia
narrower: Fisica
narrower: Chimica
narrower: Cosmologia
narrower: Fisica Particelle
broad match: http://cv.iptc.org/newscodes/mediatopic/13000000

Ingegneria
type: Concept
preferred label: 工学 @ja-jp
preferred label: engenharia @pt-pt
preferred label: ingeniería @es
preferred label: Ingénierie @fr
preferred label: engineering @en-gb
preferred label: Ingenieurwesen @de
definition: Histórias sobre a aplicação do conhecimento científico a fins práticos nas áreas da engenharia civil, elétrica, mecânica e química. @pt-br
definition: Applicazione della conoscenza scientifica per usi pratici nei campi dell'ingegneria civile, elettrica, meccanica e chimica
definition: Artikel über den praktischen Nutzen von wissenschaftlichen Erkenntnissen in den Bereichen ziviler, elektronischer, mechanischer und chemischer Technik. @de
definition: Artículos acerca de dar al conocimiento científico un uso práctico en los campos de la ingeniería civil, eléctrica, mecánica y química. @es
definition: 土木、電気、機械、化学工学の分野で実用となる科学的な知識を応用することに関する記事 @ja-jp
definition: Stories about putting scientific knowledge to practical uses in the fields of civil, electrical, mechanical and chemical engineering @en-gb
definition: Informations sur l'utilisation de connaissance scientifique pour des utilisations pratiques dans l'ingénierie civile, électrique, mécanique et chimique @fr
note: nessuno
in scheme: Subject Code
created: 2000-10-30T12:00:00+00:00
modified: 2010-12-15T17:01:09+00:00
broader: Scienza, Tecnologia
narrower: Scienza Materiali
broad match: http://cv.iptc.org/newscodes/mediatopic/20000756

Scienze umane
type: Concept
preferred label: ciencias humanas @es
preferred label: Geisteswissenschaft @de
preferred label: human science @en-gb
preferred label: Sciences humaines @fr
preferred label: 人文科学 @ja-jp
definition: Ensemble constitué par la sociologie, la psychologie, l'anthropologie, l'histoire et la science politique @fr
definition: Scienze quali sociologia, psicologia, antropologia, scienze politiche ecc.
definition: Sociology, psychology, anthropology and political science @en-gb
definition: Soziologie, Psychologie, Anthropologie und politische Wissenschaften. @de
definition: Artículos relacionados con sociología, psicología, antropología y ciencias políticas. @es
definition: 社会学、心理学、人類学と政治学関連の記事 @ja-jp
note: nessuno
in scheme: Subject Code
created: 2000-10-30T12:00:00+00:00
modified: 2010-12-15T17:01:09+00:00
broader: Scienza, Tecnologia
narrower: Scienze sociali
narrower: Storia
narrower: Psicologia
narrower: Sociologia
narrower: Antropologia

Scienze naturali
type: Concept
preferred label: ciencias naturales @es
preferred label: 自然科学 @ja-jp
preferred label: natural science @en-gb
preferred label: ciências naturais @pt-br
preferred label: Naturwissenschaft @de
preferred label: Sciences naturelles @fr
definition: Astronomie, Astrophysik, Geografie, Paläontologie, Biologie, Botanik und Zoologie und Mathematik. @de
definition: Astronomy, astrophysics, physics, chemistry, earth sciences, palaeontology, biological sciences, botany and zoology, as well as mathematics @en-gb
definition: Les sciences de la terre mais aussi l'astronomie, l'astrophysique, la chimie, la physique, la paléontologie, la biologie, la botanique, la zoologie et les mathématiques @fr
definition: Histórias relativas a astronomia, astrofísica, física, química, ciências da terra, paleontologia, ciências biológicas, botânica, zoologia e matemática. @pt-br
definition: Artículos relacionados con astronomía, astrofísica, física, química, ciencias de la tierra, paleontología, ciencias biológicas, botánica y zoología, como asimismo matemáticas. @es
definition: 数学だけでなく、天文学や天体物理学、物理学、化学、地球科学、古生物学、生物科学、植物学、動物学に関連する記事 @ja-jp
definition: Scienze della Terra ma anche astronomia, astrofisica, fisica, chimica, paleontologia, scienze biologiche, botanica e zoologia, come anche la matematica
note: nessuno
in scheme: Subject Code
created: 2000-10-30T12:00:00+00:00
modified: 2010-12-15T17:01:09+00:00
broader: Scienza, Tecnologia
narrower: Geologia
narrower: Paleontologia
narrower: Geografia
narrower: Botanica
narrower: Zoologia
narrower: Fisiologia
narrower: Astronomia
narrower: Biologia

Scienze filosofiche
type: Concept
preferred label: ciências filosóficas @pt-pt
preferred label: Philosophie @de
preferred label: ciencias filosóficas @es
preferred label: Philosophie des sciences @fr
preferred label: philosophical science @en-gb
preferred label: 哲学（学術） @ja-jp
definition: Artículos relacionados con filosofía, lógica y ética, entre otras cosas. @es
definition: Filosofia, logica ed etica, ecc.
definition: Histórias relativas à filosofia, lógica, ética, etc. @pt-pt
definition: Histórias relativas à filosofia, lógica, ética, entre outras. @pt-br
definition: Philosophie, Logik und Ethik, unter anderen. @de
definition: Informations concernant la philosophie, la logique, l'éthique @fr
definition: とりわけ哲学、論理学や倫理学と関連する記事 @ja-jp
definition: Philosophy, logic and ethics, among others @en-gb
note: nessuno
in scheme: Subject Code
created: 2000-10-30T12:00:00+00:00
modified: 2010-12-15T17:01:09+00:00
broader: Scienza, Tecnologia

Ricerca
type: Concept
preferred label: Forschung @de
preferred label: 研究 @ja-jp
preferred label: Investigação científica @pt-pt
preferred label: Recherche @fr
preferred label: research @en-gb
preferred label: investigación @es
definition: ある出来事についての周到な調査、なぜ起こるのかを説明するための手順、または問題の解決方法を見つけること @ja-jp
definition: Methodische Untersuchungen von Ereignissen, Prozeduren etc. um zu erklären, wie sie entstehen oder um Lösungen zu finden für Probleme. @de
definition: Investigação metódica de eventos, procedimentos, etc., para explicar a sua causa ou para solucionar problemas. @pt-pt
definition: Indagine metodica applicata ad eventi, procedure ecc., per spiegare perché avvengano o per trovare soluzione a problemi
definition: L'ensemble des travaux méthodiques de recherche visant à faire avancer la connaissance @fr
definition: Investigación metodica de eventos, procedimientos, etc. Para explicar porqué ocurren, o para encontrar solución a problemas. @es
definition: Methodical investigation of events, procedures etc to explain why they occur, or to find solutions for problems @en-gb
note: nessuno
in scheme: Subject Code
created: 2000-10-30T12:00:00+00:00
modified: 2010-12-15T17:01:09+00:00
broader: Scienza, Tecnologia
narrower: Indagini, Sondaggi

Esplorazioni scientifiche
type: Concept
preferred label: Entwicklung @de
preferred label: exploração científica @pt-br
preferred label: Exploration scientifique @fr
preferred label: 科学探査 @ja-jp
preferred label: scientific exploration @en-gb
preferred label: exploración científica @es
definition: 陸や海、宇宙の秩序からそれらに関する新しい情報を発見する @ja-jp
definition: Viagens metódicas de exploração na terra, no mar ou no espaço, para recolha de informação. @pt-br
definition: Esplorazione approfondita riguardante terra, mare e spazio alla ricerca di nuove conoscenze
definition: Methodische Land, Wasser und Weltraumreisen, um neue Informationen über diese zu entdecken. @de
definition: Viaje metódicos alredodor de la tierra y el océano para descubrir nueva información acerca de ellos. @es
definition: Exploration méthodique et détaillée de la terre, de la mer et de l'espace @fr
definition: Methodical land, sea and space journeys to discover new information about them @en-gb
note: nessuno
in scheme: Subject Code
created: 2000-10-30T12:00:00+00:00
modified: 2010-12-15T17:01:09+00:00
broader: Scienza, Tecnologia

Programmi aerospaziali
type: Concept
preferred label: Programmes spatiaux @fr
preferred label: space programme @en-gb
preferred label: Weltraumforschung @de
preferred label: programa espacial @pt-br
preferred label: programas espaciales @es
preferred label: 宇宙計画 @ja-jp
definition: The government's organized effort for the exploration of outer space and the bodies therein @en-gb
definition: Programmi dei vari paesi per l'esplorazione dello spazio
definition: Esforço organizado do governo para a exploração dos espaço e dos astros. @pt-br
definition: Von der Regierung organisierte Forschung zur Entdeckung fremden Lebensraumes und deren Einheiten darin. @de
definition: Les programmes publics pour l'exploration de l'espace @fr
definition: 大気圏外とそこにあるものへ探査のための政府の組織的な試み @ja-jp
definition: Los esfuerzos organizados por el gobierno para la exploración del Espacio exterior y los astros en él. @es
note: nessuno
in scheme: Subject Code
created: 2000-10-30T12:00:00+00:00
modified: 2010-12-15T17:01:09+00:00
broader: Scienza, Tecnologia

Scienza (generico)
type: Concept
preferred label: science (general) @en-gb
preferred label: Wissenschaft @de
preferred label: ciência (geral) @pt-pt
preferred label: ciencias (general) @es
preferred label: 科学（一般） @ja-jp
preferred label: Science @fr
definition: Información sistematizada y establecidaacerca de la naturaleza y el mundo físico, hidrodinámicas y termodinámicas. @es
definition: Informação estabelecida e sistematizada sobre a natureza e o mundo físico através de observação, experiências e hipóteses. @pt-pt
definition: 観察、実験および仮説を通して、自然と物理世界に関する情報の確立および体系化 @ja-jp
definition: Conseguimento della conoscenza della natura e del mondo fisico attraverso osservazione, esperimento e ipotesi
definition: Anerkannte und systematische Information über die Natur und die physikalische Welt durch Beobachtung, Experiment und Hypothese. @de
definition: Establishing and systematizing information about nature and the physical world through observation, experimentation and hypothesis @en-gb
definition: Savoir que l'on acquiert par l'étude, l'expérience, l'observation @fr
note: nessuno
in scheme: Subject Code
created: 2000-10-30T12:00:00+00:00
modified: 2010-12-15T17:01:09+00:00
broader: Scienza, Tecnologia
broad match: http://cv.iptc.org/newscodes/mediatopic/13000000

Tecnologia (generico)
type: Concept
preferred label: technology (general) @en-gb
preferred label: tecnologia (geral) @pt-pt
preferred label: 技術（一般） @ja-jp
preferred label: Technologie @fr
preferred label: tecnología (general) @es
preferred label: Technik/Technologie @de
definition: El estudio de lasprácticas o artes industriales, aplicadas a las ciencias tales como física, hidronámicas y termohidrámicas. @es
definition: L'étude des techniques industrielles et des sciences appliquées comme la thermodynamique @fr
definition: 実用的もしくは工芸、物理学、流体力学、熱力学のような応用化学の知識 @ja-jp
definition: Estudo das artes práticas ou industriais e das ciências aplicadas, como física, hidrodinâmica, termodinâmica. @pt-pt
definition: Studium von praktischen und industriellen Fertigkeiten und benachbarte Wissenschaften wie Physik, Hydrodynamik und Thermodynamik. @de
definition: Studio delle tecniche industriali e delle scienze applicate
definition: Estudo das artes práticas ou industriais e de ciências aplicadas como física, hidrodinâmica, termodinâmica. @pt-br
definition: The study of the practical or industrial arts, and applied sciences such as physics, hydrodynamics and thermodynamics @en-gb
note: nessuno
in scheme: Subject Code
created: 2000-10-30T12:00:00+00:00
modified: 2010-12-15T17:01:09+00:00
broader: Scienza, Tecnologia
narrower: Missilistica
narrower: Laser
broad match: http://cv.iptc.org/newscodes/mediatopic/20000756

Standards
type: Concept
preferred label: normas @es
preferred label: standards @en-gb
preferred label: normas (standards) @pt-pt
preferred label: 標準規格 @ja-jp
definition: Normes nationales où internationales de fabrication @fr
definition: Nationale und internationale Regeln, die die Wissenschaft und Technologie steuern. Diese könnten international gesetzte Standards für die Ausrüstung betreffen und Standards zur Einmischung. @de
definition: 科学と技術を管理する国内または国際的なルール。これらは装置や特許権争いの基準のために設定する国際的基準を含むこともある @ja-jp
definition: The rules, national and international, that govern science and technology. These might include international standards setting for equipment and interference standards. @en-gb
definition: Normas, nacionais ou internacionais, que regulam a ciência e a tecnologia. Podem incluir a fixação de padrões internacionais para equipamento ou padrões de interferência. @pt-br
definition: Normas, nacionais ou internacionais, que regulam a ciência e a tecnologia. Podem incluir a fixação de padrões internacionais para equipamento ou para padrões de interferência. @pt-pt
definition: Las reglamentaciones nacionales e internacionales que rigen la ciencia y la tecnología. Podría incluirse la fijación de normas internacionales con respecto a equipos y normas de interferencia. @es
definition: Norme di fabbricazione nazionali o internazionali
note: nessuno
in scheme: Subject Code
created: 2000-10-30T12:00:00+00:00
modified: 2010-12-15T17:01:09+00:00
broader: Scienza, Tecnologia

Scienza degli animali
type: Concept
preferred label: animal science @en-gb
preferred label: ciência animal @pt-br
preferred label: 畜産学 @ja-jp
preferred label: ciencias animales @es
preferred label: Tierforschung @de
preferred label: Zoologie @fr
definition: Studi e ricerche che riguardano gli animali
definition: Wissenschaft, die sich mit Tieren beschäftigt. @de
definition: Ciencias que involucran animales. @es
definition: Ciência que envolve animais. @pt-pt
definition: Science involving animals @en-gb
definition: Science concernant les animaux @fr
definition: 動物に関する科学 @ja-jp
note: nessuno
in scheme: Subject Code
created: 2000-10-30T12:00:00+00:00
modified: 2010-12-15T17:01:09+00:00
broader: Scienza, Tecnologia

Microscienza
type: Concept
preferred label: 精密科学 @ja-jp
preferred label: Mikroelektronik @de
preferred label: nanociência @pt-br
preferred label: microciencias @es
preferred label: Science de l'infiniment petit @fr
preferred label: micro science @en-gb
definition: Áreas multidisciplinares da nanotecnologia e sistemas microeletromecânicos. @pt-br
definition: Interdisziplinäre Forschungsgebiete der Nanotechnologie und mikro-elektronischer Systeme. @de
definition: The multi-disciplinary areas of nanotechnology and Micro-Electrical Mechanical Systems. @en-gb
definition: ナノ･テクロノジーおよびマイクロ電子機器システムに関する複合的研究分野 @ja-jp
definition: Les différentes aires de discipline de la nanotechnologie et des systèmes mécaniques micro-électriques @fr
definition: Las áreas multidisciplinarias de la nanotecnología y Sistemas Mecánicos Microeléctricos. @es
definition: Aree multidisciplinari della nanotecnologia e i sistemi meccanici microelettrici
note: nessuno
in scheme: Subject Code
created: 2000-10-30T12:00:00+00:00
modified: 2010-12-15T17:01:09+00:00
broader: Scienza, Tecnologia

Oceanografia
type: Concept
preferred label: ciências marinhas @pt-pt
preferred label: Meeresforschung @de
preferred label: Océanographie @fr
preferred label: 海洋科学 @ja-jp
preferred label: marine science @en-gb
preferred label: ciencias marinas @es
definition: 世界の水路および海洋を含む複合的研究分野。これによって、氷の流れのスペクトル観察、漁場研究、水中研究に関連性をもたせることができた @ja-jp
definition: Las áreas multidisciplinarias de investigación que involucran las vías navegables y océanos del mundo. Ello podría incluir la detección hiper-espectral de flujos de hielo, estudios de pesqueras e investigación submarina. @es
definition: Áreas multidisciplinares de investigação que envolvem vias navegáveis e oceanos. Pode incluir a deteção hiperespectral de correntes de gelo, estudos de pesca e investigação submarina. @pt-pt
definition: Áreas multidisciplinares de investigação que envolvem vias navegáveis e oceanos. Pode incluir a detecção hiperespectral de correntes de gelo, estudos de pesca e investigação submarina. @pt-br
definition: La recherche multidisciplinaire sur les voies navigables et les océans y compris la pêche, la recherche sous-marine, et les mouvements de la glace @fr
definition: The multi-disciplinary research areas involving the worlds' waterways and oceans. This could include hyper-spectral sensing of ice flows, fisheries studies and underwater research. @en-gb
definition: Die weltweiten Wasserstraßen und Ozeane umfassenden interdisziplinären Forschungsgebiete. Diese können die hyper-spektralen Verläufe der Eisströme, Fischerei- und Unterwasserforschung beinhalten. @de
definition: Ricerca multidisciplinare sul mare e le vie d'acqua
note: nessuno
in scheme: Subject Code
created: 2000-10-30T12:00:00+00:00
modified: 2010-12-15T17:01:09+00:00
broader: Scienza, Tecnologia

Climatologia, Meteorologia
type: Concept
preferred label: 気象学 @ja-jp
preferred label: ciências meteorológicas @pt-pt
preferred label: cienciasmeteorológicas @es
preferred label: weather science @en-gb
preferred label: Klimaforschung @de
preferred label: Climatologie @fr
definition: Todos os aspetos científicos sobre clima. @pt-pt
definition: All scientific aspects of the weather and climate. @en-gb
definition: Alle wissenschaftlichen Aspekte bezüglich des Wetters und Klimas. @de
definition: Todos os aspectos científicos do tempo e do clima. @pt-br
definition: Todos los aspectos científicos del los fenómenos meteorológicos y el clima. @es
definition: 天気と気候に関する科学的側面のすべて @ja-jp
definition: La science du climat et les aspects scientifiques de la météo @fr
definition: Tutti gli aspetti scientifici riguardanti lo studio delle condizioni atmosferiche e climatiche
note: nessuno
in scheme: Subject Code
created: 2000-10-30T12:00:00+00:00
modified: 2010-12-15T17:01:09+00:00
broader: Scienza, Tecnologia

Elettronica
type: Concept
preferred label: Electronique @fr
preferred label: Elektrotechnik @de
preferred label: eletrônica @pt-br
preferred label: electrónica @es
preferred label: エレクトロニクス @ja-jp
preferred label: eletrónica @pt-pt
preferred label: electronics @en-gb
definition: Ramo da engenharia ou da física que estuda o fluxo controlado de eletrões ou outros portadores de carga elétrica, especialmente em dispositivos semicondutores, incluindo design, fabrico e manutenção de aparelhos eletrónicos. @pt-pt
definition: The branch of engineering or physics concerned with the controlled flow of electrons or other carriers of electric charges, especially in semiconductor devices, including the design, manufacture, and maintenance of electronic devices @en-gb
definition: Incluye novedades y tendencias en las infraestructuras que subyacen el manejo de datos, computadores, chips, transmisión y redes. Por ejemplo, no incluiría transacciones comerciales tales como la compra de Time Warner por AOL, pero sí incluiría un nuevo @es
definition: データ処理、コンピュータ、チップ、伝送、ネットワークの基礎となるインフラの開発と方向性を含む。たとえば、タイムワーナーを買収するAOLのようなビジネス取り引きは含まないが、新しいカーボンナノチューブは含まれる @ja-jp
definition: Branca dell'ingegneria o della fisica che studia il movimento degli elettroni o altri conduttori di cariche elettriche, compresa la progettazione e realizzazione delle apparecchiature elettroniche
definition: Ramo da engenharia ou da física que estuda o fluxo controlado de elétrons ou outros portadores de carga elétrica, especialmente em dispositivos semicondutores, incluindo design, fabrico e manutenção de aparelhos eletrônicos. @pt-br
definition: Umfasst Weiterentwicklungen und Trends in der Infrastruktur, die dem Umgang mit Daten, Computern, Chips, Datenaustausch und Netzwerken zugrunde liegen, aber nicht die kommerzielle Seite des Elektronikmarktes. @de
definition: Branche de l'ingénierie qui étudie la conduction électrique dans le vide, les gaz et les semi-conducteurs, ainsi que les techniques dérivées @fr
note: nessuno
in scheme: Subject Code
created: 2000-10-30T12:00:00+00:00
modified: 2010-12-15T17:01:09+00:00
broader: Scienza, Tecnologia

Tecnologia Identificazione
type: Concept
preferred label: Technologie de l'identification @fr
preferred label: tecnologia de identificação @pt-pt
preferred label: identification technology @en-gb
preferred label: tecnología de identificación @es
preferred label: 認証技術 @ja-jp
preferred label: Technologie zur Identitätsprüfung @de
definition: Nuovi sistemi dell'identificazione, la biometria e l'esame della retina e del volto, ma anche il rapporto tra pricacy e tecnologia
definition: Includes biometrics, new computer-based identification cards, retinal scans, face scanning and mobile augmented reality systems (MARS) and other ways technology can identify individuals. Also technology vs. the privacy of personal information. @en-gb
definition: Inclui novas técnicas ou tecnologias que permitem identificar uma pessoa: biometria, cartões de identificação eletrônicos, reconhecimento da retina, reconhecimento da face e sistemas móveis de realidade aumentada (MARS). Inclui também a questão tecnologia vs. privacidade da informação pessoal. @pt-br
definition: Umfasst Biometrik, neue computerbasierte Personalausweise, Scannen der Netzhaut, Gesichtserkennung, mobile realitätserweiternde Systeme oder MARS, und andere mögliche Technologien, Personen zu identifizieren. @de
definition: Esta categoría aborda la biometría, identificación falsa, nuevas tarjetas de identificación computarizadas, exploraciones retinianas, exploración de rasgos faciales y sistemas móviles de realidad aumentada o MARS. MARS combina una diversidad de tecnologí @es
definition: Les techniques ou technologies permettant d'identifier une personne ; biométrie, carte d'identité électronique, scan de la rétine et du visage, comparaison de l'ADN. Concerne aussi la vie privée face aux nouvelles technologies. @fr
definition: この分野は生物測定学、偽造身分証明書、認証識別機能を持つ新しいコンピュータ、網膜認証、顔認証、そして機動性のある拡張された現実システムあるいはMARSを扱う @ja-jp
definition: Histórias sobre novas técnicas ou tecnologias que permitem identificar uma pessoa: biometria, cartões de identificação eletrónicos, reconhecimento da retina, reconhecimento da face e sistemas móveis de realidade aumentada (MARS). Inclui também a questão tecnologia vs. privacidade da informação pessoal. @pt-pt
note: nessuno
in scheme: Subject Code
created: 2000-10-30T12:00:00+00:00
modified: 2010-12-15T17:01:09+00:00
broader: Scienza, Tecnologia

Matematica
type: Concept
preferred label: matemática @pt-br
preferred label: 数学 @ja-jp
preferred label: Mathematik @de
preferred label: mathematics @en-gb
preferred label: Mathématiques @fr
definition: Insieme delle operazioni logiche applicate al concetto di numero forma e insieme
definition: Estudo das quantidades, formas e suas relações simbólicas. @pt-br
definition: The study of quantities and shapes and their symbolic relationships. @en-gb
definition: Ciência que estuda as quantidades, formas e suas relações simbólicas. @pt-pt
definition: Wissenschaft der Mengen und Formen und ihrer symbolischen Beziehung. @de
definition: Ensemble des opérations logiques que l'homme applique aux concepts de nombre, de forme et d'ensemble @fr
definition: 数量と形、そしてそれらを象徴的に結びつける学問 @ja-jp
definition: El estudio de cantidades y formas y sus relaciones simbólicas. @es
note: nessuno
in scheme: Subject Code
created: 2000-10-30T12:00:00+00:00
modified: 2010-12-15T17:01:09+00:00
broader: Scienza, Tecnologia

Biotecnologia
type: Concept
preferred label: バイオテクノロジー（学術） @ja-jp
preferred label: Biotechnologie @de
preferred label: biotechnology @en-gb
preferred label: biotecnologia @pt-pt
preferred label: biotecnología @es
definition: 科学、医学、あるいは農業のために自然有機体を操作すること @ja-jp
definition: Estudo da manipulação de organismos naturais para fins científicos, médicos ou agrícolas. @pt-pt
definition: Ensemble des procédés et techniques utilisant des procesus biologiques à des fins industrielles, scientifiques, pharmaceutiques ou agricoles @fr
definition: Manipulação de organismos naturais para fins científicos, médicos ou agrícolas. @pt-br
definition: Manipular organismos naturales para propósitos científicos, médicos o agrícolas. @es
definition: Manipulation natürlicher Organismen für wissenschaftliche, medizinische oder agrarwissenschaftliche Zwecke. @de
definition: Manipolazione di organismi naturali per scopi scientifici, medici o agricoli
definition: Manipulating natural organisms for scientific, medical or agricultural purposes @en-gb
note: nessuno
in scheme: Subject Code
created: 2003-04-05T12:00:00+00:00
modified: 2012-07-10T12:00:00+00:00
broader: Scienza, Tecnologia

Ricerca, Tecnologia agricola
type: Concept
preferred label: investigación y tecnología agrícola @es
preferred label: investigação e tecnologia agrícola @pt-br
preferred label: agricultural research and technology @en-gb
preferred label: Agrarwissenschaft @de
preferred label: Agronomie @fr
preferred label: 農業技術 @ja-jp
definition: O que diz respeito ao cultivo de colheitas e à gestão de animais de criação. @pt-br
definition: Metodica applicata alla crescita dei raccolti e alla gestione degli animali da fattoria
definition: Esta relacionado con el crecimiento el cultivo, cosecha y hacerse cargo de una granja de animales. @es
definition: 農作物栽培と酪農経営のこと @ja-jp
definition: Pertaining to the growing of crops and management of farm animals @en-gb
definition: O que diz respeito ao cultivo de colheitas e à gestão de animais de quinta. @pt-pt
definition: Ce qui se rapporte à la croissance des récoltes et à la gestion des animaux fermiers @fr
definition: Betrifft Ackerbau und Viehzucht. @de
note: nessuno
in scheme: Subject Code
created: 2003-04-05T12:00:00+00:00
modified: 2012-07-10T12:00:00+00:00
broader: Scienza, Tecnologia

Nanotecnologia
type: Concept
preferred label: ナノテク @ja-jp
preferred label: nanotecnología @es
preferred label: nanotecnologia @pt-pt
preferred label: nanotechnology @en-gb
preferred label: Nanotechnologie @fr
definition: 分子尺度で物体を操作すること @ja-jp
definition: Manipular objetos a escala molecular. @es
definition: Manipulation von Objekten auf der molekularen Stufe. @de
definition: Les techniques à l'échelle moléculaire @fr
definition: Manipulação de objetos à escala molecular. @pt-br
definition: Tecnologia e tecniche applicate su scala molecolare
definition: Manipulating objects at the molecular scale @en-gb
note: nessuno
in scheme: Subject Code
created: 2003-04-05T12:00:00+00:00
modified: 2012-07-10T12:00:00+00:00
broader: Scienza, Tecnologia

Scienze informatiche
type: Concept
preferred label: tecnologias de informação @pt-pt
preferred label: ＩＴ・コンピューター @ja-jp
preferred label: IT/computer sciences @en-gb
preferred label: ciencias informáticas @es
preferred label: Informatik @de
preferred label: Science de l'informatique @fr
definition: Studio e il progetto di sistemi e reti informatiche
definition: Estudo e desenvolvimento de sistemas e redes computacionais. @pt-br
definition: Studium und Gestaltung von Computersystemen und Netzwerken. @de
definition: コンピュータシステムとネットワークについての研究とデザイン @ja-jp
definition: L'étude et la conception d'ordinateurs et de réseaux @fr
definition: The study and design of computer systems and networks. @en-gb
definition: Estudio y diseño de redes y sistemas de computación. @es
note: nessuno
in scheme: Subject Code
created: 2003-04-05T12:00:00+00:00
modified: 2012-07-10T12:00:00+00:00
broader: Scienza, Tecnologia

Istituzioni scientifiche
type: Concept
preferred label: Wissenschaftliche Institution @de
preferred label: instituições científicas @pt-pt
preferred label: Institutions scientifiques @fr
preferred label: 科学研究機関 @ja-jp
preferred label: scientific institutions @en-gb
preferred label: instituciones científicas @es
definition: Instituciones que desarrollan o comandan trabajos científicos. @es
definition: Instituições que realizam ou gerem o trabalho científico (e.g. Academia das Ciências). @pt-br
definition: Institutions that carry out or govern scientific work (e.g. National Academy of Arts and Sciences ) @en-gb
definition: Institutionen, die wissenschaftliches Arbeiten verwirklichen oder leiten, wie z.B die Deutsche Akademie der Wissenschaft. @de
definition: 科学に関する仕事を実行、管理する公共機関(例えば、文化系と理科系の国家のアカデミー) @ja-jp
definition: Enti che realizzano o coordinano la ricerca ed il lavoro scientifico
definition: Les institutions telles que l'Académie des Sciences @fr
definition: Instituições que realizam ou gerem trabalho científico (e.g. Academia das Ciências). @pt-pt
note: nessuno
in scheme: Subject Code
created: 2003-11-26T12:00:00+00:00
modified: 2012-07-10T12:00:00+00:00
broader: Scienza, Tecnologia

Fisica
type: Concept
preferred label: física @es
preferred label: Physik @de
preferred label: 物理学 @ja-jp
preferred label: Physique @fr
preferred label: physics @en-gb
definition: Estudio de las propiedades y cambios de la materia. @es
definition: Studio delle proprietà e dei cambiamenti che subisce la materia
definition: Studium der Eigenschaften und Veränderungen von Materie. @de
definition: 物体の性質と変化についての学問 @ja-jp
definition: Estudo das propriedades e das mudanças da matéria. @pt-br
definition: The study of the properties and changes of matter @en-gb
definition: L'étude des propriétés de la matière et la détermination des lois qui la régissent @fr
note: nessuno
in scheme: Subject Code
created: 2003-04-05T12:00:00+00:00
modified: 2012-07-10T12:00:00+00:00
broader: Scienza applicata

Chimica
type: Concept
preferred label: química @pt-pt
preferred label: chemistry @en-gb
preferred label: Chimie @fr
preferred label: 化学 @ja-jp
preferred label: Chemie @de
definition: L'étude de la composition et des propriétés des corps, de leurs actions mutuelles et des transformations qu'ils peuvent subir @fr
definition: The study of the composition and reaction of substances @en-gb
definition: Studium der Zusammensetzung und Reaktion von Stoffen. @de
definition: 物質の合成や反応についての学問 @ja-jp
definition: Estudio de la composición y reacción de las substancias. @es
definition: Studio della composizione e del modo di reagire fra loro delle varie sostanze
definition: Estudo da composição e da reação das substâncias. @pt-pt
note: nessuno
in scheme: Subject Code
created: 2003-04-05T12:00:00+00:00
modified: 2012-07-10T12:00:00+00:00
broader: Scienza applicata

Cosmologia
type: Concept
preferred label: cosmología @es
preferred label: cosmologia @pt-br
preferred label: Cosmologie @fr
preferred label: Kosmologie @de
preferred label: cosmology @en-gb
preferred label: 宇宙論 @ja-jp
definition: Estudio sobre la organización y estructura del Universo. @es
definition: 宇宙の構成と構造に関する研究 @ja-jp
definition: Estudo da organização e da estrutura do universo. @pt-pt
definition: Etude de l'organisation et de la structure de l'Univers @fr
definition: Studio dell'organizzazione e della struttura dell'universo
definition: Study of the organization and structure of the universe @en-gb
definition: Wissenschaft von der Struktur und Organisation des Universums. @de
note: nessuno
in scheme: Subject Code
created: 2004-10-13T12:00:00+00:00
modified: 2012-07-10T12:00:00+00:00
broader: Scienza applicata

Fisica Particelle
type: Concept
preferred label: partículas físicas @es
preferred label: Teilchenphysik @de
preferred label: física de partículas @pt-pt
preferred label: 粒子物理学 @ja-jp
preferred label: particle physics @en-gb
preferred label: Physique des particules @fr
definition: 高エネルギー粒子を使った素粒子と原子核に関する研究 @ja-jp
definition: Estudo das partículas elementares e dos núcleos atômicos através do emprego de partículas de alta energia. @pt-br
definition: Estudo das partículas elementares e dos núcleos atómicos através do emprego de partículas de alta energia. @pt-pt
definition: Etude des particules élémentaires et des noyaux des atomes par l'utilisation de particules de haute énergie @fr
definition: The study of elementary particles and atomic nuclei through the use of high-energy particles @en-gb
definition: Wissenschaft der Elementarteilchen, Atomkerne durch den Gebrauch von energiereichen Teilchen. @de
definition: El estudio de partículas elementales y de núcleos atómicos con el uso de partículas de gran energía @es
definition: Studio delle particelle elementari e atomiche
note: nessuno
in scheme: Subject Code
created: 2004-10-13T12:00:00+00:00
modified: 2012-07-10T12:00:00+00:00
broader: Scienza applicata

Scienza Materiali
type: Concept
preferred label: Science des matériaux @fr
preferred label: material science @en-gb
preferred label: ciência dos materiais @pt-pt
preferred label: 材料科学 @ja-jp
preferred label: material científico @es
preferred label: Materialwissenschaft @de
definition: Estudo dos materiais usados no fabrico de diversos produtos. @pt-pt
definition: Etude des matériaux utilisés dans la fabrication de produits @fr
definition: El estudio de materiales usados en la manufactura. @es
definition: Wissenschaft von Materialien, die in der Industrie verwendet werden. @de
definition: Studio dei materiali usati nella fabbricazione di prodotti
definition: The study of materials used in manufacturing @en-gb
definition: 製造で使用される原材料に関する研究 @ja-jp
note: nessuno
in scheme: Subject Code
created: 2004-10-13T12:00:00+00:00
modified: 2012-07-10T12:00:00+00:00
broader: Ingegneria

Scienze sociali
type: Concept
preferred label: 社会科学 @ja-jp
preferred label: Sozialwissenschaften @de
preferred label: social sciences @en-gb
preferred label: ciências sociais @pt-br
preferred label: ciencias sociales @es
preferred label: Sciences sociales @fr
definition: The study of people living in groups, as families, tribes and communities @en-gb
definition: Studio degli individui organizzati in gruppi sociali: famiglie, tribu, comunità ecc.
definition: 家族、種族、共同体といった集団生活をする人々の学問 @ja-jp
definition: Estudo das pessoas que vivem em grupos, como famílias, tribos e comunidades. @pt-br
definition: Estudio de cómo la gente vive en grupos, como familias, tribus y comunidades. @es
definition: Studium der Menschen in Gruppen, wie Familien, Stämme und Gemeinschaften. @de
definition: L'étude des groupes sociaux tels que familles, tribus et communautés @fr
note: nessuno
in scheme: Subject Code
created: 2003-04-05T12:00:00+00:00
modified: 2012-07-10T12:00:00+00:00
broader: Scienze umane

Storia
type: Concept
preferred label: história @pt-br
preferred label: history @en-gb
preferred label: 歴史学 @ja-jp
preferred label: Histoire @fr
preferred label: historia @es
preferred label: Geschichte @de
definition: Studio della conoscenza di eventi umani accaduti nel passato
definition: 人類の過去の出来事についての学問 @ja-jp
definition: Estudo de eventos humanos do passado. @pt-pt
definition: Studium menschlicher Ereignisse der Vergangenheit. @de
definition: Estudio de sucesos humanos en el pasado. @es
definition: The study of human events of the past @en-gb
definition: Science de la connaissance du passé @fr
note: nessuno
in scheme: Subject Code
created: 2003-04-05T12:00:00+00:00
modified: 2012-07-10T12:00:00+00:00
broader: Scienze umane

Psicologia
type: Concept
preferred label: 心理学 @ja-jp
preferred label: psicologia @pt-pt
preferred label: psychology @en-gb
preferred label: psicología @es
preferred label: Psychologie @fr
definition: Estudo da mente humana e dos processos mentais e emocionais. @pt-br
definition: 人間の心、精神、感情の動きに関する学問 @ja-jp
definition: Estudio de la mente humana y los procesos emocionales y mentales. @es
definition: Studio scientifico dei processi mentali ed emotivi
definition: Etude scientifique des faits psychiques : processus mentaux, mémoire,… @fr
definition: Studium des menschlichen Verstandes, des Geistes und emotionaler Vorgänge. @de
definition: The study of the human mind and mental and emotional processes @en-gb
note: nessuno
in scheme: Subject Code
created: 2003-04-05T12:00:00+00:00
modified: 2012-07-10T12:00:00+00:00
broader: Scienze umane

Sociologia
type: Concept
preferred label: sociología @es
preferred label: sociologia @pt-pt
preferred label: Sociologie @fr
preferred label: Soziologie @de
preferred label: sociology @en-gb
preferred label: 社会学 @ja-jp
definition: Studio delle relazioni sociali, della loro organizzazione e cambiamenti
definition: Estudo das relações sociais humanas, organização e mudança. @pt-br
definition: The study of human social relations, organization and change @en-gb
definition: L'étude des faits sociaux humains @fr
definition: Studium menschlicher Beziehungen, Organisationen und Veränderungen. @de
definition: Estudio de las relaciones sociales humanas, organizaciones y cambios. @es
definition: 人間の社会の関係、体制、変化に関する学問 @ja-jp
note: nessuno
in scheme: Subject Code
created: 2003-04-05T12:00:00+00:00
modified: 2012-07-10T12:00:00+00:00
broader: Scienze umane

Antropologia
type: Concept
preferred label: Anthropologie @de
preferred label: antropologia @pt-br
preferred label: antropología @es
preferred label: anthropology @en-gb
preferred label: 人類学 @ja-jp
definition: Estudo de seres humanos em grupos ou sociedades. @pt-br
definition: Estudo do comportamento de seres humanos em grupos ou sociedades. @pt-pt
definition: グループあるいは社会における人間に関する学問 @ja-jp
definition: Etude des cultures des différentes collectivités humaines @fr
definition: Studio delle culture nelle varie collettività, gruppi, società in cui l'uomo si organizza
definition: The study of human beings in groups or societies @en-gb
definition: Studium des Menschen in Gruppen oder Gesellschaften. @de
definition: Estudio de los seres humanos en grupos o sociedades. @es
note: nessuno
in scheme: Subject Code
created: 2003-04-05T12:00:00+00:00
modified: 2012-07-10T12:00:00+00:00
broader: Scienze umane

Geologia
type: Concept
preferred label: Géologie @fr
preferred label: 地質学 @ja-jp
preferred label: geología @es
preferred label: Geologie @de
preferred label: geology @en-gb
preferred label: geologia @pt-pt
definition: Estudio de los procesos físicos de la tierra. @es
definition: Estudo dos processos físicos da Terra. @pt-br
definition: Studium physikalischer Erdprozesse. @de
definition: L'étude de l'écorce terrestre, de ses constituants, de son histoire et de sa génèse @fr
definition: 地球の物理的な過程に関する学問 @ja-jp
definition: The study of Earth's physical processes @en-gb
definition: Studio dei processi fisici della Terra
note: nessuno
in scheme: Subject Code
created: 2003-04-05T12:00:00+00:00
modified: 2012-07-10T12:00:00+00:00
broader: Scienze naturali

Paleontologia
type: Concept
preferred label: 古生物学 @ja-jp
preferred label: Paläontologie @de
preferred label: paleontologia @pt-br
preferred label: Paléontologie @fr
preferred label: paleontología @es
preferred label: paleontology @en-gb
definition: The study of ancient animals @en-gb
definition: Estudio de antiguos animales @es
definition: Estudo de animais antigos. @pt-br
definition: Studium ausgestorbener Tiere. @de
definition: Studio degli animali preistorici e degli esseri viventi del passato
definition: L'étude des êtres vivants du passé @fr
definition: 古代動物に関する学問 @ja-jp
note: nessuno
in scheme: Subject Code
created: 2003-04-05T12:00:00+00:00
modified: 2012-07-10T12:00:00+00:00
broader: Scienze naturali

Geografia
type: Concept
preferred label: Géographie @fr
preferred label: 地理学 @ja-jp
preferred label: geografía @es
preferred label: geography @en-gb
preferred label: geografia @pt-pt
preferred label: Geografie @de
definition: 地表や政治的な領土、領海、国境に関する学問 @ja-jp
definition: Estudo da superfície da Terra e das suas divisões políticas. @pt-br
definition: Science qui a pour objet, l'observation, la description et l'explication des phénomènes physiques et humains à la surface du globe et l'étude de leur répartition @fr
definition: The study of the surface of Earth and its political divisions @en-gb
definition: Estudio de la superficie de la tierra y sus divisiones políticas. @es
definition: Scienza che ha per oggetto l'osservazione, descrizione e spiegazione dei vari fenomeni sulla superficie terrestre e le divisioni politiche
definition: Studium der Erdoberfläche und ihrer politischen Einteilung. @de
note: nessuno
in scheme: Subject Code
created: 2003-04-05T12:00:00+00:00
modified: 2012-07-10T12:00:00+00:00
broader: Scienze naturali

Botanica
type: Concept
preferred label: Botanik @de
preferred label: botânica @pt-br
preferred label: 植物学 @ja-jp
preferred label: Botanique @fr
preferred label: botany @en-gb
preferred label: botánica @es
definition: Estudo das plantas. @pt-pt
definition: Studium von Pflanzen. @de
definition: Estudio de las plantas @es
definition: L'étude des végétaux @fr
definition: 植物に関する学問 @ja-jp
definition: The study of plants @en-gb
definition: Studio delle piante
note: nessuno
in scheme: Subject Code
created: 2003-04-05T12:00:00+00:00
modified: 2012-07-10T12:00:00+00:00
broader: Scienze naturali

Zoologia
type: Concept
preferred label: Zoologie @de
preferred label: zoología @es
preferred label: zoologia @pt-pt
preferred label: 動物学 @ja-jp
preferred label: zoology @en-gb
definition: 動物に関する学問 @ja-jp
definition: Studio degli animali
definition: Studium von Tieren. @de
definition: Estudo dos animais. @pt-pt
definition: The study of animals @en-gb
definition: Estudio de los animales @es
definition: L'étude des animaux @fr
note: nessuno
in scheme: Subject Code
created: 2003-04-05T12:00:00+00:00
modified: 2012-07-10T12:00:00+00:00
broader: Scienze naturali

Fisiologia
type: Concept
preferred label: Physiologie @fr
preferred label: 生理学 @ja-jp
preferred label: fisiologia @pt-br
preferred label: Biologie @de
preferred label: physiology @en-gb
preferred label: fisiología @es
definition: The study of vital processes of living organisms @en-gb
definition: Estudio del proceso vital de los organismos vivientes. @es
definition: Estudo dos processos vitais dos organismos vivos. @pt-br
definition: 活動している生体の生命過程に関する学問 @ja-jp
definition: Studio dei processi vitali degli organismi viventi
definition: L'étude des phénomènes vitaux et des mécanismes qui règlent le fonctionnement des êtres vivants @fr
definition: Studium von lebenden Organismen. @de
note: nessuno
in scheme: Subject Code
created: 2003-04-05T12:00:00+00:00
modified: 2012-07-10T12:00:00+00:00
broader: Scienze naturali

Astronomia
type: Concept
preferred label: astronomy @en-gb
preferred label: Astronomie @de
preferred label: 天文学 @ja-jp
preferred label: astronomia @pt-br
preferred label: astronomía @es
definition: El estudio de las estrellas y los planetas. @es
definition: Estudo das estrelas e dos planetas. @pt-br
definition: Etude des étoiles et des planètes @fr
definition: The study of the stars and planets @en-gb
definition: Studium der Sterne und Planeten. @de
definition: 星と惑星に関する研究 @ja-jp
definition: Studio degli astri e dei pianeti
note: nessuno
in scheme: Subject Code
created: 2004-10-13T12:00:00+00:00
modified: 2012-07-10T12:00:00+00:00
broader: Scienze naturali

Biologia
type: Concept
preferred label: biologia @pt-br
preferred label: Biologie @fr
preferred label: 生物学 @ja-jp
preferred label: biology @en-gb
preferred label: biología @es
definition: 生命がある有機体に関する研究 @ja-jp
definition: Studio degli organismi viventi
definition: Estudo dos organismos vivos. @pt-pt
definition: Etude des organismes vivants @fr
definition: EL estudio de los organizmos vivientes. @es
definition: The study of living organisms @en-gb
definition: Studium der lebenden Organismen. @de
note: nessuno
in scheme: Subject Code
created: 2004-10-13T12:00:00+00:00
modified: 2012-07-10T12:00:00+00:00
broader: Scienze naturali

Indagini, Sondaggi
type: Concept
preferred label: estudio @es
preferred label: 商品化調査 @ja-jp
preferred label: survey @en-gb
preferred label: Umfrage @de
preferred label: pesquisa @pt-br
preferred label: Enquête sociologique @fr
definition: 商品の品質、サービスの価値などのような、多種の主題または問題に沿った、公的な姿勢の審査 @ja-jp
definition: Sondagem das atitudes públicas relativamente a vários assuntos ou questões, como a qualidade de bens, o valor de serviços, etc. @pt-pt
definition: Esami delle opinioni e tendenze su vari argomenti o fatti, come la qualità dei beni, il valore dei servizi, ecc...
definition: Erhebung der öffentlichen Meinung zu verschiedenen Themen, wie z.B Produktqualität oder Verbraucherzufriedenheit etc. @de
definition: Sondage de l'opinion publique sur des sujets variés comme la qualité de produits, de services @fr
definition: Examinación de actitudes públicas o varios sujetos o asuntos, como la calidad de @es
definition: Examination of public attitudes on various subjects or issues, such as the quality of goods, the value of services etc. @en-gb
note: nessuno
in scheme: Subject Code
created: 2004-04-22T12:00:00+00:00
modified: 2012-07-10T12:00:00+00:00
broader: Ricerca

Missilistica
type: Concept
preferred label: ロケット工学 @ja-jp
preferred label: cohetería @es
preferred label: Raketentechnik @de
preferred label: rocketry @en-gb
preferred label: Fuséologie @fr
preferred label: fusologia @pt-pt
definition: Desenvolvimento de foguetes espaciais. @pt-br
definition: Sviluppo di missili
definition: Le développement des fusées @fr
definition: ロケットの開発 @ja-jp
definition: Die Entwicklung von Raketen. @de
definition: El desarrollo de cohetes. @es
definition: Desenvolvimento de foguetes. @pt-pt
definition: The development of rockets @en-gb
note: nessuno
in scheme: Subject Code
created: 2004-10-13T12:00:00+00:00
modified: 2012-07-10T12:00:00+00:00
broader: Tecnologia (generico)

Laser
type: Concept
preferred label: laser @pt-pt
preferred label: レーザー工学 @ja-jp
preferred label: láser @es
preferred label: Lasertechnik @de
definition: El desarrollo y uso de la amplificación de la luz mediante la emisión estimulante de la radiación @es
definition: レーザー(放射の誘導放出による光の増幅作用)の開発および使用 @ja-jp
definition: Sviluppo e uso dell'amplificazione della luce attraverso l'emissione stimolata di radiazione
definition: The development and use of light amplification by stimulated emission of radiation @en-gb
definition: Desenvolvimento e utilização de amplificação de luz por emissão estimulada de radiação. @pt-pt
definition: Le développement et l'utilisation de l'amplification de la lumière par une émission stimulée de radiations @fr
definition: Die Entwicklung und Nutzung von Lichtverstärkung durch angeregte Strahlungsaussendung (LASER). @de
definition: Desenvolvimento e utilização de amplificação de luz por emissão estimulada de radiação (laser). @pt-br
note: nessuno
in scheme: Subject Code
created: 2004-10-13T12:00:00+00:00
modified: 2012-07-10T12:00:00+00:00
broader: Tecnologia (generico)
broad match: http://cv.iptc.org/newscodes/mediatopic/13000000

Sociale
type: Concept
preferred label: Gesellschaft @de
preferred label: Société @fr
preferred label: questões sociais @pt-br
preferred label: asuntos sociales @es
preferred label: social issue @en-gb
preferred label: 社会 @ja-jp
definition: Aspectos del comportamiento humano que afectan la calidad de vida. @es
definition: Aspects of the behaviour of humans affecting the quality of life. @en-gb
definition: 生活の質に影響を与える人間の行動に関すること @ja-jp
definition: Aspekte des menschlichen Verhaltens bezüglich der Lebensqualität. @de
definition: Aspetos do comportamento dos humanos que afetam a sua qualidade de vida. @pt-pt
definition: Aspectos do comportamento dos humanos que afetam sua qualidade de vida. @pt-br
definition: Aspetti del comportamento umano che influiscono sulla qualità della vita
definition: Aspect du comportement des individus qui affecte la qualité de la vie @fr
note: nessuno
in scheme: Subject Code
created: 2000-10-30T12:00:00+00:00
modified: 2010-12-15T17:01:09+00:00
narrower: Dipendenze
narrower: Beneficenza
narrower: Demografia
narrower: Disabilità
narrower: Eutanasia, Suicidio assistito
narrower: Famiglia
narrower: Pianificazione familiare
narrower: Assicurazioni sanitarie
narrower: Senzatetto
narrower: Minoranze
narrower: Pornografia
narrower: Povertà
narrower: Prostituzione
narrower: Razzismo
narrower: Welfare
narrower: Aborto
narrower: Persone scomparse
narrower: Assistenza a lungo termine
narrower: Delinquenza giovanile
narrower: Vittime Radiazioni nucleari
narrower: Schiavitù, Lavoro minorile
narrower: Abusi, Torture
narrower: Morte
narrower: Gente, Persone
narrower: Questioni sociali (generico)
narrower: Bonifica Bellica
narrower: Ricostruzione

Dipendenze
type: Concept
preferred label: adição @pt-br
preferred label: Sucht @de
preferred label: dependência @pt-pt
preferred label: 依存症 @ja-jp
preferred label: Toxicomanie @fr
preferred label: adicciones @es
preferred label: addiction @en-gb
definition: The habitual and often uncontrollable use of harmful substances such as alcohol, tobacco and pharmaceuticals or drugs @en-gb
definition: Consumo habitual e normalmente incontrolável de substâncias nocivas, como álcool, tabaco, medicamentos ou drogas. @pt-br
definition: Gewohnheitsmäßiges und meist unkontrolliertes Konsumieren von gefährlichen Stoffen, wie Alkohol, Tabak, Medikamente oder Drogen. @de
definition: Abituale e spesso incontrollabile consumo di sostanze quali alcol, tabacco, droghe
definition: アルコールやたばこや製薬品やドラッグなどの有害物質の常習的でコントロールできない摂取 @ja-jp
definition: El uso habitual y normalmente incontrolable de sustancias dañinas tales como el alcoól, tabaco fármacos o drogas. @es
definition: L'utilisation de plus en plus répétitive et souvent incontrollable de substances nocives telles que l'alcool, le tabac, les médicaments ou les drogues @fr
note: nessuno
in scheme: Subject Code
created: 2000-10-30T12:00:00+00:00
modified: 2010-12-15T17:01:09+00:00
broader: Sociale

Beneficenza
type: Concept
preferred label: 慈善活動 @ja-jp
preferred label: beneficencia @es
preferred label: filantropia @pt-br
preferred label: charity @en-gb
preferred label: Karitatives @de
preferred label: Activités caritatives @fr
definition: Philanthropic giving @en-gb
definition: Menschenfreundliche Gabe. @de
definition: 社会奉仕の付与 @ja-jp
definition: Un acte de générosité envers autrui, don, aumône @fr
definition: Entrega filantrópica @es
definition: Doação filantrópica. @pt-br
definition: Iniziative filantropiche, Donazioni, Atti di generosità verso qualcuno
note: nessuno
in scheme: Subject Code
created: 2000-10-30T12:00:00+00:00
modified: 2010-12-15T17:01:09+00:00
broader: Sociale

Demografia
type: Concept
preferred label: Démographie @fr
preferred label: Bevölkerungsentwicklung @de
preferred label: demographics @en-gb
preferred label: 人口統計 @ja-jp
preferred label: demografía @es
preferred label: demografia @pt-br
definition: Estudo dos povos, do lugar onde habitam e do modo como interagem. @pt-pt
definition: 人々がどこで暮らし、どのように作用しあっているかの調査 @ja-jp
definition: El estudio de la gente, cómo viven y cómo interactuan. @es
definition: The study of people and here they live and how they interact @en-gb
definition: Studio delle persone, come vivono e come interagiscono
definition: Science qui décrit et étudie les peuples et les populations @fr
definition: Das Studium der Menschen, und hier ihr Leben und ihre Beziehungen. @de
note: nessuno
in scheme: Subject Code
created: 2000-10-30T12:00:00+00:00
modified: 2010-12-15T17:01:09+00:00
broader: Sociale
narrower: Censimento
narrower: Immigrazione
narrower: Immigrazione clandestina
narrower: Emigrazione

Disabilità
type: Concept
preferred label: 障害者 @ja-jp
preferred label: deficientes @pt-pt
preferred label: Behinderte @de
preferred label: disabled @en-gb
preferred label: Handicapés @fr
preferred label: discapacitados @es
definition: Estar incapacitado física, emocional ou mentalmente. @pt-pt
definition: Being incapacitated either physically, emotionally or mentally @en-gb
definition: Estar descapacitado, ya sea fisica, emocional o mentalmente. @es
definition: Sowohl körperlich, als auch psychisch oder geistig eingeschränkt sein. @de
definition: Etat d'incapacité physique, émotionnelle ou mentale @fr
definition: 身体的、感情的、精神的のいずれかに障害がある人 @ja-jp
definition: Stato di incapacità fisica, emotiva o mentale; Handicap
note: nessuno
in scheme: Subject Code
created: 2000-10-30T12:00:00+00:00
modified: 2010-12-15T17:01:09+00:00
broader: Sociale

Eutanasia, Suicidio assistito
type: Concept
preferred label: euthanasia (also includes assisted suicide) @en-gb
preferred label: eutanasia @es
preferred label: Euthanasie @fr
preferred label: suicídio assistido e eutanásia @pt-br
preferred label: 安楽死 @ja-jp
preferred label: Euthanasie/Sterbehilfe @de
definition: Morte voluntária de uma pessoa com ajuda de outra(s). @pt-br
definition: Freiwilliger Tod durch fremde Hilfe. @de
definition: Muerte voluntaria de una persona con la ayuda de otra. @es
definition: 別人の助けをかりた自発的な死 @ja-jp
definition: Morte volontaria con l'aiuto di un'altra persona
definition: Voluntary death with the aid of another @en-gb
definition: Mort volontaire provoquée dans le but d'abréger les souffrances d'un malade incurable @fr
note: nessuno
in scheme: Subject Code
created: 2000-10-30T12:00:00+00:00
modified: 2010-12-15T17:01:09+00:00
broader: Sociale
narrower: Suicidio

Famiglia
type: Concept
preferred label: família @pt-pt
preferred label: 家族 @ja-jp
preferred label: Familie @de
preferred label: familia @es
preferred label: family @en-gb
preferred label: Famille @fr
definition: Groupe de personnes unies par les liens du sang ou du mariage @fr
definition: Grupo de indivíduos relacionados por laços de sangue e casamento. @pt-pt
definition: A group of individuals related by blood or marriage @en-gb
definition: Eine Personengruppe, die durch Blut oder Heirat miteinander verwandt ist. @de
definition: Chi è legato da vincoli di sangue o da un legame molto stretto come il matrimonio
definition: 血または結婚で関係した個人のグループ @ja-jp
definition: Un grupo de individuos relalacionados por sangre o por matrimonio. @es
note: nessuno
in scheme: Subject Code
created: 2000-10-30T12:00:00+00:00
modified: 2010-12-15T17:01:09+00:00
broader: Sociale
narrower: Genitori, Figli
narrower: Adozione
narrower: Matrimonio
narrower: Divorzio
narrower: Sesso
narrower: Corteggiamento

Pianificazione familiare
type: Concept
preferred label: 家族計画 @ja-jp
preferred label: Geburtenkontrolle/Familienplanung @de
preferred label: Contrôle des naissances @fr
preferred label: planejamento familiar @pt-br
preferred label: planificación familiar @es
preferred label: family planning @en-gb
preferred label: planeamento familiar @pt-pt
definition: Bewusste Entscheidungen und Bemühungen in Bezug auf die Fortpflanzung/Reproduktion. @de
definition: Decisión consciente y esfuerzos relacionados a la reproducción humana. @es
definition: Attenzione nel controllo delle nascite.
definition: Decisões conscientes e esforços relativos à reprodução humana. @pt-pt
definition: Conscious decisions and efforts involving reproduction @en-gb
definition: 意識的な決断と生殖に関わる努力 @ja-jp
definition: Le contrôle des naissances @fr
note: nessuno
in scheme: Subject Code
created: 2000-10-30T12:00:00+00:00
modified: 2010-12-15T17:01:09+00:00
broader: Sociale

Assicurazioni sanitarie
type: Concept
preferred label: seguro de salud @es
preferred label: Assurance maladie @fr
preferred label: 健康保険 @ja-jp
preferred label: seguro de saúde @pt-pt
preferred label: Zusatzversicherung @de
preferred label: health insurance @en-gb
definition: Seguro que cubre los gastos médicos extraordinarios. @es
definition: Assicurazioni per la copertura degli oneri legati alla cura delle malattie
definition: Versicherung, die besondere medizinische Kosten übernimmt. @de
definition: Assurance couvrant les frais de maladie @fr
definition: Seguro que cobre custos médicos extraordinários. @pt-br
definition: Insurance covering extraordinary medical costs @en-gb
definition: 驚異的な医療費をカバーしている保険 @ja-jp
note: nessuno
in scheme: Subject Code
created: 2000-10-30T12:00:00+00:00
modified: 2010-12-15T17:01:09+00:00
broader: Sociale

Senzatetto
type: Concept
preferred label: Sans abris @fr
preferred label: ホームレス @ja-jp
preferred label: Obdachlose @de
preferred label: sem-teto @pt-br
preferred label: homelessness @en-gb
preferred label: falta de vivienda @es
preferred label: sem-abrigo @pt-pt
definition: Der Mangel an festem Wohnsitz. @de
definition: 一定の居住場所を持たない人々 @ja-jp
definition: Pessoa sem local de morada fixa, que vive na rua ou em abrigos improvisados. @pt-pt
definition: Les sans-abris @fr
definition: Falta de un lugar establecido para habitar. @es
definition: Lacking a fixed place of residence @en-gb
definition: Chi non ha un posto fisso dove vivere
note: nessuno
in scheme: Subject Code
created: 2000-10-30T12:00:00+00:00
modified: 2010-12-15T17:01:09+00:00
broader: Sociale

Minoranze
type: Concept
preferred label: minorias @pt-br
preferred label: grupos minoritarios @es
preferred label: Minorités @fr
preferred label: マイノリティー @ja-jp
preferred label: minority group @en-gb
preferred label: Minderheit @de
definition: Eine Gruppe von Menschen, die klassifiziert wird aufgrund ihrer Abstammung, Sprache, Religion oder anderer Merkmale, die weniger häufig sind als die der anderen aus der Gruppe. @de
definition: Grupo de pessoas classificadas por raça, língua, religião ou outras características, numericamente inferiores a outros da mesma classificação. @pt-pt
definition: Gruppi di persone classificati in base a razza, lingua, religione o altre caratteristiche, di numero inferiore rispetto ad altri gruppi
definition: Un grupo de personas clasificado por raza, lenguaje, religión u otras características, numeralmente menores que otros del la misma clasificación. @es
definition: Groupe de personnes identifiées par la race, la langue, la religion ou d'autres caractéristiques numériquement moins nombreux que d'autres dans le même ensemble @fr
definition: 同じ分類の他より数値的に少ない人種、言語、宗教または他の特徴によって分類されるグループ @ja-jp
definition: A group of people classified by race, language, religion or other characteristic numerically smaller than others of the same classification @en-gb
note: nessuno
in scheme: Subject Code
created: 2000-10-30T12:00:00+00:00
modified: 2010-12-15T17:01:09+00:00
broader: Sociale
narrower: Omosessualità
narrower: Minoranze nazionali, etniche

Pornografia
type: Concept
preferred label: pornografia @pt-br
preferred label: pornography @en-gb
preferred label: Pornographie @fr
preferred label: ポルノ @ja-jp
preferred label: pornografía @es
preferred label: Pornografie @de
definition: Audio or visual depictions of various sex related acts considered outside accepted community standards @en-gb
definition: Production de livres, films, ou autres d'une obscénité à caractère sexuel hors des normes acceptées par la société @fr
definition: 認められたコミュニティ標準から外れたと考えられる性に関連する様々な行為の音声あるいは視覚的な描写 @ja-jp
definition: Representações em fotos, áudio ou vídeo de vários atos sexuais de forma explícita. @pt-pt
definition: representación auditiva o visual de varios actos relacionados al sexo, considerados fuera de los estándares aceptados por la comunidad. @es
definition: Akustische oder bildliche Darstellungen von verschiedenartigen im Zusammenhang mit Sexualität stehenden Taten, außerhalb der gesellschaftlich akzeptierten Normen. @de
definition: Produzione di libri, film o altro caratterizzati da argomenti di tipo sessuale considerati al di fuori degli standards
definition: Representações em áudio ou vídeo de vários atos sexuais considerados fora dos padrões aceitos por uma comunidade. @pt-br
note: nessuno
in scheme: Subject Code
created: 2000-10-30T12:00:00+00:00
modified: 2010-12-15T17:01:09+00:00
broader: Sociale

Povertà
type: Concept
preferred label: 貧困 @ja-jp
preferred label: Pauvreté @fr
preferred label: Armut @de
preferred label: pobreza @es
preferred label: poverty @en-gb
definition: Having insufficient resources to provide for basic services to oneself or family @en-gb
definition: Insuficiência de recursos para garantir os serviços básicos e a subsistência de alguém ou da sua família. @pt-pt
definition: Avere risorse insufficienti necessarie alla propria esistenza
definition: Insuficiência de recursos para garantir os serviços básicos e a subsistência de alguém ou de sua família. @pt-br
definition: Sufrir la insuficiencia de recursos para proveer los servicios básicos a uno mismo o la familia. @es
definition: 自分または家族を十分に養うことができないこと @ja-jp
definition: Unzureichende Möglichkeiten sich selbst oder die eigene Familie zu versorgen. @de
definition: Insuffisance des ressources nécessaires à la vie @fr
note: nessuno
in scheme: Subject Code
created: 2000-10-30T12:00:00+00:00
modified: 2010-12-15T17:01:09+00:00
broader: Sociale

Prostituzione
type: Concept
preferred label: 売春 @ja-jp
preferred label: prostitución @es
preferred label: Prostitution @de
preferred label: prostituição @pt-br
preferred label: prostitution @en-gb
definition: Prêt de son corps aux désirs sexuels d'autrui contre rémunération et ceux qui en profite @fr
definition: Sex for sale, either male or female, and those who profit from it @en-gb
definition: 男性または女性に性を売り、それで利益を得る人々 @ja-jp
definition: Venta de sexo, ya sea masculino o femenino, y aquellos que se benefician de ello. @es
definition: Venda de sexo, masculino ou feminino, e aqueles que beneficiam dessa venda. @pt-pt
definition: Männliche oder weibliche Sexualität als Ware, und diejenigen, die davon profitieren. @de
definition: Prestazioni sessuali a pagamento
note: nessuno
in scheme: Subject Code
created: 2000-10-30T12:00:00+00:00
modified: 2010-12-15T17:01:09+00:00
broader: Sociale

Razzismo
type: Concept
preferred label: racism @en-gb
preferred label: 人種差別 @ja-jp
preferred label: racismo @pt-pt
preferred label: Rassismus @de
preferred label: Racisme @fr
definition: Schädigendes Verhalten gegenüber einer anderen Gruppe auf der Grundlage von Unterschieden der Abstammung. @de
definition: Harmful attitudes toward another group based on racial differences @en-gb
definition: 人種的な違いに基づく別のグループに対する有害な考え方 @ja-jp
definition: Atitudes ou comportamento nocivos contra um grupo, em função de diferenças raciais. @pt-br
definition: Comportement nuisible vis-à-vis d'un groupe en fonction de critères raciaux @fr
definition: Actitudes dañinas hacia otro grupo basado en diferencias raciales. @es
definition: Atteggiamento di odio e disprezzo nei confronti di altri, basato su differenze di razza
note: nessuno
in scheme: Subject Code
created: 2000-10-30T12:00:00+00:00
modified: 2010-12-15T17:01:09+00:00
broader: Sociale

Welfare
type: Concept
preferred label: Sozialfürsorge @de
preferred label: assistência social @pt-pt
preferred label: welfare @en-gb
preferred label: Protection sociale @fr
preferred label: 福祉 @ja-jp
preferred label: asistencia social @es
definition: Aiuto pubblico garantito alle persone che ne hanno bisogno per il sostentamento in termini di cibo, alloggio, salute e altri servizi
definition: Ajuda do governo proporcionada às pessoas, sobretudo as mais desfavorecidas, que precisam de comida, habitação, saúde e outros serviços. @pt-pt
definition: Grundsätzliche Unterstützung von Menschen, seitens der Regierung, die Nahrungsmittel, Unterkunft, Gesundheit und andere Dienstleistungen benötigen. @de
definition: L'aide publique aux personnes, en particulier les plus défavorisées @fr
definition: Generally government help for those in need of food, housing health and other services @en-gb
definition: 食物、在宅介護や他のサービスを必要とするものを政府が支援すること @ja-jp
definition: Generalmente, ayuda del gobierno para quienes necesitan comida, vivienda, salud y otros servicios. @es
note: nessuno
in scheme: Subject Code
created: 2000-10-30T12:00:00+00:00
modified: 2010-12-15T17:01:09+00:00
broader: Sociale

Aborto
type: Concept
preferred label: aborto @pt-pt
preferred label: Avortement @fr
preferred label: abortion @en-gb
preferred label: 中絶 @ja-jp
preferred label: Schwangerschaftsabbruch @de
definition: Généralement l'interruption provoquée et volontaire de la grossesse @fr
definition: Geralmente, interrupção planejada do processo de reprodução de vida humana. @pt-br
definition: In der Regel der geplante Abbruch des Prozesses zur Reproduktion menschlichen Lebens. @de
definition: Usually the planned disruption of the process of reproduction of human life @en-gb
definition: In generale, l'interruzione volontaria della gravidanza
definition: Interrupção, planeada ou não, do processo de reprodução de vida humana. @pt-pt
definition: Usualmente es la interrupción planeada del proceso de reproducción de la vida humana. @es
definition: 通常、人間の生殖過程における計画的な途絶 @ja-jp
note: nessuno
in scheme: Subject Code
created: 2000-10-30T12:00:00+00:00
modified: 2010-12-15T17:01:09+00:00
broader: Sociale

Persone scomparse
type: Concept
preferred label: desaparecidos @pt-pt
preferred label: personas desaparecidas @es
preferred label: 行方不明者 @ja-jp
preferred label: Vermisste @de
preferred label: missing person @en-gb
preferred label: Personnes disparues @fr
definition: Se dit d'une personne qui n'est pas à l'endroit où elle est supposée être depuis un certain temps @fr
definition: Pessoa que não está no lugar esperado, onde deveria estar, há um certo período de tempo. @pt-br
definition: A person who is not where they are expected to be for a period of time @en-gb
definition: Person, die nicht an dem Ort ist, wo man sie in einem bestimmten Zeitraum erwartet. @de
definition: Persone scomparse da un certo lasso di tempo da dove avrebbero dovuto trovarsi o si trovavano
definition: Una persona que no se encuentra en un lugar esperado en un momento determinado. @es
definition: Pessoa que é considerada ausente sem explicação conhecida e procurada por outros. @pt-pt
definition: ある期間、予想されるところにいなかった人 @ja-jp
note: nessuno
in scheme: Subject Code
created: 2000-10-30T12:00:00+00:00
modified: 2010-12-15T17:01:09+00:00
broader: Sociale
narrower: Dispersi per Ostilità

Assistenza a lungo termine
type: Concept
preferred label: long term care @en-gb
preferred label: Soins de longue durée @fr
preferred label: assistência prolongada @pt-br
preferred label: cuidados de largo plazo @es
preferred label: Langzeitpflege @de
preferred label: 長期介護 @ja-jp
definition: Cuidados de saúde prolongados devido a doença séria ou invalidez. @pt-br
definition: Soins de longue maladie @fr
definition: Umfassende Gesundheitspflege aufgrund ernsthafter Krankheit oder Invalidität. @de
definition: 重い疾病や機能不全が原因で広範囲に健康に気を配ること @ja-jp
definition: Extensive health care because of serious illness or disability @en-gb
definition: Prolungato trattamento di salute a causa di gravi infermità o malattie
definition: Cuidado extensivo de salud debido a una seria enfermedad o limitación. @es
note: nessuno
in scheme: Subject Code
created: 2000-10-30T12:00:00+00:00
modified: 2010-12-15T17:01:09+00:00
broader: Sociale

Delinquenza giovanile
type: Concept
preferred label: juvenile delinquency @en-gb
preferred label: 非行 @ja-jp
preferred label: delincuencia juvenil @es
preferred label: delinquência juvenil @pt-pt
preferred label: Délinquance juvénile @fr
preferred label: Jugendkriminalität @de
definition: Incidents involving perpetrators who are minors. @en-gb
definition: 未成年者が加害者に含まれる事件 @ja-jp
definition: Incidentes que involucran la participación de menores de edad. @es
definition: Atos de delinquência realizados por menores de idade. @pt-pt
definition: Vorfälle in die minderjährige Täter verwickelt sind. @de
definition: Fenomeni delinquenziali perpetrati da minorenni, ad es. baby gang
definition: Actes de délinquance réalisés par des mineurs @fr
note: nessuno
in scheme: Subject Code
created: 2000-10-30T12:00:00+00:00
modified: 2010-12-15T17:01:09+00:00
broader: Sociale

Vittime Radiazioni nucleari
type: Concept
preferred label: 被爆者 @ja-jp
preferred label: nuclear radiation victims @en-gb
preferred label: victimes irradiées @fr
preferred label: Strahlenopfer @de
preferred label: vítimas de radiação nuclear @pt-br
preferred label: víctimas de radiación nuclear @es
definition: Comprend les mouvements antinucléaire et l'indemnisation des victimes d'explosions nucléaires @fr
definition: Inclui movimentos antinucleares e indenizações às vítimas de explosões nucleares. @pt-br
definition: Schließt die Anti-Atomkraftbewegungen mit ein und Entschädigung für Strahlenopfer. @de
definition: Inclui movimentos antinucleares e indemnizações às vítimas de explosões nucleares. @pt-pt
definition: Incluye movimientos antinucleares y compensación a víctimas de explosiones atómicas. @es
definition: Indennizzi alle vittime di esplosioni nucleari, ma anche i movimenti antinucleari
definition: Includes antinuclear movements and compensation for atomic blast victims. @en-gb
definition: 反核運動と補償を含む核爆弾被害者 @ja-jp
note: nessuno
in scheme: Subject Code
created: 2000-10-30T12:00:00+00:00
modified: 2010-12-15T17:01:09+00:00
broader: Sociale

Schiavitù, Lavoro minorile
type: Concept
preferred label: slavery @en-gb
preferred label: esclavitud @es
preferred label: Sklaverei @de
preferred label: escravatura @pt-br
preferred label: 奴隷 @ja-jp
preferred label: Esclavage @fr
definition: Die unfreiwillige Knechtschaft, außerhalb legaler Inhaftierung wegen krimineller Straftaten, von Männern, Frauen und Kindern, schließt unfreiwillige unbezahlte Arbeit, erzwungenes Verhalten und Kinderarbeit mit ein. @de
definition: 犯罪を犯し法律に従って投獄された場合以外の不本意な無報酬の労働、強制労働や児童労働を含む、男性、女性と子供たちに行う自由意志でない隷属 @ja-jp
definition: Submissão involuntária, fora do encarceramento legal por crimes passíveis de punição, de homens, mulheres e crianças, incluindo trabalho involuntário não remunerado, atos de coerção, trabalho infantil. @pt-br
definition: Etat de soumission, de dépendance involontaire à un pouvoir autoritaire : travail non rémunéré, actes coercitifs, travail des enfants,… @fr
definition: La servidumbre involuntaria, fuera de la encarcelación legal por delitos establecidos por la ley de hombres, mujeres y niños, incluyendo la mano de obra involuntaria no pagada, los actos forzados, la explotación de menores. @es
definition: The involuntary servitude, outside of legal incarceration for statuary criminal offences, of men, women and children, including involuntary unpaid labour, coerced actions, child labour @en-gb
definition: Stato di sottomissione e dipendenza di uomini, donne e bambini, inclusa manodopera non pagata, azioni coercitive, ma anche lavoro minorile
note: nessuno
in scheme: Subject Code
created: 2000-10-30T12:00:00+00:00
modified: 2010-12-15T17:01:09+00:00
broader: Sociale

Abusi, Torture
type: Concept
preferred label: conducta abusiva @es
preferred label: maus-tratos @pt-pt
preferred label: Harcèlement @fr
preferred label: 虐待 @ja-jp
preferred label: abusive behaviour @en-gb
preferred label: Misshandlung @de
definition: Maltrattamenti subiti da qualcuno, compresi quelli sessuali o psicologici ma anche le varie forme di tortura
definition: Comportamento violento ou cruel contra um ou mais indivíduos, através de tratamento desumano, incluindo abuso sexual ou mental, privação de sentidos, de necessidades físicas, abusos físicos, incluindo espancamentos e outras formas de tortura. @pt-pt
definition: La maltraitance physique, mentale ou sexuelle d'individus par d'autres personnes avec des moyens brutaux comme la torture @fr
definition: The maltreatment of one or more individuals by others through dehumanizing treatment including sexual or mental abuse, deprivation of sensory abilities, deprivation of physical needs, physical mistreatment including beatings, and other forms of torture @en-gb
definition: El maltrato de uno o más individuos por otros a través de un tratamiento deshumanizante, incluyendo el abuso sexual, maltrato psicológico, la privación de las habilidades sensoriales, la privación de las necesidades físicas, el maltrato físico, incluyendo @es
definition: 性的虐待、精神的虐待、感覚能力の剥奪、生理的要求の剥奪、乱打を含める身体上の虐待と拷問などの形態を含む、一人あるいはそれ以上の人々に対して、他人が人間性を奪うような扱いをすること @ja-jp
definition: Die Misshandlung einer oder mehrerer Individuen durch andere, durch unmenschliche Behandlung, sexuelle und mentale Beleidigungen, Entzug von Sinneswahrnehmungen und körperlichen Bedürfnissen, körperliche Misshandlung wie Schläge mit eingeschlossen, oder andere Formen der Folter. @de
note: nessuno
in scheme: Subject Code
created: 2000-10-30T12:00:00+00:00
modified: 2010-12-15T17:01:09+00:00
broader: Sociale

Morte
type: Concept
preferred label: morte @pt-pt
preferred label: 人の死 @ja-jp
preferred label: Fin de vie et mort @fr
preferred label: Tod und Sterben @de
preferred label: death and dying @en-gb
preferred label: fallecimiento y morir @es
definition: Fim da vida e cessação definitiva de todas as funções corporais e cerebrais. @pt-pt
definition: Sterben ist der Weg zum Tod. Tod ist der Zustand, wenn kein Hinweis mehr vorhanden ist, dass menschliches Leben noch möglich wäre, sowohl körperlich als auch mental. @de
definition: 死に方は死に至る過程。死は物理的または精神的に人間の役割を果たせる兆候がない状態 @ja-jp
definition: Agonia e cessazione della vita
definition: Morir es el camino a la muerte. La muerte es el estado en que no se tiene signos de que se pueda funcionar como ser humano ya sea de manera mental o física. @es
definition: Dying is the route to death. Death is the state you are in when there are no signs that you can function as a human being either physically or mentally @en-gb
definition: La fin de la vie et la cessation définitive de toutes les fonctions corporelles et cérébrales @fr
note: nessuno
in scheme: Subject Code
created: 2003-04-05T12:00:00+00:00
modified: 2012-07-10T12:00:00+00:00
broader: Sociale

Gente, Persone
type: Concept
preferred label: Bevölkerungsgruppe @de
preferred label: Peuple @fr
preferred label: grupos populacionais @pt-pt
preferred label: people @en-gb
preferred label: gente @es
preferred label: 人々 @ja-jp
definition: Ensemble de personnes vivant sur un même territoire ou ayant en commun des mœurs, une culture, un système de gouvernement @fr
definition: Individuen als Ganzes, manchmal in verschiedene Klassen eingeteilt, wie Einheimische, Menschen einer Schicht etc. @de
definition: Individuos como un todo, algunas veces clasificadas en clases, como indígenas, gente de clase, etc. @es
definition: Insieme degli individui
definition: Individuals as a whole, sometimes broken down into various classes, such as indigenous people, people of class etc @en-gb
definition: Coletivos de pessoas, por vezes divididas por classes. @pt-pt
definition: Indivíduos como um todo, por vezes divididos por classes, como indígenas, pessoas de classe, etc. @pt-br
definition: 時には土着の人々や様々な部類の人々など、色々な階層に分けられる個人全体 @ja-jp
note: nessuno
in scheme: Subject Code
created: 2003-04-05T12:00:00+00:00
modified: 2012-07-10T12:00:00+00:00
broader: Sociale
narrower: Infanzia
narrower: Neonati
narrower: Adolescenza
narrower: Età Adulta
narrower: Terza Età

Questioni sociali (generico)
type: Concept
preferred label: asuntos sociales (general) @es
preferred label: sociedade (geral) @pt-pt
preferred label: social issues (general) @en-gb
preferred label: 社会問題（一般） @ja-jp
preferred label: Problèmes de société @fr
preferred label: Soziale Umwelt @de
definition: Questões que afetam os indivíduos em suas vidas diárias, como habitação, comida, educação, relações pessoais. @pt-br
definition: 住宅、食物、教育、人間関係のように、日常生活で多くの個人に影響を与える問題 @ja-jp
definition: Les questions affectant les individus dans leur vie quotidienne telles que la nourriture, l'éducation, le logement, les relations de voisinage, etc. @fr
definition: Issues affecting a number of individuals in their daily lives like housing, food, education, personal relationships @en-gb
definition: Probleme, die eine Reihe von Individuen in ihrem täglichen Leben betreffen, wie Unterkunft, Nahrung, Erziehung, persönliche Beziehungen. @de
definition: Problemi degli individui nella società e nella vita di tutti i giorni
definition: Questões que afetam os indivíduos nas suas vidas diárias, como habitação, comida, educação, relações pessoais. @pt-pt
definition: Asuntos que afectan a un grupo de individuos en su diaria vida vivienda, comida, educación, relaciones personales. @es
note: nessuno
in scheme: Subject Code
created: 2003-04-05T12:00:00+00:00
modified: 2012-07-10T12:00:00+00:00
broader: Sociale
narrower: Condizioni sociali
narrower: Problemi sociali
narrower: Discriminazione
narrower: Servizi sociali
narrower: death penalty policies

Bonifica Bellica
type: Concept
preferred label: remoción de pertrechos @es
preferred label: estatísticas (Sociedade) @pt-pt
preferred label: Déminage @fr
preferred label: Beseitigung von Kriegswaffenresten @de
preferred label: ordnance clearance @en-gb
preferred label: 爆発物除去 @ja-jp
definition: Remoção ou neutralização de elementos que permanecem ativos após o fim de guerras ou conflitos armados, como minas terrestres ou bombas de fragmentação. @pt-pt
definition: la remoción o neutralización de elementos que permanecen activos despues de un conflicto bélico, tales como minas terrestres o bombas de racimo. @es
definition: Rimozione o neutralizzazione di ordigni bellici che restano inesplosi dopo una guerra o un conflitto armato
definition: Das Entfernen oder Entschärfen von Waffen, wie Landminen oder Clusterbomben, die nach einem Krieg oder bewaffneten Konflikt übriggeblieben sind. @de
definition: Le déplacement, l'enlèvement ou la neutralisation d'engins explosifs tels que des mines après une guerre ou un conflit armé @fr
definition: 戦争や武力紛争後に残された地雷やクラスター爆弾などの兵器の除去または無効化 @ja-jp
definition: The removal or neutralization of ordnance such as landmines or cluster bombs, remaining after a war or armed conflict @en-gb
note: nessuno
in scheme: Subject Code
created: 2003-11-26T12:00:00+00:00
modified: 2012-07-10T12:00:00+00:00
broader: Sociale

Ricostruzione
type: Concept
preferred label: Reconstruction @fr
preferred label: reconstruction @en-gb
preferred label: 復興 @ja-jp
preferred label: reconstrucción @es
preferred label: Wiederaufbau @de
preferred label: reconstrução @pt-pt
definition: Ricostruzione dopo una guerra o un disastro naturale di economia, infrastrutture e beni mobili e immobili, come anche della vita in generale
definition: 戦争または自然災害後、一般の生活と同様に経済、社会基盤、資産が再建すること @ja-jp
definition: Die Wiederherstellung der Wirtschaft, Infrastruktur und Eigentum, sowie des öffentlichen Lebens, nach einem Krieg oder einer Naturkatastrophe. @de
definition: La reconstruction après une guerre où un désastre naturel de ce qui a été détruit, comprend aussi bien l'économie que les outils de productions ou les biens @fr
definition: The reconstruction of economy, infrastructure and property, as well as life in general, after a war or natural disaster @en-gb
definition: la resconstrucción de la economía, infraestruturas e inmuebles, así como la vida en general, despues de una guerra o desastre natural. @es
definition: Reconstrução da economia, das infraestruturas e da propriedade, assim como da vida em geral, após guerra ou desastre natural. @pt-br
note: nessuno
in scheme: Subject Code
created: 2003-11-26T12:00:00+00:00
modified: 2012-07-10T12:00:00+00:00
broader: Sociale

Censimento
type: Concept
preferred label: população e censos @pt-br
preferred label: población y censo @es
preferred label: population and census @en-gb
preferred label: 人口・国勢調査 @ja-jp
preferred label: Bevölkerungszahl @de
preferred label: Recensement @fr
definition: Population is the number of people in a geographical region and census is the process of counting them @en-gb
definition: La población es el número de personas en una región geográfica, y el censo es el proceso de contarlos. @es
definition: População é o número de pessoas em uma região geográfica e censo é o processo de sua contagem. @pt-br
definition: População é o número de pessoas numa região geográfica e censo é o processo da sua contagem. @pt-pt
definition: 人口はある地理的区域における人間の数を表し、人口調査はそれらを数えるプロセスを表す @ja-jp
definition: Die Anzahl von Menschen einer geografischen Region und der Prozess diese zu zählen. @de
definition: Numero degli abitanti presenti in una data zona geografica
definition: Le nombre d'habitants d'un ensemble ou d'une entité géographique et leur recensement @fr
note: nessuno
in scheme: Subject Code
created: 2003-04-05T12:00:00+00:00
modified: 2012-07-10T12:00:00+00:00
broader: Demografia

Immigrazione
type: Concept
preferred label: 出入国 @ja-jp
preferred label: imigração @pt-pt
preferred label: Einwanderung @de
preferred label: immigration @en-gb
preferred label: inmigración @es
preferred label: Immigration @fr
definition: ある国から他の国への個人の動き @ja-jp
definition: Bewegung von Individuen von einem Land in ein anderes. @de
definition: Movement of individuals from one country to the other @en-gb
definition: Ato ou efeito de entrar num país diferente do seu para aí se estabelecer. @pt-pt
definition: Les mouvements de personnes d'un pays vers un autre @fr
definition: Movimento di individui da un paese ad un altro
definition: Movimentação de indivíduos de um país a outro. @pt-br
definition: Movimiento de personas de un país a otro. @es
note: nessuno
in scheme: Subject Code
created: 2003-04-05T12:00:00+00:00
modified: 2012-07-10T12:00:00+00:00
broader: Demografia

Immigrazione clandestina
type: Concept
preferred label: imigrantes ilegais @pt-br
preferred label: illegal immigrants @en-gb
preferred label: Illegale Einwanderung @de
preferred label: inmigrantes ilegales @es
preferred label: Immigration clandestine @fr
preferred label: 不法入国 @ja-jp
definition: 不正な手段による、ある国から他の国への個人の動き @ja-jp
definition: Bewegung von Individuen von einem Land in ein anderes auf illegalem Weg. @de
definition: Ato ou efeito de entrar ilegalmente num país diferente do seu para aí se estabelecer. @pt-pt
definition: Movement of individuals from one country to the other by illicit means @en-gb
definition: Movimento di individui da un paese ad un altro attraverso mezzi illegali
definition: Movimentação de indivíduos de um país a outro por meios ilícitos. @pt-br
definition: Movimiento de personas de un país a otro por medios de medios ilícitos. @es
definition: Les mouvements de personnes d'un pays vers un autre par des moyens considérés comme illégaux @fr
note: nessuno
in scheme: Subject Code
created: 2003-04-05T12:00:00+00:00
modified: 2012-07-10T12:00:00+00:00
broader: Demografia

Emigrazione
type: Concept
preferred label: emigrantes @es
preferred label: Emigrés @fr
preferred label: Auswanderer @de
preferred label: 移民 @ja-jp
preferred label: emigrants @en-gb
definition: Fenomeno interessante le persone che hanno lasciato il loro paese d'origine e il loro rapporto con esso, le associazioni di emigrati all'estero
definition: Ensemble des personnes qui ont quitté leur pays d'origine pour aller s'établir dans un autre @fr
definition: Menschen, die ihr Heimatland verlassen, alle Beziehung zu ihrem Heimatland abbrechen und deren Verbindungen mit anderen Emigranten. @de
definition: *Pessoas que deixam seu país de origem; sua relação com seu país de origem e associação com outros emigrantes.* @pt-br
definition: 出生国を離れた人々。出生国との関係、移民同士の親交 @ja-jp
definition: *Pessoas que deixam o seu país de origem; a sua relação com o seu país de origem e associação com outros emigrantes.* @pt-pt
definition: People who leave their country of origin, their relationship with their country of origin and their association with fellow emigrants @en-gb
definition: Gente que deja sus países de origen , su relación con su país de origen y sus asociaciones con sus conciudadanos. @es
note: nessuno
in scheme: Subject Code
created: 2003-11-26T12:00:00+00:00
modified: 2012-07-10T12:00:00+00:00
broader: Demografia

Suicidio
type: Concept
preferred label: suicide @en-gb
preferred label: Selbstmord @de
preferred label: suicídio @pt-br
preferred label: Suicide @fr
preferred label: 自殺 @ja-jp
preferred label: suicidio @es
definition: Darse muerte a si mismo. @es
definition: Morte de uma pessoa por suas próprias mãos. @pt-br
definition: Tod durch die eigene Hand. @de
definition: Action de se donner volontairement la mort @fr
definition: 自身の手による死 @ja-jp
definition: L'atto di darsi volontariamente la morte
definition: Morte de pessoa pelos seus próprios meios. @pt-pt
definition: Death by one's own hand @en-gb
note: nessuno
in scheme: Subject Code
created: 2003-04-05T12:00:00+00:00
modified: 2012-07-10T12:00:00+00:00
broader: Eutanasia, Suicidio assistito

Genitori, Figli
type: Concept
preferred label: 親子 @ja-jp
preferred label: padres e hijos @es
preferred label: parent and child @en-gb
preferred label: Relation parent-enfant @fr
preferred label: Eltern-Kind-Beziehung @de
preferred label: pais e filhos @pt-br
definition: Rapporto fra genitori e figli all'interno o meno della famiglia
definition: Dois ou mais indivíduos com uma relação familiar muito próxima. @pt-pt
definition: Two or more individuals with a hierarchical familial relationship @en-gb
definition: Zwei oder mehrere Personen in einer hierarchischen familären Beziehung. @de
definition: Dos o mas individuos con una relación familiar jerárquica. @es
definition: 階層的な家族の関係を持っている2人またはそれ以上の個人 @ja-jp
definition: Dois ou mais indivíduos com uma relação familiar hierárquica. @pt-br
definition: Deux personnes ou plus ayant un lien de parenté direct @fr
note: nessuno
in scheme: Subject Code
created: 2003-04-05T12:00:00+00:00
modified: 2012-07-10T12:00:00+00:00
broader: Famiglia

Adozione
type: Concept
preferred label: adoção @pt-br
preferred label: Adoption @de
preferred label: 養子 @ja-jp
preferred label: adopción @es
preferred label: adoption @en-gb
definition: Ein legaler Vorgang ein elternloses Kind in eine Beziehung zu integrieren. @de
definition: A legal process of bringing a child with no supporting parents into a supportive union @en-gb
definition: Proceso legal de llevar a un menor sin el apoyo de padres a un lugar de apoyo. @es
definition: Processo legal que reconhece uma criança como filho/a de uma família onde ela não nasceu. @pt-pt
definition: Procedimento legale per dare dei genitori ad un bambino privo della famiglia; Affidamento
definition: Action de prendre légalement pour fils ou pour fille un enfant @fr
definition: 扶養する親のいない子を、ある扶養集団の中で養育していくことに関する法的プロセス @ja-jp
note: nessuno
in scheme: Subject Code
created: 2003-04-05T12:00:00+00:00
modified: 2012-07-10T12:00:00+00:00
broader: Famiglia

Matrimonio
type: Concept
preferred label: matrimonio @es
preferred label: matrimônio @pt-br
preferred label: matrimónio @pt-pt
preferred label: Heirat @de
preferred label: 結婚 @ja-jp
preferred label: marriage @en-gb
preferred label: Mariage @fr
definition: Unión de dos individuos que juran lealtad, respeto y apoyo mutuo. @es
definition: Die Verbindung von zwei Individuen, die sich gegenseitig Treue, Unterstützung und Respekt schwören. @de
definition: The union of two individuals who pledge fidelity, respect and support for each other @en-gb
definition: União de duas pessoas que juram fidelidade, respeito e apoio mútuos. @pt-br
definition: 貞節、敬意と、お互いに対する支援を誓う2人の個人の結合 @ja-jp
definition: Unione di due individui che si promettono fedeltà , rispetto e aiuto reciproco
definition: Union légitime entre deux personnes qui se jurent fidélité, respect et assistance l'un à l'autre @fr
note: nessuno
in scheme: Subject Code
created: 2003-04-05T12:00:00+00:00
modified: 2012-07-10T12:00:00+00:00
broader: Famiglia

Divorzio
type: Concept
preferred label: divórcio @pt-br
preferred label: divorce @en-gb
preferred label: Divorce @fr
preferred label: divorcio @es
preferred label: Scheidung @de
preferred label: 離婚 @ja-jp
definition: The process by which a marriage is dissolved @en-gb
definition: Procedimento attraverso il quale si dichiara sciolto un matrimonio; Separazione
definition: Processo através do qual um casamento é dissolvido. @pt-pt
definition: Proceso por medio del cual se disuelve el matrimonio. @es
definition: Rupture légale du mariage @fr
definition: Der Vorgang, durch den eine Ehe aufgehoben wird. @de
definition: 結婚を解消するプロセス @ja-jp
note: nessuno
in scheme: Subject Code
created: 2003-04-05T12:00:00+00:00
modified: 2012-07-10T12:00:00+00:00
broader: Famiglia

Sesso
type: Concept
preferred label: sexo @es
preferred label: Sexualité @fr
preferred label: Geschlecht/Sexualität @de
preferred label: 性 @ja-jp
preferred label: sex @en-gb
definition: Classificação de indivíduos em machos e fêmeas. Ou relações conjugais entre duas pessoas. @pt-pt
definition: 個人が男性であるか女性であるかの分類。あるいは、2人の個人間における婚姻上の関係 @ja-jp
definition: Relazioni sessuali fra individui consenzienti; i costumi sessuali, ecc.
definition: The classification of individuals as either male or female. Or conjugal relationship between two individuals. @en-gb
definition: Die Einteilung von Individuen in weiblich und männlich oder die eheliche Beziehung zwischen beiden. @de
definition: La différenciation des individus en mâles ou femelles. Les relations sexuelles entre deux personnes @fr
definition: Clasificación de individuos como hombre y mujer. Relación conyugal entre dos individuos. @es
note: nessuno
in scheme: Subject Code
created: 2003-04-05T12:00:00+00:00
modified: 2012-07-10T12:00:00+00:00
broader: Famiglia

Corteggiamento
type: Concept
preferred label: namoro @pt-pt
preferred label: 求婚 @ja-jp
preferred label: Hofieren @de
preferred label: courtship @en-gb
preferred label: Flirt @fr
preferred label: noviazgo @es
definition: Vorbereitungen um einen Partner zu werben und für sich zu gewinnen. @de
definition: Preliminaries of wooing and winning a partner @en-gb
definition: Preliminares para cortejar y conquistar una pareja @es
definition: L'art de faire la cour @fr
definition: Preliminares para cortejar e conquistar um/a parceiro/a. @pt-br
definition: Arte di fare la corte, i rapporti interpersonali per conquistare una persona
definition: 口説く準備をして、パートナーを得ること @ja-jp
definition: Procedimento para cortejar e conquistar um/a parceiro/a. @pt-pt
note: nessuno
in scheme: Subject Code
created: 2004-10-13T12:00:00+00:00
modified: 2012-07-10T12:00:00+00:00
broader: Famiglia

Omosessualità
type: Concept
preferred label: gays e lésbicas @pt-br
preferred label: homosexuales @es
preferred label: gays and lesbians @en-gb
preferred label: 同性愛 @ja-jp
preferred label: Homosexualité @fr
preferred label: Homosexuelle @de
definition: 性愛、肉欲あるいは類似の意味で、自分が同性に惹きつけられると感じる人々 @ja-jp
definition: Chi si sente attratto e prova amore e desiderio per persone del suo stesso sesso
definition: Aquellos que se encuentran atraídos a su mismo genero de manera similar, erótica o sensual. @es
definition: Menschen, die sich auf sinnliche, erotische oder vergleichbare Weise zu dem eigenen Geschlecht hingezogen fühlen. @de
definition: Pessoas que se sentem atraídas de forma erótica ou sensual por pessoas do mesmo sexo. @pt-br
definition: Les personnes attirées par des individus du même sexe @fr
definition: Those that consider themselves attracted to their same gender in an erotic or sensual or similar way. @en-gb
note: nessuno
in scheme: Subject Code
created: 2003-04-05T12:00:00+00:00
modified: 2012-07-10T12:00:00+00:00
broader: Minoranze

Minoranze nazionali, etniche
type: Concept
preferred label: Minorité ethnique ou nationale @fr
preferred label: national or ethnic minority @en-gb
preferred label: Nationale oder ethnische Minderheit @de
preferred label: 少数民族 @ja-jp
preferred label: nacionales o minorias etnicas @es
preferred label: minoria étnica ou nacional @pt-br
definition: Gruppi di persone che formano una minoranza su base etnica o nazionale, il loro status, i problemi e le relazioni con la maggioranza
definition: Grupos de personas que forman una minoria étnica o nacional; sus estatus, problemas y relaciones con la mayoría. @es
definition: 民族、国家、地位、大多数間の問題と相互関係によって形成された少数のグループ @ja-jp
definition: *Grupos de pessoas que formam uma minoria étnica ou nacional; seu estatuto, seus problemas e relações com a maioria.* @pt-pt
definition: Gruppe von Menschen, die eine Minderheit bilden auf ethnischer oder nationaler Grundlage, ihres Status, ihrer Probleme und Beziehungen zur Mehrheit. @de
definition: Petit groupe de personnes formant une minorité sur le plan national ou ethnique. Leur statut, leurs problèmes et leur relation avec la majorité @fr
definition: Groups of people that form a minority on ethnic or national basis, their status, problems and relations to the majority @en-gb
note: nessuno
in scheme: Subject Code
created: 2003-11-26T12:00:00+00:00
modified: 2012-07-10T12:00:00+00:00
broader: Minoranze

Dispersi per Ostilità
type: Concept
preferred label: Personnes disparues en temps de guerre @fr
preferred label: desaparecidos em conflitos (civis e militares) @pt-br
preferred label: missing due to hostilities @en-gb
preferred label: Kriegsvermisste @de
preferred label: 戦争不明者 @ja-jp
preferred label: desaparecidos debido a las hostilidades @es
definition: Pessoas, civis e militares, desaparecidas durante ou após guerras. @pt-pt
definition: Gente, ambos, civiles y miltares, desaparecidos durante o después de hostilidades @es
definition: 戦争中や戦争後に行方不明になった市民または兵士 @ja-jp
definition: Zivilisten und Soldaten, die nach einer kriegerischen Auseinandersetzung vermisst werden. @de
definition: People, both civilian and military, missing during or after hostilities @en-gb
definition: Pessoas, civis e militares, desaparecidas durante ou após guerras, hostilidades. @pt-br
definition: Persone, sia civili che militari, che scompaiono durante o dopo delle ostilità
definition: Civils ou militaires ayant disparus pendant ou après une guerre ou des hostilités @fr
note: nessuno
in scheme: Subject Code
created: 2003-11-26T12:00:00+00:00
modified: 2012-07-10T12:00:00+00:00
broader: Persone scomparse

Infanzia
type: Concept
preferred label: pré-adolescentes @pt-pt
preferred label: children @en-gb
preferred label: niños @es
preferred label: Enfants @fr
preferred label: Kind @de
preferred label: 子供 @ja-jp
definition: De la naissance à l'âge de la puberté @fr
definition: Immature people, usually up to the age of puberty @en-gb
definition: Noch nicht entwickelte Menschen, gewöhnlich bis zum Alter der Pubertät. @de
definition: Gente inmadura, Generalmente hasta la edad de la pubertad. @es
definition: 通常、思春期の年齢に至るまでの未熟な人々 @ja-jp
definition: Pessoas imaturas, geralmente até a idade da puberdade. @pt-br
definition: Bambini, considerati dalla nascita fino all'età della pubertà
definition: Pessoas que estão a chegar à idade da puberdade. @pt-pt
note: nessuno
in scheme: Subject Code
created: 2003-04-05T12:00:00+00:00
modified: 2012-07-10T12:00:00+00:00
broader: Gente, Persone

Neonati
type: Concept
preferred label: crianças @pt-pt
preferred label: infants @en-gb
preferred label: infancia @es
preferred label: Bébé @fr
preferred label: Kleinkind @de
preferred label: 幼児 @ja-jp
definition: Indivíduos na fase que vai do nascimento até aos 1-2 anos, geralmente quando começam a caminhar. @pt-pt
definition: Aquellos desde el nacimiento, generalmente comienzan a dar los primeros pasos. @es
definition: Bambini, considerati dalla nascita fino a uno/due anni di età
definition: Menschen von Geburt bis zum 1. oder 2. Lebensjahr, gewöhnlich wenn sie beginnen zu laufen. @de
definition: Les enfants de la naissance à leurs premiers pas @fr
definition: Those people from birth until ages of one or two, usually when they begin walking @en-gb
definition: 出生から1、2歳の年齢で、通常歩き始めた頃の人々 @ja-jp
definition: Indivíduos na fase que vai do nascimento até os 1-2 anos, geralmente quando começam a caminhar. @pt-br
note: nessuno
in scheme: Subject Code
created: 2003-04-05T12:00:00+00:00
modified: 2012-07-10T12:00:00+00:00
broader: Gente, Persone

Adolescenza
type: Concept
preferred label: jovens @pt-br
preferred label: adolescentes @es
preferred label: 青少年 @ja-jp
preferred label: Adolescent @fr
preferred label: teen-agers @en-gb
preferred label: Jugendlicher @de
definition: Pessoas entre os 13 e os 19 anos de idade. @pt-br
definition: Menschen in dem Alter von 13 bis 19. @de
definition: Les personnes âgées de 13 à 19 ans @fr
definition: 13歳から19歳までの年齢の人々 @ja-jp
definition: Età che va dai 13 ai 19 anni
definition: Gente entre 13 y 19 años de edad. @es
definition: People aged 13 to 19 years of age @en-gb
note: nessuno
in scheme: Subject Code
created: 2003-04-05T12:00:00+00:00
modified: 2012-07-10T12:00:00+00:00
broader: Gente, Persone

Età Adulta
type: Concept
preferred label: Adultes @fr
preferred label: Erwachsener @de
preferred label: adultos @pt-br
preferred label: 成人 @ja-jp
preferred label: adults @en-gb
definition: People aged 20 and above @en-gb
definition: Età che va dai 20 anni in su
definition: Menschen in dem Alter 20 und älter. @de
definition: Pessoas com 20 ou mais anos de idade. @pt-br
definition: Gente mayo de 20 años. @es
definition: Les personnes âgées de 20 ans et plus @fr
definition: 20歳以上の人々 @ja-jp
note: nessuno
in scheme: Subject Code
created: 2003-04-05T12:00:00+00:00
modified: 2012-07-10T12:00:00+00:00
broader: Gente, Persone

Terza Età
type: Concept
preferred label: terceira idade @pt-pt
preferred label: senior citizens @en-gb
preferred label: Senior @de
preferred label: Personnes âgées @fr
preferred label: adultos mayores y ancianos @es
preferred label: 高齢者 @ja-jp
definition: Pessoas com 60-65 ou mais anos de idade. @pt-pt
definition: Les personnes âgées de 60 ans et plus @fr
definition: 60歳以上、もしくは65歳以上の人々 @ja-jp
definition: Gente mayo de 60 a 65 años o mas. @es
definition: Menschen in dem Alter 60 bis 65 und älter. @de
definition: People aged 60 or 65 and older @en-gb
definition: Età che va dai 60-65 anni in su
note: nessuno
in scheme: Subject Code
created: 2003-04-05T12:00:00+00:00
modified: 2012-07-10T12:00:00+00:00
broader: Gente, Persone

Condizioni sociali
type: Concept
preferred label: Condition sociale @fr
preferred label: Soziale Bedingung @de
preferred label: condições de vida @pt-pt
preferred label: social conditions @en-gb
preferred label: condiciones sociales @es
preferred label: 生活水準 @ja-jp
definition: Conditions under which people live in terms of housing, water supply, availability of education @en-gb
definition: Condições nas quais vivem as pessoas em termos de habitação, fornecimento de água, disponibilidade de educação. @pt-pt
definition: 住宅、給水、利用できる教育の見地から見た人々の生活状態 @ja-jp
definition: Condizioni in cui le persone vivono in fatto di abitazione, acqua, accesso all'istruzione
definition: Les conditions dans lesquelles vivent les individus en terme de logement, de possibilité d'éducation, d'accès à la nourriture et à l'eau @fr
definition: Probleme, die eine Reihe von Individuen in ihrem täglichen Leben betreffen, wie Unterkunft, Nahrung, Erziehung, persönliche Beziehungen. @de
definition: Condiciones bajo las cuales la gente vive en términos de hogar, agua, disponibilidad de educación. @es
note: nessuno
in scheme: Subject Code
created: 2003-04-05T12:00:00+00:00
modified: 2012-07-10T12:00:00+00:00
broader: Questioni sociali (generico)

Problemi sociali
type: Concept
preferred label: problemas sociais @pt-br
preferred label: social problems @en-gb
preferred label: Soziale Probleme @de
preferred label: Problèmes sociaux @fr
preferred label: problemas sociales @es
preferred label: 生活環境 @ja-jp
definition: Menschliche Lebensbedingungen in Bezug auf Unterkunft, Wasserversorgung und Bildungschancen. @de
definition: Questões que afetam os indivíduos, como habitação, educação, nutrição, comunicação, etc. @pt-br
definition: 住宅、教育、コミュニケーションなど個人の生活に影響を与える問題 @ja-jp
definition: Issues affecting the lives of individuals such as housing, education nutrition, communication etc @en-gb
definition: Asuntos que afectan a un grupo de individuos como vivienda, educación, nutrición, comunicación, etc. @es
definition: Problemi che la gente affronta nella sua vita sociale: casa, istruzione, alimentazione, comunicazione, ecc...
definition: Les problèmes affectant la vie des individus tels que le logement, l'éducation, la communication, etc. @fr
note: nessuno
in scheme: Subject Code
created: 2003-04-05T12:00:00+00:00
modified: 2012-07-10T12:00:00+00:00
broader: Questioni sociali (generico)

Discriminazione
type: Concept
preferred label: discrimination @en-gb
preferred label: discriminação @pt-pt
preferred label: 差別 @ja-jp
preferred label: Diskriminierung @de
preferred label: discriminación @es
preferred label: Discrimination @fr
definition: Denial of services to one or more people because of race, colour, sexual identity, religion, political beliefs etc @en-gb
definition: 人種、肌の色、性の識別、宗教、政治理念などに起因する、ある人々へのサービスの拒否 @ja-jp
definition: La restriction des droits d'une ou plusieurs personnes en raison de sa race, de la couleur de sa peau, de son identité sexuelle, de sa religion, de ses positions politiques, etc. @fr
definition: Negação de serviços a uma ou mais pessoas por questões de raça, cor, identidade sexual, religião, crenças políticas, etc. @pt-pt
definition: Negazione di servizi e/o garanzie a una o più persone a causa della razza, colore, identità sessuale, religione, fede politica, ecc...
definition: Verweigerung einer Dienstleistung für eine Person oder Personengruppe aufgrund der Rasse, Hautfarbe, sexuellen Identität, Religionszugehörigkeit, politischen Ansichten etc. @de
definition: Negación de servicios a una o mas personas debido raza, color, identidad sexual, religión, creencias políticas, etc. @es
note: nessuno
in scheme: Subject Code
created: 2003-04-05T12:00:00+00:00
modified: 2012-07-10T12:00:00+00:00
broader: Questioni sociali (generico)

Servizi sociali
type: Concept
preferred label: social services @en-gb
preferred label: 社会的支援 @ja-jp
preferred label: serviços sociais @pt-pt
preferred label: Sozialer Dienst @de
preferred label: Services sociaux @fr
preferred label: servicios sociales @es
definition: Programas de apoio público que visam melhorar o bem-estar de pessoas ou de grupos de pessoas. @pt-br
definition: Programme, die von der Regierung unterstützt werden zur Verbesserung des Wohlergehens von Individuen oder Gruppen von Individuen. @de
definition: Gobierno apoyado por programas para mejorar el bien común de las personas o grupos de personas. @es
definition: 個人、あるいは集団の幸福を増大させる政府の支援プログラム @ja-jp
definition: Government supported programs to improve the well-being of individuals or groups of individuals @en-gb
definition: Programas de apoio público que visam melhorar o bem-estar de pessoas. @pt-pt
definition: Les programmes publics visant à accroître le bien être des personnes ou de groupes de personnes @fr
definition: Programmi pubblici per migliorare il benessere di individui o gruppi di individui
note: nessuno
in scheme: Subject Code
created: 2003-04-05T12:00:00+00:00
modified: 2012-07-10T12:00:00+00:00
broader: Questioni sociali (generico)

death penalty policies
type: Concept
preferred label: políticas de pena de morte @pt-br
preferred label: Todesstrafe (Politik) @de
definition: Políticas nacionais ou internacionais relativas à pena de morte. @pt-br
definition: National or international polices regarding death sentences @en-gb
definition: Nationale oder internationale Politik in Bezug auf Todesurteile. @de
in scheme: Subject Code
created: 2007-08-28T12:00:00+00:00
modified: 2012-07-10T12:00:00+00:00
broader: Questioni sociali (generico)

Sport
type: Concept
preferred label: deporte @es
preferred label: desporto @pt-pt
preferred label: sport @en-gb
preferred label: esporte @pt-br
preferred label: スポーツ @ja-jp
definition: Im Wettkampf ausgeübte körperliche Betätigung. Organisationen und Körperschaften sind die Träger dieser Aktivitäten. @de
definition: 肉体を動かして競い合う運動。これらの活動に関係している組織と団体 @ja-jp
definition: Ejercicio competitivo, que involucra esfuerzo físico. Organizaciones y cuerpos involucrados en dichas actividades. @es
definition: Competitive exercise involving physical effort. Organizations and bodies involved in these activities. @en-gb
definition: Exercício competitivo envolvendo esforço físico. Organizações e corpos envolvidos nessas atividades. @pt-pt
definition: Esercizio competitivo che richiede uno sforzo fisico. Organizzazioni ed enti coinvolti in tali attività
definition: Exercice compétitif impliquant un effort physique. @fr
note: nessuno
in scheme: Subject Code
created: 2000-10-30T12:00:00+00:00
modified: 2010-12-15T17:01:09+00:00
narrower: Sport Aviatori
narrower: Sci alpino
narrower: Football americano
narrower: Tiro con l'arco
narrower: Atletica leggera
narrower: Badminton
narrower: Baseball
narrower: Basket
narrower: biatlón
narrower: Biliardo, snooker e pool
narrower: bobsleigh
narrower: Bowling
narrower: Bocce
narrower: Pugilato
narrower: Canoa, Kayak
narrower: Alpinismo
narrower: Cricket
narrower: Curling
narrower: Ciclismo
narrower: Danza
narrower: Tuffi
narrower: Equitazione
narrower: Scherma
narrower: Hockey su prato
narrower: Pattinaggio artistico
narrower: Sci Freestyle
narrower: Golf
narrower: Ginnastica
narrower: Pallamano
narrower: Ippica
narrower: Hockey su ghiaccio
narrower: Pelota
narrower: Judo
narrower: Karate
narrower: lacrosse
narrower: Slittino
narrower: Maratona
narrower: Pentathlon moderno
narrower: Automobilismo
narrower: Campionato Rally
narrower: Motociclismo
narrower: Netball
narrower: Sci nordico
narrower: Orientamento
narrower: polo
narrower: Motonautica
narrower: Canottaggio
narrower: Lega del rugby
narrower: Union rugby
narrower: Vela
narrower: Tiro a segno
narrower: Salto con gli sci
narrower: Snowboard
narrower: Calcio
narrower: Softball
narrower: Pattinaggio di velocità
narrower: vía rápida
narrower: Organizzazioni sportive
narrower: Squash
narrower: 相撲
narrower: サーフィン
narrower: Nuoto

Sport Aviatori
type: Concept
preferred label: deporte aéreo y de aviación @es
preferred label: desportos aéreos @pt-pt
preferred label: Sports aériens et d'aviation @fr
preferred label: 航空スポーツ @ja-jp
preferred label: Luft- und Flugsport @de
preferred label: esportes aéreos @pt-br
preferred label: aero and aviation sport @en-gb
definition: パラシューティング、自由落下(パラグライダー、ハンググライダー)、グライダー、軽航空機、動力飛行機(飛行機、超軽量飛行機、ヘリコプター) @ja-jp
definition: Paracaidismo, caída libre (parapente, aladeltismo), planeador,aerostático, vuelo motorizado (aeroplano, ultraliviano, helicóptero). @es
definition: Parachuting, freefall (parapente, delta-plane), gliding, aerostat, motorised flight (airplane, ultra light craft, helicopter) @en-gb
definition: Paracadutismo, volo a vela, mongolfiere, aerei a motore, elicottero ecc.
definition: Paraquedismo, queda livre (parapente, asa-delta), voo à vela, aeróstato, voo motorizado (avião, ultraleve, helicóptero). @pt-pt
definition: Paraquedismo, queda livre (parapente, asa-delta), voo a vela, aeróstato, voo motorizado (avião, ultraleve, helicóptero). @pt-br
definition: Fallschirmspringen, freier Fall (Gleitschirm, Drachenfliegen), Segelfliegen, Ballon, Motorflug (Flugzeug, Leichtflugzeug, Hubschrauber). @de
definition: parachutisme, vol libre (parapente, aile delta) vol à voile, aérostat, vol à moteur (avion, planeur ultraléger motorisé, hélicoptère). @fr
note: nessuno
in scheme: Subject Code
created: 2000-10-30T12:00:00+00:00
modified: 2010-12-15T17:01:09+00:00
broader: Sport
narrower: Paracadutismo
narrower: Paracadutismo sportivo
broad match: http://cv.iptc.org/newscodes/mediatopic/15000000

Sci alpino
type: Concept
preferred label: アルペンスキー @ja-jp
preferred label: esqui alpino @pt-br
preferred label: Ski alpin @fr
preferred label: esquí alpino @es
preferred label: alpine skiing @en-gb
definition: Esquiar colina abajo en pendiente pronunciada, por pistas cubiertas de nieve, tan rápido como sea posible. @es
definition: Esquiar colina abaixo, em pistas cobertas de neve, com a maior velocidade possível. As pistas têm pórticos espaçados de acordo com a disciplina envolvida. @pt-pt
definition: Discesa con gli sci nel minor tempo possibile lungo pendii di neve su piste appositamente predisposte con eventuale presenza di porte intermedie disposte ad intervalli diversi in base alla disciplina
definition: Skiing downhill on snow-covered slopes as fast as possible. The slopes contain intermediate gates which are spaced according to the discipline involved @en-gb
definition: 雪の斜面を全速力で滑り降りるスキー競技。経路には規則に従った旗門が配置される @ja-jp
definition: Abfahrtslauf auf schneebedeckten Pisten so schnell wie möglich. Die Hänge haben verschiedene Tore, die abhängig sind von der jeweiligen Disziplin. @de
definition: sport pratiqué sur skis et sur des pistes aménagées, en pente raide @fr
note: nessuno
in scheme: Subject Code
created: 2000-10-30T12:00:00+00:00
modified: 2010-12-15T17:01:09+00:00
broader: Sport
narrower: Libera
narrower: Gigante
narrower: Super g
narrower: slalom
narrower: Combinata

Football americano
type: Concept
preferred label: futebol americano @pt-pt
preferred label: Football américain @fr
preferred label: アメリカンフットボール @ja-jp
preferred label: American football @en-gb
preferred label: American Football @de
preferred label: fútbol americano @es
definition: *Jogo de bola que opõe duas equipes, compostas por uma secção de ataque e outra de defesa. Cada ataque avança em direção à defesa contrária, movendo uma bola ovalada pelo campo até à **end zone** para marcar **touchdown** e ganhar pontos. * @pt-br
definition: Gioco con un pallone di forma ovale che oppone due squadre con sezioni di attacco e di difesa. Ciascun attacco va contro la difesa dell'altra squadra, tentando di avanzare fino alla zona finale per segnare un touch-down e guadagnare punti
definition: Mannschaftsballspiel, bei dem zwei Teams gegeneinander spielen, die Gebiete angreifen und verteidigen müssen. Jeder Angriff folgt auf die Verteidigung der anderen, mit dem Versuch einen Ball in das Feld und in die Zone zu bringen, einen Touchdown zu erzielen und damit Punkte zu machen. @de
definition: Jeu de ballon opposant deux équipes qui se composent d'une formation d'attaque et d'une autre de défense. L'équipe d'attaque doit faire avancer le ballon dans la zone d'en-but adverse et l'équipe de défense doit empêcher cette progression. @fr
definition: Juego de pelota ovalada en el cual se oponen dos equipos, compuestos por una formación de ataque y otra de defensa. Cada ataque trata de avanzar a lo largo del campo con la pelota, dentro de la zona final del contrario, para obtener el punto. @es
definition: *Jogo de bola que opõe duas equipas, compostas por uma secção de ataque e outra de defesa. Cada ataque avança em direção à defesa contrária, movendo uma bola ovalada pelo campo até à **end zone** para marcar **touchdown** e ganhar pontos. * @pt-pt
definition: Team ball game that opposes two teams that have attack sections and defence sections. Each attack goes up against the other defence and attempts to move an oval-shaped ball down the field and into the end-zone to mark a touchdown and earn points. @en-gb
definition: 攻撃と防御セクションで構成されるチームが向かい合う球技。攻撃は相手のディフェンスとぶつかり合いながら楕円形のボールをエンドゾーンまで運んでタッチダウンすることによって得点を得る @ja-jp
note: nessuno
in scheme: Subject Code
created: 2000-10-30T12:00:00+00:00
modified: 2010-12-15T17:01:09+00:00
broader: Sport
narrower: National Football League (USA)
narrower: Entry deleted
narrower: afl

Tiro con l'arco
type: Concept
preferred label: Tir à l'arc @fr
preferred label: tiro com arco @pt-br
preferred label: archery @en-gb
preferred label: arquería @es
preferred label: アーチェリー @ja-jp
preferred label: Bogenschießen @de
definition: 射手は平均70m先にある直径1.22mの標的を射るために弓と矢を使う @ja-jp
definition: Atteindre le centre d'une cible de 122 cm de diamètre située à 70 m au moyen d'une flêche décochée par un arc. @fr
definition: Los competidores usan arco y flecha para alcanzar blancos de 1.22 metros de diámetro, que se encuentran a 70 metros de distancia promedio. @es
definition: Os arqueiros usam arcos e flechas para acertar em alvos de 1.22 metros de diâmetro, colocados a cerca de 710 metros de distância. @pt-br
definition: Gli arcieri usano archi e frecce per mirare a bersagli di 1.22 metri di diametro e posizionati ad distanza media di 70 metri uno dall'altro
definition: Bogenschütze benutzt Bogen und Pfeile, um eine Zielscheibe zu treffen mit 1.22 Meter Durchmesser, im Durchschnitt in 70 Meter Entfernung. @de
definition: Archers use bows and arrows to aim at targets 1.22 metres in diameter which are on average 70 metres distant. @en-gb
note: nessuno
note: typo fixed in Explanation @en-gb
in scheme: Subject Code
created: 2000-10-30T12:00:00+00:00
modified: 2010-12-15T17:01:09+00:00
broader: Sport
narrower: FITA/Tiro con l'arco con bersagli all'aperto
narrower: Balestra

Atletica leggera
type: Concept
preferred label: Leichtathletik @de
preferred label: 陸上 @ja-jp
preferred label: atletismo en pista y campo @es
preferred label: athletics, track and field @en-gb
preferred label: atletismo @pt-br
preferred label: Athlétisme @fr
definition: Wettbewerbe im Laufen, Springen und Werfen, die auf einer Bahn im Stadion oder auf der Straße ausgeübt werden können. @de
definition: Compétitions de course, de saut et de lancer effectuées sur piste, dans un stade ou sur route. @fr
definition: Gare che includono corse a piedi a tempo, salti e lanci che possono essere disputate su piste e campi all'interno di uno stadio o su strada
definition: Competições envolvendo corridas a pé, saltos e lançamentos, em pista de estádio ou ao ar livre. @pt-br
definition: Competitions involving foot races, jumping and throwing which can be on a track inside a stadium or on outside roads @en-gb
definition: Competencias que consisten en carreras, saltos y lanzamientos, que se desarrollan dentro de un estadio o en trazados exteriores. @es
definition: 競技場内のトラック、もしくは場外の一般道で行うことができる徒競走、跳躍、そして投擲を含む競技 @ja-jp
note: nessuno
in scheme: Subject Code
created: 2000-10-30T12:00:00+00:00
modified: 2010-12-15T17:01:09+00:00
broader: Sport
narrower: 100 m
narrower: 200 m
narrower: 400 m
narrower: 800 m
narrower: 1000 m
narrower: 1500 m
narrower: Miglio
narrower: 2000 m
narrower: 3000 m
narrower: 5000 m
narrower: 10.000 m
narrower: 20 km
narrower: 1 ora
narrower: 25.000
narrower: 30.000
narrower: 110 ostacoli
narrower: 400 ostacoli
narrower: 3000 siepi
narrower: Salto in alto
narrower: Salto con l'asta
narrower: Salto in lungo
narrower: Salto Triplo
narrower: Lancio del peso
narrower: Lancio del disco
narrower: Lancio del martello
narrower: Lancio del giavellotto
narrower: Decathlon
narrower: 4x100
narrower: 4x200
narrower: 4x400
narrower: 4x800
narrower: 4x1500
narrower: Marcia 1h
narrower: Marcia 2 h
narrower: 10 km marcia
narrower: 15 km marcia
narrower: 20 km marcia
narrower: 30 km marcia
narrower: 50 km marcia
narrower: 100 ostacoli
narrower: 5 km marcia
narrower: Eptathlon
narrower: 1500 m marcia
narrower: 2000 m marcia
narrower: 3000 m marcia
narrower: 50 m
narrower: 50 ostacoli
narrower: 50 yards
narrower: 50 yards ostacoli
narrower: 60 m
narrower: 60 m ostacoli
narrower: ６０ヤード
narrower: 60 yards ostacoli
narrower: 100 yards
narrower: 100 yards ostacoli
narrower: 300m
narrower: 300 yards
narrower: ４４０ヤード
narrower: 500 m
narrower: ５００ヤード

Badminton
type: Concept
preferred label: badminton @pt-br
preferred label: バドミントン @ja-jp
definition: Zwei Spieler oder Teams mit zwei Spielern, die einen Federball mit dem ungefähren Gewicht von 5 Gramm über ein hohes Netz schlagen. Das Ziel für jeden Spieler/Team ist es, die Landung des Federballs auf ihrer Seite des Feldes zu verhindern. @de
definition: Dois jogadores ou duas duplas competem batendo uma peteca com uma raquete, sobre uma rede alta. O objetivo de cada jogador/dupla é impedir a peteca de tocar o chão em seu lado da quadra. @pt-br
definition: Dos jugadores o dos pares compiten golpeando con raquetas un elemento (de 5 gramos) con una base redonda de goma con plumillas en un extremo, por encima de una red. Cada jugador o equipo debe impedir que el elemento pique de su lado de la cancha. @es
definition: Due giocatori di due squadre da due componenti competono colpendo con una racchetta al di sopra di un'alta rete un volano che pesa approssimativamente 5 grammi. Lo scopo è evitare di far cadere il volano nella propria parte di campo.
definition: Dois jogadores ou duas duplas competem batendo um volante com uma raquete, sobre uma rede alta. O objetivo de cada jogador/dupla é impedir o volante de tocar o chão no seu lado do campo. @pt-pt
definition: 2 joueurs, ou 2 équipes de 2, s'affrontent en faisant passer un volant d'environ 5 grammes, par-dessus un filet à l'aide de raquettes. Le but est d'empêcher le volant de tomber au sol dans sa partie de terrain. @fr
definition: Two players or two teams of two compete by hitting a shuttlecock weighing approximately five grams over a high net. The aim for each player/team is to prevent the shuttlecock landing on their side of the court. @en-gb
definition: 2人あるいは2チーム2人づつが約5グラムの重さのシャトルコックを高いネット越しに打って競う それぞれの選手/チームはシャトルコックがコートの面に落ちないように防ぐ @ja-jp
note: nessuno
note: typo fixed in Explanation @en-gb
in scheme: Subject Code
created: 2000-10-30T12:00:00+00:00
modified: 2010-12-15T17:01:09+00:00
broader: Sport

Baseball
type: Concept
preferred label: beisebol @pt-br
preferred label: 野球 @ja-jp
preferred label: Base-ball @fr
preferred label: baseball @en-gb
preferred label: béisbol @es
preferred label: basebol @pt-pt
definition: Gioco fra due squadre dove il punto viene assegnato quando un giocatore corre intorno al campo delimitato da quattro basi. Per far questo deve prima colpire la palla lanciatagli da un giocatore avversario
definition: A game between two teams of nine played on an enclosed ground. The team which scores the most points wins. A point is scored when a player runs around the ground marked out by four bases. @en-gb
definition: Jeu entre 2 équipes de 9 joueurs, alternativement en attaque et en défense. L'équipe marquant le plus de points gagne la partie disputée en 9 manches (ou plus si égalité). Pour marquer, un joueur doit faire le tour d'un champ matérialisé par des *bases*. @fr
definition: Ein Spiel zwischen zwei Teams von neun Spielern auf einem geschlossenen Platz. Das Team mit den meisten Punkten gewinnt. Ein Punkt wird gemacht, wenn ein Spieler über den Platz läuft und dabei 4 Stationen passiert. @de
definition: 囲われた土地で9人ずつの2チームで行われる試合。相手チームより多く得点したチームが勝ちとなる。選手が4つの塁を通過することによって得点となる @ja-jp
definition: Juego entre 2 equipos de 9 jugadores, alrededor de un campo cerrado. El que marca más puntos en una partida de nueve *entradas* resulta ganador. Un jugador marca un punto al recorrer el campo marcado por 4 bases externas, tras golpear la bola. @es
definition: Jogo disputado entre 2 equipes de 9 jogadores em campo fechado. Ganha a equipe que marcar mais pontos durante a partida. Para marcar um ponto, o jogador, após bater a bola com um taco, deve dar a volta ao campo marcado por 4 bases externas. @pt-br
definition: Jogo disputado entre 2 equipas de 9 jogadores em campo fechado. Ganha a equipa que marcar mais pontos durante a partida. Para marcar um ponto, o jogador, após bater a bola com um taco, deve dar a volta ao campo marcado por 4 bases externas. @pt-pt
note: nessuno
note: Explanation shortened @en-gb
in scheme: Subject Code
created: 2000-10-30T12:00:00+00:00
modified: 2010-12-15T17:01:09+00:00
broader: Sport
narrower: Major League - American League
narrower: Major League - National League
narrower: Major League - special
narrower: Baseball palla gomma
narrower: Major League Playoffs
narrower: World Series

Basket
type: Concept
preferred label: Basketball @de
preferred label: basquete @pt-br
preferred label: Basket-ball @fr
preferred label: básquetbol @es
preferred label: basketball @en-gb
preferred label: バスケットボール @ja-jp
preferred label: basquetebol @pt-pt
definition: Game played between two teams of five - points are scored by placing the large inflated ball into a net fixed on a ring 3.05m above the ground. @en-gb
definition: Jogo disputado entre duas equipes de 5 jogadores. Pontos são marcados quando uma bola é encestada num aro com rede, que se encontra a uma altura de 3.05m do solo. @pt-br
definition: Jogo disputado entre duas equipas de 5 jogadores. Pontos são marcados quando uma bola é encestada num aro com rede, que se encontra a uma altura de 3.05m do solo. @pt-pt
definition: Sport collectif pratiqué en salle opposant deux équipes de cinq joueurs qui essaient de s'emparer du ballon et de marquer des points en le lançant dans un panier situé à 3,05 m du sol. @fr
definition: Spiel zwischen zwei Teams mit 5 Spielern - Punkte werden gemacht in dem man einen großen aufgepumpten Ball in einen Korb wirft, der 3.05 Meter über dem Boden hängt. @de
definition: Deporte colectivo practicado en una cancha rectangular, entre dos equipos de cinco jugadores cada uno. Dicho juego consiste en marcar puntos, encestando una pelota en un aro, situado en un tablero que se encuentra a una altura de 3.05 metros. @es
definition: 2つの5人で構成されるチームで行われる試合--空気で膨らませた大きなボールを地上3.05mに固定されたネットに入れることによって得点となる @ja-jp
definition: Gioco tra due squadre di cinque componenti ciascuna, in cui i punti sono segnati facendo passare il pallone in un anello con rete fissato ad un'altezza di circa 3,05 m da terra
note: nessuno
in scheme: Subject Code
created: 2000-10-30T12:00:00+00:00
modified: 2010-12-15T17:01:09+00:00
broader: Sport
narrower: NBA
narrower: Professionale femminile
narrower: Netball svizzero
narrower: Netball tedesco
narrower: Netball olandese

biatlón
type: Concept
preferred label: バイアスロン @ja-jp
preferred label: Biathlon
preferred label: biatlo @pt-pt
preferred label: biathlon @en-gb
definition: Competizione di sci da fondo in forma di inseguimento su un percorso di 12,5 km con serie di tiri al bersaglio con la carabina
definition: course de ski de fond disputée en style libre, entrecoupée de séries de tir à la carabine sur des cibles. @fr
definition: A combination of cross country skiing and target shooting in a pursuit format. @en-gb
definition: Prova que combina esqui de fundo com tiro ao alvo, em uma corrida de perseguição de 12.5 km. @pt-br
definition: Eine Kombination aus Skilanglauf und Schießen auf Zielscheiben (mit Verfolgungsstart) @de
definition: Prova que combina esqui de fundo com tiro ao alvo, numa corrida perseguição de 12.5 km. @pt-pt
definition: Combinación de esquí a campo traviesa y tiro al blanco, sobre un curso de 12,500 km en forma de persecución. @es
definition: 12.5Kコース上の追い抜き形式で、クロスカントリースキーとターゲット射撃を組み合わせたもの @ja-jp
note: nessuno
in scheme: Subject Code
created: 2000-10-30T12:00:00+00:00
modified: 2010-12-15T17:01:09+00:00
broader: Sport
narrower: 7,5 km
narrower: 10 Km
narrower: 15 Km
narrower: 20 Km
narrower: Staffetta 4 x 7,5 km
narrower: Inseguimento 12,5 km

Biliardo, snooker e pool
type: Concept
preferred label: billar, snooker y pool @es
preferred label: Billards, snooker et pool @fr
preferred label: billiards, snooker and pool @en-gb
preferred label: bilhar @pt-pt
preferred label: Billard @de
preferred label: ビリヤード @ja-jp
definition: Ein Spiel, was auf einem flachen Tisch gespielt wird, der mit Stoff bezogen ist, auf dem die Spieler Kugeln mit einem Holzqueue anstoßen nach bestimmten Regeln. @de
definition: Es un juego que se disputa sobre una mesa plana cubierta por un paño verde, donde los competidores intentan golpear bolas de acuerdo a reglas específicas usando un taco de madera. @es
definition: Jogo que se disputa sobre uma mesa, revestida por um pano verde, onde os jogadores batem as bolas com um taco comprido de madeira. @pt-br
definition: Si gioca su di un tavolo liscio la cui superficie è ricoperta da un panno di lana e dove i giocatori colpiscono delle palle con delle stecche di legno in base a specifiche regole
definition: 布(ラシャ)で覆われた平らなテーブルの上でプレーする競技、競技者は特定のルールに従い木製のキューを使用してボールを打つ @ja-jp
definition: A game played on a flat table covered with a cloth (baize) where players hit balls according to specific rules using a wooden cue. @en-gb
definition: Jeux d'adresse pratiqués sur une table consitant à frapper des billes au moyen d'un bâton (queue) @fr
definition: Jogo que se disputa numa mesa revestida com um pano de feltro e em que os jogadores batem as bolas de acordo com regras específicas, utilizando um taco de madeira. @pt-pt
note: nessuno
in scheme: Subject Code
created: 2000-10-30T12:00:00+00:00
modified: 2010-12-15T17:01:09+00:00
broader: Sport
narrower: 8-ball
narrower: 9 palle
narrower: 14.1
narrower: Continuo - ANNULLATO
narrower: Altri - ANNULLATO
narrower: Snooker

bobsleigh
type: Concept
preferred label: trineo @es
preferred label: bobsled @pt-br
preferred label: ボブスレー @ja-jp
preferred label: Bobsleigh @fr
preferred label: Bob
definition: 2人又は4人が、大型のソリでコースを滑り降りる。それは主な胴体に、枠、２つの車軸、そして滑走部から成り立つ。すべての競技の合計時間をもとに勝者を決定する @ja-jp
definition: Desporto de inverno em que equipas de 2 ou 4 pessoas, sentadas num trenó com casco assente em 4 trilhos de aço, deslizam por uma estreita pista de gelo protegida lateralmente e com muitas curvas. @pt-pt
definition: Disciplina en la cual equipos de 2 o 4 personas se deslizan en un trineo constituido de un casco principal, un armazón, un eje delantero y trasero, y dos juegos de patines. Los competidores aceleran el trineo empujándolo y luego saltan y se sientan en él. @es
definition: Sport invernale nel quale squadre da 2 o 4 persone fanno discese cronometrate su una pista ghiacciata stretta a bordo di un mezzo con pattini chiamato bob inizialmente spinto dai concorrenti
definition: In bobsleigh two or four persons race down a course sitting in a sled that consists of a main hull, a frame, two axles and sets of runners. The total time of all heats in a competition is added together to determine the winner. @en-gb
definition: Im Bobsport fahren zwei oder vier Athleten in einem Rennschlitten sitzend, der aus einer Verkleidung, einem Rahmen, zwei Achsen und Kufen besteht, eine Bahn (Natureis- oder Kunsteisbahn) hinab. Die Gesamtlaufzeit wird aus den Einzelzeiten der Läufe zusammengezählt und daraus der Gewinner ermittelt. @de
definition: Sport de glisse sur une piste glacée dans un traîneau bobsleigh occupé par un équipage de 2 ou 4 concurrents @fr
definition: Esporte de inverno em que equipes de 2 ou 4 pessoas, sentadas em um trenó com casco assente em 4 trilhos de aço, deslizam por uma estreita pista de gelo protegida lateralmente e com muitas curvas. @pt-br
note: nessuno
in scheme: Subject Code
created: 2000-10-30T12:00:00+00:00
modified: 2010-12-15T17:01:09+00:00
broader: Sport
narrower: Bob a due
narrower: Bob a quattro

Bowling
type: Concept
preferred label: bowling @pt-pt
preferred label: ボウリング @ja-jp
preferred label: boliche @pt-br
definition: Spiel, wobei ein Spieler Punkte erzielt indem er versucht 10 Kegel mit einer Kugel umzuschmeißen. Wenn er erfolglos ist, hat er einen zweiten Versuch. Ein Spiel besteht aus 10 Aufstellungen. @de
definition: Juego en el cual un competidor marca puntos al derribar un conjunto de 10 bolos alineados, lanzando una bola al ras de una senda especial. Si fracasa tiene una segunda chance para derribar los que permanezcan en pie. El juego comprende 10 tentativas. @es
definition: Jogo que consiste em derrubar um conjunto de 10 pinos alinhados no final de uma pista através do lançamento de uma bola pesada. Se falhar, o jogador tem até 10 tentativas para derrubar todos os pinos. @pt-pt
definition: Un gioco nel quale il giocatore segna punti cercando di buttare a terra dieci birilli usando una palla. Se il giocatore sbaglia ha diritto ad un secondo tentativo.
definition: Jeu d'adresse qui consiste à renverser 10 quilles sur le premier lancer à l'aide d'une boule et en cas d'échec, de faire tomber les restantes avec une deuxième tir. Une partie comprend 10 tentatives. @fr
definition: A game in which a player scores points by trying to knock down ten 'pins' using a ball - if unsuccessful the player has a second attempt. A game consists of ten frames. @en-gb
definition: ボールを使って10本のピンを打ち倒し点数を競うゲーム。もし1投目に10本倒すことができなかった場合、2投目を試みる。このゲームは10フレームで成立する @ja-jp
note: nessuno
in scheme: Subject Code
created: 2000-10-30T12:00:00+00:00
modified: 2010-12-15T17:01:09+00:00
broader: Sport

Bocce
type: Concept
preferred label: petanca @pt-br
preferred label: Boule anglaise et pétanque @fr
preferred label: bowls and petanque @en-gb
preferred label: bolos y petanca @es
preferred label: ボウルズ・ペタンク @ja-jp
preferred label: Boules/ Pètanque @de
definition: Jogo que consiste no lançamento de bolas de aço com o objetivo de ficarem o mais próximo possível do alvo, uma pequena bola de madeira que é atirada no início do jogo. @pt-br
definition: Juego en el cual los jugadores lanzan bolos a un blanco. El ganador es aquel que arrima su lanzamiento lo más cerca posible del blanco. @es
definition: sport qui consiste à placer ses boules le plus près possible du but. L'adversaire essaie de placer les siennes plus près, ou selon les règles d'enlever en tirant celles qui gênent @fr
definition: ターゲットにボールを投げ一番近づいた人が勝つゲーム @ja-jp
definition: Un gioco scopo del quale tirare quante più bocce possibili vicino al pallino, che può anche essere allontanato dalla boccia avversaria colpendolo con la propria
definition: A game in which players throw bowls at a target, the winner being the player who lands closest. @en-gb
definition: Spiel bei dem die Spieler Kugeln auf eine Zielscheibe werfen. Der Gewinner ist derjenige, der am nächsten herankommt. @de
note: DEPRECATED in V 16 @fr
note: nessuno
in scheme: Subject Code
created: 2000-10-30T12:00:00+00:00
modified: 2010-12-15T17:01:09+00:00
broader: Sport

Pugilato
type: Concept
preferred label: boxeo @es
preferred label: Boxe @fr
preferred label: boxing @en-gb
preferred label: boxe @pt-br
preferred label: Boxen @de
preferred label: ボクシング @ja-jp
definition: sport de combat où deux hommes s'affrontent sur un ring carré de 6 m de côté en se servant uniquement de leurs poings, munis de gants en cuir @fr
definition: Desporto de combate em que dois homens ou duas mulheres lutam usando apenas os punhos protegidos por luvas, num ringue quadrado de 6m de lado. A luta é geralmente dividida em 12 assaltos de 3 minutos cada. @pt-pt
definition: 2人の男子または女子が、1辺6mの四角いリングで中身の詰まったグローブで戦う格闘技。通常は、1ラウンド3分で12ラウンド戦う @ja-jp
definition: Esporte de combate em que dois homens ou duas mulheres lutam usando apenas os punhos protegidos por luvas, num ringue quadrado de 6m de lado. A luta é geralmente dividida em 12 assaltos de 3 minutos cada. @pt-br
definition: Deporte de combate en el cual dos hombres o mujeres pelean usando únicamente sus puños, cubiertos por guantes, sobre un cuadrilátero de 6 metros de lado. El combate es usualmente pactado a 12 rounds de 3 minutos cada uno. @es
definition: Combattimento sportivo nel quale due atleti usano esclusivamente i loro pugni coperti da guanti imbottiti all'interno di un recinto di 6m per lato.
definition: Kampfsport bei dem zwei Männer/Frauen kämpfen mit Fäusten, die geschützt sind durch Handschuhe, in einem Ring von 6 m je Seite. Der Kampf ist in der Regel geteilt in 12 Runden von jeweils 3 Minuten. @de
definition: Combat sport in which two men/women fight using only their fists covered by padded gloves in a square ring measuring 6m a side. The fight is usually split into 12 rounds of three minutes each. @en-gb
note: DEPRECATED in V 16 @fr
note: nessuno
in scheme: Subject Code
created: 2000-10-30T12:00:00+00:00
modified: 2010-12-15T17:01:09+00:00
broader: Sport
narrower: Supermassimi
narrower: Massimi
narrower: Mediomassimi
narrower: Massimi leggeri
narrower: Supermedi
narrower: Medi
narrower: Medi leggeri
narrower: Welter
narrower: Superleggeri
narrower: leggeri
narrower: Superpiuma
narrower: Piuma
narrower: Supergallo
narrower: Gallo
narrower: Supermosca
narrower: Mosca
narrower: Mosca leggeri
narrower: Paglia
narrower: IBF
narrower: WBA
narrower: cmb (wbc)
narrower: WBO
narrower: Pugilato francese
narrower: Pugilato thai

Canoa, Kayak
type: Concept
preferred label: Kanu und Kajak @de
preferred label: カヌー・カヤック @ja-jp
preferred label: Canoë-kayak @fr
preferred label: canoagem @pt-br
preferred label: canotaje y kayak @es
preferred label: canoeing and kayaking @en-gb
definition: Desporto misto que consiste na exploração de lagos, descida ou subida de rios numa canoa. @pt-pt
definition: Corridas de embarcações em águas vivas ou em águas mortas. @pt-br
definition: races in either 'white' or 'dead' water @en-gb
definition: Rennen sowohl in wilden, als auch toten Gewässern. @de
definition: Carreras de embarcaciones en aguas calmas o turbulentas. @es
definition: course entre embarcations en eaux vives ou eaux calmes @fr
definition: 急流または、静水におけるレース @ja-jp
definition: Corse in imbarcazioni in acque calme o agitate
note: nessuno
in scheme: Subject Code
created: 2000-10-30T12:00:00+00:00
modified: 2010-12-15T17:01:09+00:00
broader: Sport
narrower: Slalom
narrower: pista
narrower: 500 m
narrower: 1000 m
narrower: K1
narrower: K2
narrower: K4
narrower: C1
narrower: C2
narrower: C4
narrower: Canoa a vela
narrower: Pontoniering

Alpinismo
type: Concept
preferred label: Bergsteigen @de
preferred label: alpinismo (montañismo) @es
preferred label: Alpinisme et escalade @fr
preferred label: alpinismo @pt-br
preferred label: climbing @en-gb
preferred label: クライミング @ja-jp
definition: Escalar montanhas com equipamento próprio. @pt-br
definition: sports de montagne @fr
definition: Sports alpini consistenti in arrampicate e scalate di pareti di roccia e/o ghiaccio
definition: Bergsportart @de
definition: 山のスポーツ @ja-jp
definition: Escalamiento de una montaña con implementos especiales @es
definition: mountain sports @en-gb
note: nessuno
in scheme: Subject Code
created: 2000-10-30T12:00:00+00:00
modified: 2010-12-15T17:01:09+00:00
broader: Sport
narrower: Scalata
narrower: Arrampicata libera

Cricket
type: Concept
preferred label: críquete @pt-pt
preferred label: cricket @es
preferred label: クリケット @ja-jp
preferred label: Kricket @de
definition: Ballsport mit zwei Teams je 11 Spielern, Bälle, Schlagholz und Pfostentoren. Das Ziel ist so viele Tore wie möglich zu durchschlagen und das andere Team rauszuschmeißen. Ein *Run* beinhaltet das Rennen eines Spielers zwischen den Pfostentoren. Das gegnerische Team versucht die Konkurrenten rauszuschmeißen. @de
definition: Deporte de pelota con 2 equipos de 11 jugadores. Hay que anotar la mayor carrera posible y dejar *fuera* al otro equipo. Una carrera se completa cuando un jugador corre entre dos bases. Los equipos tratan de defender su valla del lanzamiento rival. @es
definition: Jogo de bola e taco entre duas equipas de 11 jogadores. Joga-se em campo relvado, amplo e de formato oval. O objetivo é marcar o maior número de corridas, impedindo corridas e eliminando batedores da equipa adversária. @pt-br
definition: Ball sport involving two teams of 11 players, balls, bats and wickets. The aim is to score as many runs as possible, and to get the opposing team 'out'. A 'run' involves a player running between two wickets. The opposing team try to get their rivals 'out' @en-gb
definition: Sport con palla che richiede due squadre di 11 giocatori, palle, mazze e porte
definition: jeu entre deux équipes de onze joueurs. Le but est de défendre un guichet contre la balle du lanceur. On marque des points quand le batteur courant d'un guichet à l'autre, réalise un ou plusieurs aller-retours à condition que la balle soit en jeu. @fr
definition: 11人の選手2チーム、ボール、バット、ウィケットからなる球技。出来るだけ“ラン”をして多くの点を取り、対戦相手の“アウト”を取ることを目的とする。“ラン”は選手が２つのウィケットの間を走ることに関連している。対戦チームは相手チームが“アウト”になるように企てる @ja-jp
note: nessuno
in scheme: Subject Code
created: 2000-10-30T12:00:00+00:00
modified: 2010-12-15T17:01:09+00:00
broader: Sport

Curling
type: Concept
preferred label: curling @en-gb
preferred label: カーリング @ja-jp
definition: A game played on ice with large flat round stones. A player throws the stone, aiming at a target. Team mates of the player who has thrown the stone can sweep the ice in front of the stone to help smooth its path towards the target. @en-gb
definition: Ein Spiel, das auf dem Eis gespielt wird mit flachen runden Steinen. Ein Spieler wirft einen Stein gezielt auf eine Zielscheibe. Ein Teamhelfer des Spielers, der geworfen hat, kann das Eis vor dem Stein kehren, damit der Stein besser Richtung Zielscheibe rutscht. @de
definition: Jogo disputado sobre pista de gelo com pedras redondas planas na base e pega curva. O jogador lança a pedra pela pista, tentando que ela fique o mais próximo possível do alvo. Os companheiros podem varrer a pista para que a pedra deslize mais facilmente até o alvo. @pt-br
definition: 大きく平らで丸い石を使って氷の上で行うスポーツ。選手は石を投げ、標的を狙う。石を投げる選手のチームメイトは標的に向かっているコースをスムーズにするために、石の前の氷を掃くことができる @ja-jp
definition: Un juego disputado sobre piso de hielo con fichas chatas y redondas. Un jugador lanza el útil, apuntando a un blanco y sus compañeros pueden *barrer* el piso de hielo delante de la ficha para hacer más ágil su deslizamiento al objetivo. @es
definition: Jogo disputado sobre pista de gelo com pedras redondas planas na base e pega curva. O jogador lança a pedra pela pista, tentando que ela fique o mais próximo possível do alvo. Os companheiros podem varrer a pista para que a pedra deslize mais facilmente até ao alvo. @pt-pt
definition: sport sur glace qui consiste à placer des pierres le plus près possible du centre d'une cible en les faisant glisser. Les partenaires du lanceur peuvent balayer la glace devant la pierre pour en faciliter la glisse. @fr
definition: Giocato su ghiaccio con pietre piatte e rotonde. Un giocatore lancia la pietra, mirando al bersaglio. I suoi compagni di squadra possono spazzare il ghiaccio davanti alla pietra per facilitare il suo scivolamento verso il bersaglio
note: nessuno
in scheme: Subject Code
created: 2000-10-30T12:00:00+00:00
modified: 2010-12-15T17:01:09+00:00
broader: Sport
narrower: Icestock sport

Ciclismo
type: Concept
preferred label: ciclismo @es
preferred label: cycling @en-gb
preferred label: Radsport @de
preferred label: Cyclisme @fr
preferred label: 自転車 @ja-jp
definition: Parcourir une distance donnée à bicyclette le plus rapidement possible. @fr
definition: Una carrera sobre una distancia dada en bicicleta de competición. @es
definition: 自転車に乗って、決められた距離を競うレース @ja-jp
definition: Una corsa di bicicletta tenuta su una data distanza
definition: A race over a given distance on bicycles. @en-gb
definition: Ein Rennen auf Fahrrädern über eine vorgegeben Distanz. @de
definition: Corrida de bicicleta. @pt-pt
note: nessuno
in scheme: Subject Code
created: 2000-10-30T12:00:00+00:00
modified: 2010-12-15T17:01:09+00:00
broader: Sport
narrower: Pista
narrower: Inseguimento
narrower: Sprint olimpico
narrower: Sprint
narrower: 競輪
narrower: Corsa a punti
narrower: course à l'Américaine
narrower: Cronometro 500 m donne
narrower: Cronometro 1 km uomini
narrower: Ora
narrower: Strada
narrower: Cronometro su strada
narrower: Corsa a tappe
narrower: Ciclocross
narrower: Mountain bike
narrower: Mountain bike cross
narrower: Mountain bike fondovalle
narrower: Bicrossing
narrower: Trial
narrower: Ciclismo acrobatico
narrower: Ciclopalla

Danza
type: Concept
preferred label: Danse sportive @fr
preferred label: danza @es
preferred label: dancing @en-gb
preferred label: Tanzen @de
preferred label: dança rítmica @pt-pt
preferred label: ダンス @ja-jp
definition: Tanzwettbewerb, wo Paare in Technik und Interpretation bewertet werden. @de
definition: Dancing competition where couples are judged on technique and interpretation. @en-gb
definition: Competencia de danza donde las parejas son juzgadas por su técnica e interpretación. @es
definition: Competizione di danza in cui delle coppie sono giudicate sulla loro tecnica e interpretazione
definition: カップルのテクニックと演技力を審査する競技 @ja-jp
definition: concours de danse où les couples sont jugés sur le plan technique et de l'interprétation @fr
definition: Competição de dança em que os pares são julgados pela técnica e pela interpretação. @pt-pt
note: nessuno
in scheme: Subject Code
created: 2000-10-30T12:00:00+00:00
modified: 2010-12-15T17:01:09+00:00
broader: Sport

Tuffi
type: Concept
preferred label: saltos ornamentais @pt-br
preferred label: 飛び込み @ja-jp
preferred label: diving @en-gb
preferred label: Plongeon @fr
preferred label: Turm- und Brettspringen @de
preferred label: clavados @es
preferred label: saltos para a água @pt-pt
definition: Le plongeur s'élance d'un tremplin ou d'une plate-forme rigide. Il réalise des figures acrobatiques notées sur 10 par 7 juges. @fr
definition: Os atletas mergulham de uma plataforma fixa ou de um trampolim e são avaliados por sete juízes, que atribuem notas de 0 a 10 a cada salto. @pt-br
definition: Wettkämpfer springen von einem festen oder Sprungbrett und werden von sieben Richtern in einer Skala von 10 Punkten für akrobatische Figuren bewertet. @de
definition: Competidores (clavadistas) se lanzan al agua desde una plataforma fija o un trampolín y sus saltos (clavados) son juzgados por siete jueces. El puntaje máximo para las acrobacias es de 10 puntos. @es
definition: I concorrenti si tuffano da un trampolino o una piattaforma e sono valutati da una giuria composta da sette giudici che danno punti da uno fino a dieci per i loro movimenti acrobatici
definition: Competitors dive off a fixed or spring board and are assessed by seven judges giving marks up to ten for their acrobatic moves. @en-gb
definition: 選手は固定されている飛込台か飛板から飛び込み、7人の審判がそのアクロバチックな動きを10点満点で採点する @ja-jp
note: nessuno
in scheme: Subject Code
created: 2000-10-30T12:00:00+00:00
modified: 2010-12-15T17:01:09+00:00
broader: Sport
narrower: Piattaforma 10m
narrower: Piattaforma 10m sincro
narrower: Trampolino 3m
narrower: Trampolino 3m sincro
narrower: Sport subacquei
narrower: Immersioni subacquee

Equitazione
type: Concept
preferred label: hipismo @pt-pt
preferred label: equestrian @en-gb
preferred label: Equitation @fr
preferred label: equitación @es
preferred label: Pferdesport @de
preferred label: 馬術 @ja-jp
definition: Sport equestri con un cavallo e un fantino
definition: Desporto envolvendo um cavalo e um cavaleiro. @pt-pt
definition: Sport involving a horse and rider. @en-gb
definition: 馬と騎手がかかわり合うスポーツ @ja-jp
definition: Deporte que involucra a parejas formadas por un jockey (jinete) y caballo . @es
definition: sport mettant en œuvre un couple cavalier et cheval @fr
definition: Esporte envolvendo um cavalo e um cavaleiro. @pt-br
definition: Sport der ein Pferd und einen Reiter umfasst. @de
note: nessuno
in scheme: Subject Code
created: 2000-10-30T12:00:00+00:00
modified: 2010-12-15T17:01:09+00:00
broader: Sport
narrower: Tre Giorni
narrower: Dressage
narrower: Salto
narrower: Cross-Country

Scherma
type: Concept
preferred label: esgrima @pt-br
preferred label: Escrime @fr
preferred label: フェンシング @ja-jp
preferred label: fencing @en-gb
preferred label: Fechten @de
definition: Desporto de combate que usa espada, florete ou sabre. @pt-pt
definition: Combat sport using a sword or foil. @en-gb
definition: sport de combat pratiqué avec une épée ou un sabre @fr
definition: Esporte de combate que usa espada, florete ou sabre. @pt-br
definition: Kampfsport mit Schwert oder Florett. @de
definition: Combattimento sportivo in cui si usa un'arma bianca a lama lunga
definition: 剣かフルーレを使用する格闘技 @ja-jp
definition: Deporte de combate utilizando una espada, florete o sable. @es
note: nessuno
in scheme: Subject Code
created: 2000-10-30T12:00:00+00:00
modified: 2010-12-15T17:01:09+00:00
broader: Sport
narrower: Spada
narrower: Fioretto
narrower: Sciabola

Hockey su prato
type: Concept
preferred label: Feldhockey @de
preferred label: hockey sobre césped @es
preferred label: hóquei em campo @pt-br
preferred label: Hockey sur gazon @fr
preferred label: ホッケー @ja-jp
preferred label: field Hockey @en-gb
definition: jeu de balle et de crosse où deux équipes de 11 joueurs essayent de marquer le plus de buts à l'adversaire @fr
definition: *Jogo de bola envolvendo duas equipes de 11 jogadores que usam tacos (**sticks**) curvos na ponta inferior para bater uma bola pequena e dura. O objetivo é marcar o maior número de gols.* @pt-br
definition: 1チームは11人で構成され、曲がったスティツクを用いチーム同士で対戦するボールスポーツ。出来るだけ多くゴールを決め、得点することが目標 @ja-jp
definition: Deporte de pelota entre dos equipos de 11 jugadores que disputan la bocha con bastones de punta curva. El objetivo es anotar la mayor cantidad de goles. @es
definition: A ball sport involving two teams of 11 players using curved sticks. The aim is to score as many goals as possible. @en-gb
definition: Sport che vede fronteggiarsi due squadre di 11 giocatori ciascuna che usano dei bastoni curvi per segnare quante più reti all'avversario
definition: *Jogo de bola envolvendo duas equipas de 11 jogadores que usam tacos (**sticks**) curvos na ponta inferior para bater uma bola pequena e dura. O objetivo é marcar o maior número de golos.* @pt-pt
definition: Eine Ballsportart mit zwei Teams je 11 Spielern und einem gebogenen Stock. Das Ziel ist so viele Tore zu machen wie möglich. @de
note: nessuno
in scheme: Subject Code
created: 2000-10-30T12:00:00+00:00
modified: 2010-12-15T17:01:09+00:00
broader: Sport
narrower: Hockey a rotelle

Pattinaggio artistico
type: Concept
preferred label: patinação artística @pt-br
preferred label: フィギュアスケート @ja-jp
preferred label: Patinage artistique @fr
preferred label: patinagem artística @pt-pt
preferred label: figure Skating @en-gb
preferred label: Eiskunstlauf @de
preferred label: patinaje artístico @es
definition: Disciplina individuale o di coppia che consiste nell'effettuare figure artistiche o danzare su una base musicale
definition: Los patinadores son juzgados por nueve jueces que otorgan puntos para dos secciones preparadas, en las que deben ejecutar figuras al compás de la música, procurando conjugar armónicamente belleza artística y precisión técnica. @es
definition: Um von neun Punktrichtern die beste Punktzahl zu bekommen in zwei vorbereiteten Bereichen - beide zu Musik gelaufen - müssen die Wettkämpfer die höchst mögliche Harmonie zwischen artistischem Ausdruck und technischer Präzision erreichen. @de
definition: 9人の審判から一番よい採点を得るために、競技者は2つの種目(どちらも音楽に合わせてスケートする)で最高の芸術点と技術点を獲得することを試みる @ja-jp
definition: To obtain the best marks possible from nine judges who award scores after two prepared sections - both skated to music - during which competitors must attempt to achieve the greatest possible harmony between artistic flair and technical precision. @en-gb
definition: Desporto, individual ou em pares, em que os patinadores são avaliados por 9 juízes após cada programa apresentado. Os patinadores devem executar figuras e movimentos ao som da música, conjugando beleza artística e precisão técnica. @pt-pt
definition: Esporte, individual ou em pares, em que os patinadores são avaliados por 9 juízes após cada programa apresentado. Os patinadores devem executar figuras e movimentos ao som da música, conjugando beleza artística e precisão técnica. @pt-br
definition: sport individuel ou en couple consistant à effectuer des figures ou des danses sur glace @fr
note: nessuno
in scheme: Subject Code
created: 2000-10-30T12:00:00+00:00
modified: 2010-12-15T17:01:09+00:00
broader: Sport
narrower: Individuale
narrower: In coppia
narrower: Danza sul ghiaccio

Sci Freestyle
type: Concept
preferred label: esqui estilo livre @pt-pt
preferred label: Ski acrobatique @fr
preferred label: Freestyle Ski @de
preferred label: esquí estilo libre @es
preferred label: フリースタイルスキー @ja-jp
preferred label: freestyle Skiing @en-gb
definition: I concorrenti eseguono una serie di salti acrobatici da una rampa preparata combinando destrezza, salti e balletto
definition: モーグル、ジャンプ、およびスキーバレエを織り交ぜながらジャンプ台から一連の息をのむような離れ業の跳躍を競う競技 @ja-jp
definition: Wettkämpfer zeigen eine Reihe von atemberaubenden akrobatischen Sätzen mit vorbereiteten Sprüngen. Kombiniert mit Trickski, Schanzenspringen und Skiballett. @de
definition: *Os esquiadores realizam uma série de figuras acrobáticas após saltar de uma rampa. Mistura de **moguls** (bossas ou lombas na pista), saltos e balé em esqui.* @pt-pt
definition: Le skieur acrobatique effectue des figures en l'air à partir d'un tremplin de neige. C'est un mélange de descente de bosses, de sauts et de ballet à skis. @fr
definition: Competitors perform a series of breathtaking acrobatic leaps from a prepared jump. Combined with moguls, jumps and ski ballet. @en-gb
definition: Disciplina en la que los competidores realizan una serie de vueltas acrobáticas tras lanzarse desde una rampa, combinando destreza, saltos y ballet en esquí. @es
note: nessuno
in scheme: Subject Code
created: 2000-10-30T12:00:00+00:00
modified: 2010-12-15T17:01:09+00:00
broader: Sport
narrower: Gobbe
narrower: Aereo
narrower: Sci artistico

Golf
type: Concept
preferred label: ゴルフ @ja-jp
preferred label: golf @es
preferred label: golfe @pt-br
definition: jeu consistant à placer une balle avec un club dans une série de trous répartis le long d'un parcours, et ce, en moins de coups possible @fr
definition: I concorrenti tentano di colpire una piccola palla bianca con mazze di differente tipo lungo un percorso di 18 buche di varia distanza. L'obiettivo è fare meno tiri possibile
definition: Jogo em que os participantes batem uma pequena bola branca com diferentes tacos ao longo de um campo de 18 buracos, que variam em distância. O objetivo é fazer a bola entrar nos buracos com o menor número possível de tacadas. @pt-br
definition: 種類の異なるクラブを使って小さい白いボールを打ちながら、距離の異なる18のコースをまわる競技で、最も少ない打数でまわることが目的 @ja-jp
definition: Competitors attempt to hit a small white ball with different clubs around a course of 18 holes varying in distance. The object is to make the fewest strokes possible. @en-gb
definition: Wettkämpfer versuchen einen kleinen weißen Ball mit verschiedenen Schlägern in einem Gelände mit 18 Löchern auf verschiedenen Distanzen einzulochen. Das Ziel ist die wenigsten Schläge zu benötigen. @de
definition: Los jugadores deben introducir una pequeña pelota blanca y maciza con diferentes palos en los 18 hoyos, de distancia variable, que conforman el circuito. El objetivo es completar el recorrido en la menor cantidad de golpes posible. @es
note: nessuno
in scheme: Subject Code
created: 2000-10-30T12:00:00+00:00
modified: 2010-12-15T17:01:09+00:00
broader: Sport

Ginnastica
type: Concept
preferred label: Turnen @de
preferred label: gimnasia @es
preferred label: ginástica @pt-pt
preferred label: gymnastics @en-gb
preferred label: Gymnastique artistique @fr
preferred label: 体操 @ja-jp
definition: Sport der aus verschiedenen Disziplinen besteht in denen Turner artistische und akrobatische Figuren zeigen an unterschiedlichen Geräten. Es gibt 6 Disziplinen bei den Männern und 4 bei den Frauen. @de
definition: Sport consistant en une variété d'exercices alliant la force à la souplesse au sol ou sur agrès (6 installations pour les hommes, 4 pour les femmes) @fr
definition: Esporte que consiste numa variedade de disciplinas em que os ginastas realizam movimentos artísticos e acrobáticos em diferentes aparelhos. Há 6 disciplinas para os homens e 4 para as mulheres. @pt-br
definition: Desporto que consiste numa variedade de disciplinas em que os ginastas realizam movimentos artísticos e acrobáticos em diferentes aparelhos. Há 6 disciplinas para os homens e 4 para as mulheres. @pt-pt
definition: Deporte de disciplinas variadas en el cual los gimnastas deben realizar movimientos artísticos y acrobáticos en diferentes aparatos. Son seis disciplinas para los hombres y cuatro para las mujeres. @es
definition: A sport consisting of a variety of disciplines in which gymnasts perform artistic and acrobatic moves on different apparatus. There are 6 disciplines for men and 4 for women. @en-gb
definition: 体操選手が異なる器具上で芸術的な離れ業を競い合う、さまざまなルールで構成されるスポーツ。女性4種目と男性6種目の規定競技がある @ja-jp
definition: Sport che comprende varie discipline nelle quali gli atleti eseguono movimenti artistici e acrobatici con differenti tipi di attrezzi
note: nessuno
in scheme: Subject Code
created: 2000-10-30T12:00:00+00:00
modified: 2010-12-15T17:01:09+00:00
broader: Sport
narrower: Esercizio a terra
narrower: Volteggio
narrower: Cavallo
narrower: Parallele asimmetriche
narrower: Parallele
narrower: Barra
narrower: Anelli
narrower: Trave
narrower: Ritmica
narrower: Clave
narrower: Cerchio
narrower: Nastro
narrower: Corda
narrower: Palla
narrower: Trampolino

Pallamano
type: Concept
preferred label: Handball @de
preferred label: ハンドボール @ja-jp
preferred label: balonmano @es
preferred label: andebol @pt-pt
preferred label: handebol @pt-br
preferred label: handball (team) @en-gb
definition: Deporte que enfrenta a dos equipos de siete jugadores, que intentan anotar introduciendo una pelota en el arco rival utilizando solo las manos. @es
definition: Jogo de bola de duas equipas de 7 jogadores que tentam introduzir a bola na baliza do adversário através de passes apenas com as mãos. @pt-pt
definition: A ball game using the hands contested by two teams of seven trying to throw the ball into the opponents goal. @en-gb
definition: Jeu de ballon joué à la main opposant deux équipes de sept joueurs chacune essayant de marquer le plus de buts possibles. @fr
definition: Ein Ballspiel mit den Händen, bestehend aus zwei Teams mit jeweils sieben Spielern, die versuchen den Ball in das gegnerische Tor zu werfen. @de
definition: Un gioco in cui una palla è contesa da due squadre di sette giocatori ciascuna i quali, usando le mani, cercano di lanciarla nella porta avversaria
definition: Jogo de bola de duas equipes de 7 jogadores que tentam introduzir a bola no gol do adversário através de passes apenas com as mãos. @pt-br
definition: 手を使って、7人一組の2チームが相手ゴールへボールを投げ入れあう球技 @ja-jp
note: nessuno
in scheme: Subject Code
created: 2000-10-30T12:00:00+00:00
modified: 2010-12-15T17:01:09+00:00
broader: Sport

Ippica
type: Concept
preferred label: corridas de cavalos @pt-br
preferred label: Hippisme @fr
preferred label: Pferderennen @de
preferred label: horse racing, harness racing @en-gb
preferred label: 競馬 @ja-jp
preferred label: hipismo @es
definition: Mounted horse races. @en-gb
definition: Carrera disputada por parejas integradas por caballos y jockeys (jinetes) sobre una pista de tierra. @es
definition: Pferderennen mit Reiter. @de
definition: 人が騎乗する馬レース @ja-jp
definition: Corse di cavalli montati
definition: courses de chevaux dirigés par des hommes @fr
definition: Corridas de cavalos montados. @pt-br
note: nessuno
in scheme: Subject Code
created: 2000-10-30T12:00:00+00:00
modified: 2010-12-15T17:01:09+00:00
broader: Sport
narrower: Corsa senza ostacoli
narrower: Corsa ad ostacoli
narrower: Trotto
narrower: Campestre

Hockey su ghiaccio
type: Concept
preferred label: hóquei no gelo @pt-pt
preferred label: Eishockey @de
preferred label: ice hockey @en-gb
preferred label: Hockey sur glace @fr
preferred label: hockey sobre hielo @es
preferred label: アイスホッケー @ja-jp
definition: 重防具を付けたスケーターが1チーム6人で構成された2チームに分かれ、互いに相手ゴールにパックを打ち入れ合い、その合計得点を競い合う競技 @ja-jp
definition: *Duas equipes de 6 patinadores fortemente equipados e munidos de tacos (**sticks**) com que tentam introduzir um disco no gol do adversário.* @pt-br
definition: *Duas equipas de 6 patinadores fortemente equipados e munidos de tacos (**sticks**) com que tentam introduzir um disco na baliza do adversário.* @pt-pt
definition: Dos equipos de seis patinadores sobre hielo tratan de convertirle tantos a su oponente, golpeando una ficha con un bastón para introducirla dentro del arco rival. @es
definition: Due squadre formate ciascuna di sei pattinatori su ghiaccio che con l'aiuto di mazze cercano di colpire ed inviare nella porta avversaria un puck (disco)
definition: Jeu de palet et de crosse pratiqué sur glace par 2 équipes de 6 joueurs @fr
definition: Zwei Mannschaften mit jeweils sechs stark gepolsterten Läufern versuchen sich gegenseitig auszutricksen, um den Puck in das gegnerische Tor zu schießen. @de
definition: Two teams of six heavily padded skaters try and outscore each other by hitting a puck into the opponents goal. @en-gb
note: nessuno
in scheme: Subject Code
created: 2000-10-30T12:00:00+00:00
modified: 2010-12-15T17:01:09+00:00
broader: Sport
narrower: NHL, National Hockey League
narrower: Hockey su slitta

Pelota
type: Concept
preferred label: Pelote basque @fr
preferred label: ハイアライ（ペロタ） @ja-jp
preferred label: pelota basca @pt-pt
preferred label: Jai Alai (Pelota) @en-gb
preferred label: pelota vasca @es
preferred label: Pelota/Jai Alai @de
definition: Desporto ancestral do País Basco em que dois ou quatro participantes batem alternadamente uma bola contra uma parede frontal com uma espécie de pá. @pt-pt
definition: sport ancestral du Pays Basque qui consiste à faire rebondir une balle contre un fronton (mur) @fr
definition: Deporte ancestral del País Vasco que consiste en hacer golpear con una paleta y hacer rebotar una bola contra un muro, similar al frontón. @es
definition: Die Komplexität des Spiels erfordert es zwei SubjectDetails zu kombinieren, um eine angemessene Identifizierung der speziellen Varianten zu ermöglichen. @de
definition: Because of the game organization, the proper identification of a specific game may require the combination of 2 subject details @en-gb
definition: Antico sport dei Paesi Baschi che consiste nel far rimbalzare una palla contro un fronton-muro. Ha numerose varianti, di seguito elencate
definition: ゲーム編成の理由により、特定のゲームの本来の識別では、2つのsubject detailsの組み合わせを必要とするかもしれない @ja-jp
note: nessuno
in scheme: Subject Code
created: 2000-10-30T12:00:00+00:00
modified: 2010-12-15T17:01:09+00:00
broader: Sport
narrower: Fronton (muro)
narrower: Jai alai
narrower: Fronton a sinistra
narrower: Trinquet
narrower: Rebot
narrower: Chistera ancha
narrower: chistera corta
narrower: Mani nude
narrower: Pala ancha
narrower: Pala corta
narrower: Pasaka
narrower: Xare

Judo
type: Concept
preferred label: 柔道 @ja-jp
preferred label: judô @pt-br
preferred label: judo @es
definition: Arte marcial utilizado como deporte o defensa propia, que consiste en tomar y lanzar al oponente con *llaves*. @es
definition: sport de combat basé sur l'art de la souplesse pour en faire une discipline de défense @fr
definition: Arte marziale di difesa
definition: Arte marcial defensiva. @pt-br
definition: A defensive martial art. @en-gb
definition: Eine verteidigende Kampfortart. @de
definition: 護身的な武術 @ja-jp
note: nessuno
in scheme: Subject Code
created: 2000-10-30T12:00:00+00:00
modified: 2010-12-15T17:01:09+00:00
broader: Sport
narrower: Massimi
narrower: Mediomassimi
narrower: Medi
narrower: Medi mediani
narrower: Medioleggeri
narrower: Peso leggero
narrower: Extraleggeri

Karate
type: Concept
preferred label: karate @es
preferred label: caratê @pt-br
preferred label: 空手 @ja-jp
preferred label: Karaté @fr
preferred label: caraté @pt-pt
definition: Arte marziale in cui colpi, pugni, calci e spinte sono usati per sconfiggere un avversario
definition: 相手を打ち負かすために手刀、突き、蹴りや投げを用いる武術 @ja-jp
definition: Arte marcial que usa golpes de mãos e pés para derrubar o adversário. @pt-br
definition: A martial art where chops, punches, kicks and throws are used to defeat an opponent. @en-gb
definition: sport de combat et d'autodéfense où deux combattants s'affrontent sans porter les coups à l'aide de leurs mains (le tranchant), leurs pieds (coup de pied sauté ou circulaires) et leurs poings @fr
definition: Arte marcial japonés, deporte de combate y defensa personal con diferentes escuelas, en el que se utilizan las manos (en forma de corte y puñetazos) y las piernas (patadas circulares o rectas, bajas o altas y con saltos) para derrotar al oponente. @es
definition: Eine Kampfsportart bei der Hiebe, Schläge, Tritte und Würfe genutzt werden um einen Angreifer abzuwehren. @de
note: nessuno
in scheme: Subject Code
created: 2000-10-30T12:00:00+00:00
modified: 2010-12-15T17:01:09+00:00
broader: Sport
narrower: Sparring Boxe
narrower: Esercizio Formale - ANNULLATO

lacrosse
type: Concept
preferred label: Lacrosse
preferred label: ラクロス @ja-jp
definition: sport joué par deux équipes qui doivent se marquer des buts en se disputant une balle avec un bâton terminé par un panier triangulaire souple @fr
definition: Zwei Teams mit gepolsterten Spielern mit Helmen versuchen sich gegenseitig zu besiegen mit einem Schläger und einem harten Ball. @de
definition: Dos equipos de jinetes, munidos de cascos, tratan de vencer al oponente utilizando un bastón con red y una pelota dura. @es
definition: Sport di squadra praticato essenzialmente in Nord America e in Australia, che consiste nel far punto in una porta con una palla passata da atleta ad atleta tramite una specie di racchetta. Ogni squadra è composta da 10 giocatori; la porta è simile a quella dell'hockey su ghiaccio: alta 1,8 m e larga 1,8 m
definition: Two teams of helmeted and padded players try and outscore each other using a netted stick and hard ball. @en-gb
definition: Jogo disputado por 2 equipes de jogadores devidamente protegidos que usam um taco longo e com rede na ponta para apanhar ou arremessar uma bola dura. @pt-br
definition: ヘルメットや防具を付けたプレーヤーが、2チームで網を張ったスティックを使用し、互いに得点し合う @ja-jp
definition: Jogo disputado por 2 equipas de jogadores devidamente protegidos que usam um taco longo e com rede na ponta para apanhar ou arremessar uma bola dura. @pt-pt
note: nessuno
in scheme: Subject Code
created: 2000-10-30T12:00:00+00:00
modified: 2010-12-15T17:01:09+00:00
broader: Sport

Slittino
type: Concept
preferred label: リュージュ @ja-jp
preferred label: Rodeln @de
preferred label: Luge @fr
preferred label: luge @pt-pt
preferred label: luge (trineo) @es
definition: El Luge (palabra francesa que significa pequeño trineo) se juega en singles o dobles. Los competidores van acostados de espalda en un trineo abierto para carreras a lo largo de una pista nevada, descendiendo a alta velocidad. @es
definition: Competição individual ou de duplas em que os atletas, deitados de costas em trenó aberto, percorrem a grande velocidade uma descida coberta de gelo. @pt-br
definition: Discesa lungo un percorso su di una pista ghiacciata distesi sulla schiena a bordo di uno slittino aperto
definition: Luge (French word for sled) is competed in singles or doubles. The competitor(s) lay on their back(s) on an open sled and race down a course. The competitor(s) and the sled must be in contact when passing the finishing line. @en-gb
definition: Descendre le plus vite possible une piste glacée dans une luge, allongé sur le dos @fr
definition: Competição individual ou em pares em que os atletas, deitados de costas em trenó aberto, percorrem a grande velocidade uma descida coberta de gelo. @pt-pt
definition: リュージュ(フランス語のそり)は1人乗りまたは2人乗りで競技する。競技者はオープンなそりに仰向きに寝て、コースを下って競技をする。フィニッシュ･ラインを通る時、競技者とそりとは密着していなければならない @ja-jp
definition: Wird als Einsitzer oder Doppelsitzer ausgetragen. Der Athlet liegt auf dem Rücken auf einem offenen Rennschlitten und gleitet in einer Kunst- oder Natureisbahn hinab. Der Athlet und der Rennschlitten müssen gemeinsam die Ziellinie passieren. @de
note: Explanation shortened @en-gb
note: nessuno
in scheme: Subject Code
created: 2000-10-30T12:00:00+00:00
modified: 2010-12-15T17:01:09+00:00
broader: Sport
narrower: Individuale
narrower: Doppio

Maratona
type: Concept
preferred label: マラソン @ja-jp
preferred label: maratona @pt-br
preferred label: Marathon @de
preferred label: marathon @en-gb
preferred label: maratón @es
definition: A road race where competitors run 42.195km, generally through city streets @en-gb
definition: épreuve de course à pied d'endurance de 42,195 km @fr
definition: 競争者が一般に都市の通りを通って42.195kmを走るロードレース @ja-jp
definition: Corrida de estrada em que os atletas correm 42.195 km. @pt-pt
definition: Straßenrennen, bei dem die Wettkämpfer 42,195 km laufen, meist durch die Stadt. @de
definition: Corsa su strada in cui i concorrenti corrono per 42,195 km, generalmente attraverso le strade di città
definition: Carrera de fondo en la que los atletas corren una distancia de 42,195 Km. @es
note: nessuno
in scheme: Subject Code
created: 2000-10-30T12:00:00+00:00
modified: 2010-12-15T17:01:09+00:00
broader: Sport

Pentathlon moderno
type: Concept
preferred label: modern pentathlon @en-gb
preferred label: Moderner Fünfkampf @de
preferred label: pentatlo moderno @pt-pt
preferred label: pentatlón moderno @es
preferred label: Pentathlon moderne @fr
preferred label: 近代五種 @ja-jp
definition: El Pentatlón Moderno consiste en una combinación de 5 deportes diferentes : equitación, esgrima, natación, tiro y carrera. Los competidores lo disputan en una sola jornada. @es
definition: O pentatlo moderno inclui 5 provas diferentes realizadas no mesmo dia pela seguinte ordem: tiro, esgrima, natação, hipismo e corrida. @pt-br
definition: 近代五種競技は、1日の間に次の順で実行される5つの競技から構成される:射撃、フェンシング、水泳、馬術およびランニング @ja-jp
definition: The Modern Pentathlon comprises five events run over a single day in the following order: shooting, fencing, swimming, horse riding and running. @en-gb
definition: Der moderne Fünfkampf umfasst 5 Ereignisse an einem Tag in der folgenden Reihenfolge: Schießen, Fechten, Schwimmen, Reiten und Laufen. @de
definition: Le pentathlon est une combinaison de 5 sports différents : équitation, escrime, natation, tir et course. Les concurrents s'affrontent sur une seule journée @fr
definition: Comprende 5 gare in un solo giorno nel seguente ordine: tiro al bersaglio, scherma, nuoto, corsa con cavallo e corsa
note: DEPRECATED in V 16 @fr
note: nessuno
in scheme: Subject Code
created: 2000-10-30T12:00:00+00:00
modified: 2010-12-15T17:01:09+00:00
broader: Sport
narrower: Corsa
narrower: Tiro a segno
narrower: Nuoto
narrower: Scherma
narrower: Salto ad ostacoli

Automobilismo
type: Concept
preferred label: 自動車レース @ja-jp
preferred label: motor racing @en-gb
preferred label: desportos motorizados @pt-pt
preferred label: Automobilsport @de
preferred label: Automobile @fr
preferred label: automobilismo @es
preferred label: esportes a motor @pt-br
definition: Autorennen, bei dem Geschwindigkeit und zuverlässige Mechanik gewertet werden. @de
definition: sport mécanique et de vitesse opposant des véhicules à moteur @fr
definition: Carreras de vehículos a motor, donde la velocidad y confiabilidad de la mecánica constituyen la clave de la confrontación @es
definition: Motor racing where speed and trusty mechanics are key @en-gb
definition: Corse automobilistiche di varo tipo
definition: スピードと信頼できる整備士が鍵となるモーター・レース @ja-jp
definition: Corridas de veículos motorizados em que a velocidade e a confiança mecânica são fundamentais. @pt-pt
note: nessuno
in scheme: Subject Code
created: 2000-10-30T12:00:00+00:00
modified: 2010-12-15T17:01:09+00:00
broader: Sport
narrower: F1
narrower: F3000
narrower: Endurance
narrower: Indy
narrower: CART
narrower: NHRA
narrower: NASCAR
narrower: TRUCKI

Campionato Rally
type: Concept
preferred label: 自動車ラリー @ja-jp
preferred label: ralis @pt-br
preferred label: Rallyes @fr
preferred label: motor rallying @en-gb
preferred label: rally @es
preferred label: Motorrallye @de
definition: 未舗装路や、雪など特殊な状況を含む一般道路に設定した専用コースを、正・副ドライバー2人が改造車に乗って行う耐久レースのシーズン戦 @ja-jp
definition: Corridas de enduro por temporadas, disputadas em circuitos delimitados que incluem caminhos de terra e estradas, usando carros especialmente adaptados com piloto e copiloto. @pt-pt
definition: course à étape alliant des intinéraires de liaison où les concurrents sont tenus de respecter les lois en vigueur et des spéciales sur parcours fermé à la circulation @fr
definition: Serie di prove automobilistiche su vetture con pilota e navigatore su circuiti che includono piste e strade battute di vario tipo
definition: A season of endurance races over closed circuits including dirt tracks, roads and even snowy conditions featuring specials using adapted road cars with a driver and co-pilot. @en-gb
definition: Carreras de resistencia por temporadas, disputadas sobre circuitos cerrados que incluyen caminos de tierra y carreteras, en las que figuran tramos con reglas especiales, usando autos adaptados con un conductor y un co-piloto. @es
definition: Eine Saison von Ausdauerrennen über verschiedene Runden mit schmutzigen Straßen, Straßen- und Schneeverhältnissen, die spezielle Fahrzeuge mit einem Fahrer und einem Beifahrer benötigen. @de
note: nessuno
in scheme: Subject Code
created: 2000-10-30T12:00:00+00:00
modified: 2010-12-15T17:01:09+00:00
broader: Sport
narrower: Rally
narrower: Inseguimento
narrower: Rallycross

Motociclismo
type: Concept
preferred label: Motorradrennen @de
preferred label: motociclismo @pt-pt
preferred label: Moto @fr
preferred label: motorcycling @en-gb
preferred label: オートバイレース @ja-jp
definition: Races with 2, 3 or 4 wheels vehicles with a saddle and handlebars @en-gb
definition: Gare su motoveicoli forniti di sellino e manubri
definition: Corridas com veículos de 2, 3 ou 4 rodas com selim e guiador. @pt-pt
definition: サドルおよびハンドルを備えた2輪、3輪あるいは4輪の乗り物によるレース @ja-jp
definition: Carrera con vehículos de 2, 3 o 4 ruedas con sillín y manillar. @es
definition: Corridas com veículos de 2, 3 ou 4 rodas com selim e guidão. @pt-br
definition: Course de véhicules à moteur avec 2, 3 ou 4 roues et sur lesquels le conducteur s'installe à califourchon et se dirige à l'aide d'un guidon. @fr
definition: Rennen mit 2,3 oder 4 rädrigen Fahrzeugen mit Sattel und Lenkstangen. @de
note: nessuno
in scheme: Subject Code
created: 2000-10-30T12:00:00+00:00
modified: 2010-12-15T17:01:09+00:00
broader: Sport
narrower: Gran Premio
narrower: Enduro
narrower: Pista erbosa
narrower: Motopalla
narrower: motocross
narrower: Rallying
narrower: trial
narrower: Endurance
narrower: Superbike
narrower: 125
narrower: 250
narrower: 500
narrower: Sidecar
narrower: Moto GP

Netball
type: Concept
preferred label: netbol @es
preferred label: ネットボール @ja-jp
preferred label: Netzball @de
preferred label: netball @en-gb
definition: Desporto feminino, semelhante ao basquetebol, mas sem a tabela que segura o cesto. @pt-pt
definition: A woman's sport similar to basketball without a board behind the basket @en-gb
definition: Uno sport femminile simile alla pallacanestro ma senza tabellone dietro al cesto
definition: バスケットの後ろの板を外したバスケットボールのような女性向けスポーツ @ja-jp
definition: Sport féminin similaire au basket-ball, mais sans planche pour soutenir le panier @fr
definition: Deporte de mujeres similar al baloncesto, aunque sin tablero detrás del cesto. @es
definition: Sportart für Frauen, ähnlich dem Basketball, aber ohne Brett hinter dem Korb. @de
definition: Esporte feminino, semelhante ao basquetebol, mas sem a tabela que segura o cesto. @pt-br
note: typo fixed in Explanation @en-gb
note: nessuno
in scheme: Subject Code
created: 2000-10-30T12:00:00+00:00
modified: 2010-12-15T17:01:09+00:00
broader: Sport

Sci nordico
type: Concept
preferred label: esqui nórdico @pt-br
preferred label: nordic skiing @en-gb
preferred label: ノルディックスキー @ja-jp
preferred label: Ski nordique @fr
preferred label: esquí nórdico @es
preferred label: Ski nordisch @de
definition: Findet im schneebedeckten Gelände statt und basiert auf Kraft und Ausdauer. Es gibt klassische und Freistil Wettkämpfe mit Massenstart oder gestaffeltem Start. @de
definition: Modalidade de esqui praticada na natureza e baseado na força e na resistência. Há eventos clássicos e de estilo livre, com largada coletiva ou individual. @pt-pt
definition: Practiced in snowy countryside and based on power and endurance. There are classic and free style events with mass or staggered starts. @en-gb
definition: Discipline pratiquée en pleine nature qui repose sur l'endurance et la puissance du mouvement. Elle se pratique soit en style classique soit en style libre, avec départ en ligne ou échelonné et contre-la-montre selon les épreuves @fr
definition: Praticato in campi innevati si basa sulla potenza e la resistenza. Esistono gare con stile classico e con stile libero, con la partenza in massa o a scaglioni
definition: Deporte de esquí practicado en campos nevados y basado en el poder y la resistencia. Hay eventos clásicos o de estilo libre con largada colectiva o individual. @es
definition: 雪の降る地方で行われ、体力と持久力がベースとなる。一斉スタート方式、またはスタートをずらす方式があり、クラシカルとフリースタイルの種目がある @ja-jp
note: nessuno
in scheme: Subject Code
created: 2000-10-30T12:00:00+00:00
modified: 2010-12-15T17:01:09+00:00
broader: Sport
narrower: Sci di fondo
narrower: 5 km tecnica classica
narrower: 10 km tecnica classica
narrower: 10 km inseguimento in stile libero
narrower: 15 km tecnica classica
narrower: 15 km inseguimento in stile libero
narrower: 10 km + 15 km combinata
narrower: 30 km tecnica classica
narrower: 30 km stile libero
narrower: 50 km stile libero
narrower: Staffetta 4 x 5 km
narrower: Staffetta 4 x 10 km
narrower: Combinata nordica
narrower: Raid
narrower: 5 km inseguimento in stile libero
narrower: 1,5 km sprint
narrower: 50 km stile classico

Orientamento
type: Concept
preferred label: Course d'orientation @fr
preferred label: orienteering @en-gb
preferred label: carrera de orientación @es
preferred label: Orientierung @de
preferred label: orientação @pt-pt
preferred label: オリエンテーリング @ja-jp
definition: Corrida individual contrarrelógio em percurso assinalado por marcas. O atleta, que prossegue com a ajuda de bússola e mapa, tem que procurar e encontrar as marcas segundo determinada ordem. @pt-pt
definition: Einzelzeitrennen über eine mit Fackeln markierte Strecke, die der Wettkämpfer mithilfe von Kompass und Karte in einer bestimmten Reihenfolge finden muss. @de
definition: 標識で印を付けたルートを回る個人のタイムトライアル。競技者は標識を特定の順序で探索する必要がある。競技者はコンパスと地図の助けを借りて前進する @ja-jp
definition: Prueba individual por tiempo en una ruta marcada por balizas. El competidor tiene que buscar y encontrar las marcas en un orden específico, con la ayuda de una brújula y un mapa. @es
definition: Corrida individual contra o relógio em percurso assinalado por marcas. O atleta, que prossegue com a ajuda de bússola e mapa, tem que procurar e encontrar as marcas segundo determinada ordem. @pt-br
definition: Gara individuale a tempo su un itinerario segnato da segnali che gli sciatori devono cercare e trovare in un ordine determinato con l'aiuto di una bussola e una mappa
definition: An individual time-trial over a route marked out by beacons. The competitor has to search out and find in a specific order. The contestant makes his way with the help of a compass and map @en-gb
definition: Course individuelle contre la montre sur un parcours matérialisé par des balises que le concurrent doit découvrir dans un ordre imposé. Le coureur définit son chemin à l'aide d'une boussole et d'une carte. @fr
note: nessuno
in scheme: Subject Code
created: 2000-10-30T12:00:00+00:00
modified: 2010-12-15T17:01:09+00:00
broader: Sport
narrower: Sci Orientamento

polo
type: Concept
preferred label: Polo
preferred label: ポロ @ja-jp
definition: With the aid of a mallet two teams of four horsemen try and knock a bamboo ball into the opponents goal over a pitch 250m long and 150m wide. The game is divided into 4, 6, or 8 time periods of 7min 30sec called chukkas. @en-gb
definition: Con l'aiuto di un martello di legno due squadre, composta ciascuna da quattro fantini, cercano e colpiscono una palla di bambù verso la porta avversaria in un campo lungo 250 m e largo 150 m. Il gioco è diviso in 4, 6, o 8 tempi, chiamati chukkas, di 7 minuti e 30 secondi
definition: 木づちを使って、4人の騎手からなる2チームが縦250m、横150mのピッチ上で、相手ゴールに竹ボールを打ち込もうとする。試合は7分30秒の、チョーカーと呼ばれる4つ、6つ、あるいは8つのピリオドに分割される @ja-jp
definition: Con la ayuda de un mazo con bastón, dos equipos de cuatro hombres a caballo, tratan de introducir una pelota de bambú dentro del arco rival, en una cancha de 250m de largo y 150m de ancho. El juego está dividido en tiempos de 7,30 minutos. @es
definition: A l'aide d'un maillet, deux équipes de 4 cavaliers tentent de lancer dans les buts adverses une balle en racine de bambou sur un terrain de 250 m de long sur 150 de large. Une partie est divisée en 4, 6 ou 8 * chukkas *, périodes de 7 mn et 30 s. @fr
definition: *Com ajuda de um taco, duas equipas de 4 cavaleiros tentam introduzir uma bola de bambu na baliza adversária, num campo de 250m de comprimento e 150m de largura. O jogo é divido em 4, 6 ou 8 períodos de 7min e 30s chamados **chukkas**.* @pt-pt
definition: Mithilfe eines Schlägers versuchen zwei Teams mit je vier Reitern einen Bambusball in das gegnerische Tor zu schießen über ein Feld von 250 m Länge und 150 m Breite. Das Spiel ist unterteilt in 4,6 oder 8 Zeitperioden von 7 min 30 sec. *chukkas* genannt. @de
definition: *Com ajuda de um taco, duas equipes de 4 cavaleiros tentam introduzir uma bola de bambu no gol adversário, em campo de 250m de comprimento e 150m de largura. O jogo é divido em 4, 6 ou 8 períodos de 7min e 30s chamados **chukkas**.* @pt-br
note: nessuno
in scheme: Subject Code
created: 2000-10-30T12:00:00+00:00
modified: 2010-12-15T17:01:09+00:00
broader: Sport

Motonautica
type: Concept
preferred label: motonáutica @es
preferred label: モーターボート @ja-jp
preferred label: Motorbootsport @de
preferred label: Motonautisme @fr
preferred label: power boating @en-gb
definition: Les courses entre les embarcations motorisées en mer, sur rivière ou sur lac. @fr
definition: Rennen zwischen Motorbooten auf Flüssen oder Seen. @de
definition: Corridas de barcos a motor em rios ou lagos. @pt-br
definition: 川や湖でのモーターボートレース @ja-jp
definition: Carreras entre motos de agua en el mar, ríos o lagos. @es
definition: Gara tra barche a motore
definition: Races between motor boats on rivers or lakes @en-gb
note: nessuno
in scheme: Subject Code
created: 2000-10-30T12:00:00+00:00
modified: 2010-12-15T17:01:09+00:00
broader: Sport
narrower: F1
narrower: F2

Canottaggio
type: Concept
preferred label: ボート @ja-jp
preferred label: remo @pt-br
preferred label: Aviron @fr
preferred label: Rudern @de
preferred label: rowing @en-gb
definition: sport de glisse qui se déroule sur un plan d'eau, de préférence sans vent et sans courant dans des embarcations de 1, 2, 4 ou 8 rameurs. @fr
definition: Carrera de botes, usualmente en aguas tranquilas y calmas, con embarcaciones de 1, 2, 4 u 8 remeros. @es
definition: Corrida de barcos em águas calmas com embarcações de 1, 2, 4 ou 8 remadores. @pt-pt
definition: Gara su fiumi o laghi con barche per 1, 2, 4, o 8 rematori
definition: Bootsrennen meist in flachen ruhigen Gewässern mit Booten für 1,2,4,oder 8 Ruderern. @de
definition: Boat racing usually on flat calm waters with boats for 1, 2, 4 or 8 rowers @en-gb
definition: 通常は平たんで静かな水面で、1人、2人、4人、または8人のこぎ手によるボートレース @ja-jp
note: nessuno
in scheme: Subject Code
created: 2000-10-30T12:00:00+00:00
modified: 2010-12-15T17:01:09+00:00
broader: Sport
narrower: Singolo
narrower: Doppio
narrower: Quattro di coppia
narrower: Due senza
narrower: Quattro senza
narrower: Otto
narrower: Peso leggero

Lega del rugby
type: Concept
preferred label: １３人制ラグビー @ja-jp
preferred label: Rugbyliga @de
preferred label: Jeu à XIII @fr
preferred label: liga de rugby (rugby 13) @es
preferred label: rugby league @en-gb
preferred label: râguebi de 13 @pt-pt
preferred label: rúgbi de 13 @pt-br
definition: Jogo de bola em campo relvado opondo duas equipas de 13 jogadores, que tentam marcar ensaios e penalidades correndo e passando uma bola oval com as mãos e os pés. @pt-pt
definition: Two teams of 13 compete on a pitch where they score tries and penalties by running with and passing an oval ball to be touched down behind the goal line or kicked between goal posts in a tough physical contest @en-gb
definition: Deux équipes de 13 joueurs essaient de marquer le plus d'essais et de pénalités possibles en portant, passant ou bottant un ballon ovale. @fr
definition: 13人からなる2つのチームがピッチで競い、選手は楕円形のボールをパスしながら走り、ゴールラインの後ろでタッチダウンするか、相手のペナルティで得点するか、またはボールをキックしてゴールポストの間を通過させることで得点する、屈強な肉体競技 @ja-jp
definition: Zwei Teams mit je 13 Spielern kämpfen um Punktabstand, indem sie Versuche und Strafpunkte bekommen durch Rennen und werfen eines ovalen Balles, der hinter der Torlinie den Boden berühren muss oder zwischen zwei Torpfosten geschossen wird in einem harten körperlichen Wettkampf. @de
definition: Due squadre, composta ciascuna da 13 concorrenti, competono su un campo dove segnano punti e penalità correndo con una palla ovale che si passano e devono farla toccare a terra nell'area di meta avversaria o calciata tra i pali della porta
definition: Jogo de bola em campo gramado opondo duas equipes de 13 jogadores, que tentam marcar ensaios e penalidades correndo e passando uma bola oval com as mãos e os pés. @pt-br
definition: Dos equipos de 13 jugadores compiten en una cancha de césped durante dos tiempos, anotando tries, conversiones y penales, corriendo y pasándose un balón ovalado, que debe ser apoyado detrás de la línea de anotación, o pateado entre los postes. @es
note: nessuno
in scheme: Subject Code
created: 2000-10-30T12:00:00+00:00
modified: 2010-12-15T17:01:09+00:00
broader: Sport

Union rugby
type: Concept
preferred label: rugby union @en-gb
preferred label: rúgbi @pt-br
preferred label: Rugby Union @de
preferred label: râguebi @pt-pt
preferred label: unión de rugby (rugby 15) @es
preferred label: ラグビー @ja-jp
preferred label: Rugby à XV @fr
definition: Two teams of 15 compete on a pitch where they score tries and penalties by running with and passing an oval ball to be touched down behind the goal line or kicked between goal posts in a tough physical contest @en-gb
definition: Dos equipos de 15 jugadores compiten en una cancha de césped durante dos tiempos, anotando tries, conversiones y penales, corriendo y pasándose un balón ovalado, que debe ser apoyado detrás de la línea de anotación, o pateado entre los postes. @es
definition: Zwei Teams mit je 15 Spielern kämpfen um Punktabstand, indem sie Versuche und Strafpunkte bekommen durch Rennen und werfen eines ovalen Balles, der hinter der Torlinie den Boden berühren muss oder zwischen zwei Torpfosten geschossen wird in einem harten körperlichen Wettkampf. @de
definition: Jogo de bola em campo gramado opondo duas equipes de 15 jogadores, que tentam marcar ensaios e penalidades correndo e passando uma bola oval com as mãos e os pés. @pt-br
definition: Due squadre, composta ciascuna da 15 giocatori, competono su un campo dove segnano punti e penalità correndo con una palla ovale che si passano e devono farla toccare a terra nell'area di meta avversaria o calciata tra i pali della porta
definition: Jogo de bola em campo relvado opondo duas equipas de 15 jogadores, que tentam marcar ensaios e penalidades correndo e passando uma bola oval com as mãos e os pés. @pt-pt
definition: Deux équipes de 15 joueurs essaient de marquer le plus d'essais et de pénalités possibles en portant, passant ou bottant un ballon ovale. @fr
definition: 15人からなる2つのチームがピッチで競い、選手は楕円形のボールをパスしながら走り、ゴールラインの後ろでタッチダウンするか、相手のペナルティで得点するか、またはボールをキックしてゴールポストの間を通過させることで得点する、屈強な肉体競技 @ja-jp
note: nessuno
in scheme: Subject Code
created: 2000-10-30T12:00:00+00:00
modified: 2010-12-15T17:01:09+00:00
broader: Sport
narrower: Rugby 7

Vela
type: Concept
preferred label: vela @pt-br
preferred label: ヨット @ja-jp
preferred label: Voile @fr
preferred label: sailing @en-gb
preferred label: Segeln @de
definition: Corrida de barcos a vela em percurso assinalado com boias. @pt-br
definition: Corrida de barcos à vela em percurso assinalado com boias. @pt-pt
definition: Segelboot Rennen auf einer Rute die durch Bojen gekennzeichnet ist. @de
definition: ブイでマークされたルートを廻る帆船競技 @ja-jp
definition: Carrera de barcos de vela, sobre una ruta marcada por boyas. @es
definition: Regate di barche a vela lungo un percorso segnato da boe
definition: Sail boat racing over a route marked by buoys. @en-gb
definition: compétitition consistant à parcourir une distance donnée dans un minimum de temps avec un voilier @fr
note: nessuno
note: typo fixed in Explanation @en-gb
in scheme: Subject Code
created: 2000-10-30T12:00:00+00:00
modified: 2010-12-15T17:01:09+00:00
broader: Sport
narrower: Tornado
narrower: ソリング級
narrower: 49 er
narrower: Europa
narrower: Laser
narrower: 470
narrower: フィン級
narrower: Star
narrower: Flying dutchmann
narrower: 505
narrower: Gara a tappe
narrower: Intorno al mondo
narrower: Monoscafo
narrower: Multiscafo
narrower: Yngling
narrower: Mistral

Tiro a segno
type: Concept
preferred label: Tir @fr
preferred label: tiro @pt-br
preferred label: Schießen @de
preferred label: shooting @en-gb
preferred label: 射撃 @ja-jp
definition: Desporto de precisão usando revólver, carabina ou espingarda. @pt-pt
definition: Precision sport using a hand gun, rifle or shotgun @en-gb
definition: Präzisionssport unter Benutzung einer Handfeuerwaffe, Gewehr oder Pistole. @de
definition: Deporte de precisión, usando un revólver, rifle o escopeta. @es
definition: Sport di precisione in cui si usano fucile, carabina e pistole
definition: 手銃、ライフル銃または猟銃を用い正確さを競うスポーツ @ja-jp
definition: Sport de précision utilisant une arme de poing ou d'épaule @fr
definition: Esporte de precisão usando revólver, carabina ou espingarda. @pt-br
note: nessuno
in scheme: Subject Code
created: 2000-10-30T12:00:00+00:00
modified: 2010-12-15T17:01:09+00:00
broader: Sport
narrower: 10 m carabina ad aria
narrower: 10 m pistola ad aria
narrower: 10 m bersaglio mobile
narrower: Pistola automatica
narrower: 25 m pistola sportiva
narrower: 50 m Pistola libera
narrower: 50 m carabina libera a terra
narrower: 50 m carabina libera 3 x 40
narrower: 50 m carabina sportiva 3 x 20
narrower: Fossa olimpica
narrower: Tiro a 2 piattelli
narrower: skeet

Salto con gli sci
type: Concept
preferred label: saltos de esqui @pt-br
preferred label: salto con esquí @es
preferred label: スキージャンプ @ja-jp
preferred label: Saut à skis @fr
preferred label: ski jumping @en-gb
preferred label: Skispringen @de
definition: Os esquiadores ganham velocidade descendo uma rampa coberta de neve e saltam o mais longe possível, sendo avaliados pela distância coberta, pelo estilo de voo e pela qualidade da receção. @pt-pt
definition: Competidores descienden sobre esquíes, desde una elevada rampa cubierta de nieve y tratan de llegar lo más lejos posible, recibiendo marcas por distancia, estilo de vuelo y aterrizaje. @es
definition: I concorrenti scendono lungo la rampa di un trampolino coperta di neve cercando di atterrare il più lontano possibile, ricevendo dei punti per la distanza, lo stile nel volo e nell'atterraggio
definition: 雪で覆われたジャンプ台を競技者がスキーで滑り降り、できるだけ遠い距離をジャンプして、飛距離と飛型点を競う競技 @ja-jp
definition: Descendre à skis un tremplin couvert de neige, parcourir dans les airs la plus longue distance possible. Les concurrents sont notés sur la distance parcourue, le style du saut et la qualité de la réception @fr
definition: Os esquiadores ganham velocidade descendo uma rampa coberta de neve e saltam o mais longe possível, sendo avaliados pela distância coberta, pelo estilo de voo e pela qualidade da recepção. @pt-br
definition: Competitors descend a snow covered elevated ramp on skis and try to fly off it as far as possible, receiving marks for distance, style of flight and landing @en-gb
definition: Wettkämpfer gleiten auf Skiern eine schneebedeckte Rampe herunter und versuchen so weit wie möglich zu fliegen. Bewertet wird die Distanz, der Flugstil und die Landung @de
note: nessuno
note: typo fixed in Explanation @en-gb
in scheme: Subject Code
created: 2000-10-30T12:00:00+00:00
modified: 2010-12-15T17:01:09+00:00
broader: Sport
narrower: K 90 salto
narrower: K 120 salto
narrower: K 180

Snowboard
type: Concept
preferred label: Surf des neiges @fr
preferred label: スノーボード @ja-jp
preferred label: snow boarding @en-gb
preferred label: snowboard @pt-br
preferred label: tabla de nieve (snowboard) @es
preferred label: Snowboarden @de
definition: Deporte similar al surf o skate, descenso en la nieve practicado en una tabla individual, en vez de dos esquíes. @es
definition: Tavola singola cui sono assicurati i piedi per gare di discesa e di stile sulla neve
definition: Ausgeübt auf einem Brett (anstatt zwei Ski). @de
definition: Esporte que consiste em manter o equilíbrio em cima de uma prancha que desliza por uma descida coberta de neve. @pt-br
definition: 2枚のスキー板でなく1枚の板で雪上を滑走する競技 @ja-jp
definition: sport de glisse pratiqué avec une planche sur des pistes enneigées @fr
definition: Practiced with a single board (rather than two skis) @en-gb
definition: Desporto que consiste em manter o equilíbrio em cima de uma prancha que desliza por uma descida coberta de neve. @pt-pt
note: nessuno
in scheme: Subject Code
created: 2000-10-30T12:00:00+00:00
modified: 2010-12-15T17:01:09+00:00
broader: Sport
narrower: Slalom gigante
narrower: Half-pipe

Calcio
type: Concept
preferred label: Fußball @de
preferred label: soccer @en-gb
preferred label: Football @fr
preferred label: fútbol @es
preferred label: futebol @pt-pt
preferred label: サッカー @ja-jp
definition: Jogo de bola disputado entre duas equipes de 11 jogadores que, durante 90 minutos, tentam chutar ou cabecear a bola para o gol adversário. @pt-br
definition: jeu de ballon disputé entre deux équipes de onze joueurs qui ne peuvent toucher le ballon ni avec les mains ni avec les bras (à l'exception du gardien de but). Le but du jeu est de marquer le plus de buts possible au cours de deux périodes de 45 minutes. @fr
definition: Dos equipos compuestos por once jugadores tratan de patear o cabecear la pelota dentro del arco contrario, en un partido que usualmente se desarrolla en 90 minutos y sin utilizar las manos, entre sus numerosas reglas. @es
definition: Jogo de bola disputado entre duas equipas de 11 jogadores que, durante 90 minutos, tentam chutar ou cabecear a bola para a baliza adversária. @pt-pt
definition: 11人構成の2つのチームで、90分間の対戦で足または頭でボールを操り、相手側ゴールにボールを入れられるかを競う @ja-jp
definition: Zwei Teams mit jeweils 11 Spielern versuchen den Ball in das gegenerische Tor zu schießen oder zu köpfen über eine Spieldauer von 90 Minuten. @de
definition: Two teams of eleven try to kick or head a ball into the opponents goal over a match usually of 90 minutes @en-gb
definition: Due squadre, ognuna di undici giocatori, cercano di calciare una palla nella porta avversaria in una partita che di solito dura 90 minuti
note: nessuno
in scheme: Subject Code
created: 2000-10-30T12:00:00+00:00
modified: 2010-12-15T17:01:09+00:00
broader: Sport

Softball
type: Concept
preferred label: softball @pt-br
preferred label: ソフトボール @ja-jp
preferred label: sóftbol @es
definition: 野球に似ているが、より大きな柔らかいボールと細いバットを使い、塁同士の間隔が短く、イニング数も少ない @ja-jp
definition: Similar al béisbol pero con una pelota más grande y liviana, un bate más delgado, espacios más cortos entre las bases y con menos entradas. @es
definition: Jogo semelhante ao beisebol mas com um bola maior e mais leve, um bastão mais fino, espaços mais curtos entre as bases e menos entradas. @pt-pt
definition: Ähnlich dem Baseball aber mit größeren und weicheren Bällen, dünneren Schlägern, kürzeren Lücken zwischen den Stationen und weniger Innenfelder. @de
definition: Similar to baseball but with a larger and softer ball, a thinner bat, shorter gaps between bases and less innings @en-gb
definition: Jeu similaire au baseball qui se pratique avec une balle plus grosse et moins dure, une batte plus fine et des distances de terrain plus courtes. @fr
definition: Simile al baseball ma con una palla più grossa e meno dura, una mazza più sottile, distanze inferiori tra una base e l'altra, e meno innings
note: typo fixed in Explanation @en-gb
note: nessuno
in scheme: Subject Code
created: 2000-10-30T12:00:00+00:00
modified: 2010-12-15T17:01:09+00:00
broader: Sport

Pattinaggio di velocità
type: Concept
preferred label: speed skating @en-gb
preferred label: Eisschnelllauf @de
preferred label: patinação (velocidade) @pt-br
preferred label: スピードスケート @ja-jp
preferred label: patinagem (velocidade) @pt-pt
preferred label: Patinage de vitesse @fr
preferred label: patinaje de velocidad @es
definition: Timed races competed by two skaters at a time on an oval ice track @en-gb
definition: Carrera de duración limitada donde compiten dos patinadores al mismo tiempo sobre una pista ovalada de hielo. @es
definition: Corridas disputadas por 2 patinadores em pista oval de gelo. @pt-pt
definition: 2人のスケーターが楕円形のスケートリンクで時間を競う @ja-jp
definition: Corsa a tempo su ghiaccio nella quale due concorrenti pattinano insieme su una pista ovale
definition: Zeitrennen, asugeübt von zwei Läufern zur gleichen Zeit auf einer ovalen Eisbahn. @de
definition: courses disputées par paires sur une piste de glace selon le système du contre-la-montre. @fr
note: nessuno
in scheme: Subject Code
created: 2000-10-30T12:00:00+00:00
modified: 2010-12-15T17:01:09+00:00
broader: Sport
narrower: 500 m
narrower: 1000 m
narrower: 1500 m
narrower: ３０００ｍ
narrower: 5000 m
narrower: 10000 m
narrower: Short Track
narrower: Short track 500 m
narrower: Short track 1000 m
narrower: Short track 1500 m
narrower: Short track 3000 m
narrower: Short track 3000 m staffetta
narrower: Short track 5000 m
narrower: Short track 5000 m staffetta

vía rápida
type: Concept
preferred label: speedway @en-gb
preferred label: Speedway
preferred label: patinagem de velocidade @pt-pt
preferred label: patinação de velocidade @pt-br
preferred label: スピードウエー @ja-jp
definition: 高速トラック @ja-jp
definition: Pista de velocidad @es
definition: Pista de velocidade. @pt-br
definition: Specialità motociclistica che si corre su piste ovali in terra battuta della lunghezza minima di 340 metri e massima di 420 metri (misurate a 1 metro dalla corda).
definition: piste de vitesse @fr
definition: Fast track @en-gb
definition: Schnelle Strecke @de
note: nessuno
in scheme: Subject Code
created: 2000-10-30T12:00:00+00:00
modified: 2010-12-15T17:01:09+00:00
broader: Sport

Organizzazioni sportive
type: Concept
preferred label: Sportorganisationen @de
preferred label: sports organisations @en-gb
preferred label: organizaciones deportivas @es
preferred label: Organisations sportives @fr
preferred label: organizações desportivas @pt-pt
preferred label: スポーツ組織 @ja-jp
preferred label: organizações esportivas @pt-br
definition: Organizações responsáveis por um evento desportivo. @pt-pt
definition: 特定スポーツに責任を負う組織 @ja-jp
definition: Organizações responsáveis por um evento esportivo. @pt-br
definition: Organisation responsable d'un sport en particulier @fr
definition: Organisationen, die für spezielle Sportarten verantwortlich sind. @de
definition: Organizaciones responsables para un determinado deporte @es
definition: Organizzazioni responsabili di uno sport specifico
definition: Organisations responsible for a specific sport @en-gb
note: nessuno
note: typo fixed in Explanation @en-gb
in scheme: Subject Code
created: 2000-10-30T12:00:00+00:00
modified: 2010-12-15T17:01:09+00:00
broader: Sport
narrower: IOC
narrower: Federazione Internazionale
narrower: Federazione continentale
narrower: Federazione nazionale
narrower: GAISF

Squash
type: Concept
preferred label: スカッシュ @ja-jp
preferred label: squash @pt-pt
definition: Jogo de estratégia e resistência, disputado individualmente ou por equipas de 2 jogadores, com raquete e bola de borracha, em campo retangular fechado dos quatro lados. @pt-pt
definition: Juego de raqueta, de estrategia y resistencia, disputado individualmente o por equipos de dos, en una cancha cerrada, con una pelota de goma. @es
definition: sport de stratégie et d'endurance qui se pratique à 2 ou 4 joueurs avec une raquette et une balle en caoutchouc dans un court rectangulaire fermé sur 4 côtés. @fr
definition: Ein Sport mit Schläger mit Strategie und Ausdauer, Einzeln oder im Doppel in einem Court mit einem kleinen Ball. @de
definition: Jogo de estratégia e resistência, disputado individualmente ou por equipes de 2 jogadores, com raquete e bola de borracha, em quadra retangular fechada dos quatro lados. @pt-br
definition: 壁で囲まれたコート内で、小さなゴムボールを使用し、シングルスかダブルスチームで競われる戦略と持久力のラケットスポーツ @ja-jp
definition: A racket sport of strategy and endurance played by singles or doubles teams in a walled court with a small rubber ball @en-gb
definition: Sport con racchetta di strategia e resistenza giocato individualmente o in coppia con una palla di plastica in un campo con pareti
note: typo fixed in Explanation @en-gb
note: nessuno
in scheme: Subject Code
created: 2000-10-30T12:00:00+00:00
modified: 2010-12-15T17:01:09+00:00
broader: Sport

相撲
type: Concept
preferred label: Sumo
preferred label: sumo @pt-pt
preferred label: sumô @pt-br
preferred label: sumo wrestling @en-gb
definition: Esporte de combate de origem japonesa, baseado na força e na rapidez, em que os lutadores tentam derrubar ou deixar o adversário fora da área de combate. Geralmente, é praticado no Japão, com muita cerimónia, e por homens de grande porte. @pt-br
definition: sport de combat alliant puissance et rapidité pratiqué essentiellement au Japon. Les lutteurs pèsent généralement entre 130 et 200 kg et sont de grande taille @fr
definition: Ein schneller Kampfsport mit viel Zeremonie bei dem zwei Wettkämpfer versuchen den Gegner aus dem markierten Bereich herauszudrängen oder schmeißen. Meist praktiziert von kräftigen Männern in Japan @de
definition: Forma di lotta nella quale ogni contendente cerca di atterrare o far uscire dalla zona di combattimento l'avversario. Praticata specialmente in Giappone da atleti di grosse proporzioni
definition: 2人の競技者同士が、囲いを付けた領域外に相手を投げたり、平手打ちをする、たくさんの儀式を伴った迅速な格闘競技。一般に、日本では大きい男性が行う @ja-jp
definition: A combat sport of speed and rapidity with much ceremony where two contestants try to throw or slap a competitor out of a marked area. Generally practiced in Japan by large men. @en-gb
definition: Desporto de combate de origem japonesa, baseado na força e na rapidez, em que os lutadores tentam derrubar ou deixar o adversário fora da área de combate. Geralmente, é praticado no Japão, com muita cerimónia, e por homens de grande porte. @pt-pt
definition: Deporte de combate, basado en fuerza y rapidez, donde los dos luchadores tratan de arrojar o dejar a su oponente fuera del área delimitada. Generalmente es practicado en Japón, por hombres de gran peso. @es
note: nessuno
in scheme: Subject Code
created: 2000-10-30T12:00:00+00:00
modified: 2010-12-15T17:01:09+00:00
broader: Sport

サーフィン
type: Concept
preferred label: Surf
preferred label: surf @es
preferred label: surfing @en-gb
preferred label: surfe @pt-br
preferred label: Wellenreiten @de
definition: Water sport where contestants catch and ride waves upright on a surfboard @en-gb
definition: Desporto aquático em que os praticantes, equilibrados em cima de uma prancha, deslizam pelas ondas. @pt-pt
definition: Sport de glisse sur l'eau. Le surfeur se déplace sur des vagues en se tenant debout sur une planche plate. @fr
definition: Deporte acuático, donde los participantes corren y se deslizan sobre olas encima de una tabla especial . @es
definition: 競技者が、サーフボード上に立ち上がり、波を捕らえて乗るウォータースポーツ @ja-jp
definition: Wassersport bei dem die Teilnehmer wellen kreuzen oder reiten auf einem Surfboard. @de
definition: Sport acquatico dove gli atleti cavalcano le onde stando in equilibrio su una tavola
definition: Esporte aquático em que os praticantes, equilibrados em cima de uma prancha, deslizam pelas ondas. @pt-br
note: nessuno
in scheme: Subject Code
created: 2000-10-30T12:00:00+00:00
modified: 2010-12-15T17:01:09+00:00
broader: Sport

Nuoto
type: Concept
preferred label: natação @pt-pt
preferred label: 水泳 @ja-jp
preferred label: swimming @en-gb
preferred label: Schwimmen @de
preferred label: natación @es
preferred label: Natation @fr
definition: Deporte de agua donde los contendientes nadan tan rápido como pueden en un estilo determinado y ganan carreras si son los primeros en tocar el borde de la pileta. @es
definition: sport consistant à nager le plus vite possible dans le style voulu, pour être le premier à toucher le mur d'arrivée après le nombre de longueurs de piscine requis. @fr
definition: Sport acquatico in cui gli atleti nuotano il più velocemente possibile in uno stile stabilito e vince la gara chi tra loro tocca per primo la base
definition: 競技者は決められたスタイルで、できるだけ速く泳ぎ、壁を最初にタッチすることでレースに勝利するウォータースポーツ @ja-jp
definition: Desporto aquático em que os atletas nadam o mais rápido possível em determinado estilo. @pt-pt
definition: Wassersport bei dem die Wettkämpfer so schnell wie möglich in einem vorgebenen Stil schwimmen. Sieger ist, wer zuerst ankommt. @de
definition: Esporte aquático em que os atletas nadam o mais rápido possível em determinado estilo. @pt-br
definition: A water sport where contestants swim as fast as possible in a given style and win races by being the first to touch home @en-gb
note: nessuno
in scheme: Subject Code
created: 2000-10-30T12:00:00+00:00
modified: 2010-12-15T17:01:09+00:00
broader: Sport
narrower: 50 m sl
narrower: 100 m sl
narrower: 200 m sl
narrower: 400 m sl
narrower: 800 m sl
narrower: 1500 m sl
narrower: 4 x 50 m sl
narrower: 4 x 100 m sl
narrower: libero 4 x 200 m sl
narrower: 50 m dorso
narrower: 100 m dorso
narrower: 200 m dorso
narrower: 50 m rana
narrower: 100 m rana
narrower: 200 m rana
narrower: 50 m farfalla
narrower: 100 m farfalla
narrower: 200 m farfalla
narrower: 100 m Misti (individuale)
narrower: 200 m Misti (individuale)
narrower: 400 m Misti (individuale)
narrower: Staffetta mista 4 x 50 m
narrower: Staffetta mista 4 x 100 m
narrower: Vasca corta
narrower: Nuoto sincronizzato tecnico
narrower: Nuoto sincronizzato libero

Ping pong
type: Concept
preferred label: Tischtennis @de
preferred label: 卓球 @ja-jp
preferred label: Tennis de table @fr
preferred label: table tennis @en-gb
preferred label: ténis de mesa @pt-pt
preferred label: tênis de mesa @pt-br
preferred label: tenis de mesa @es
definition: sport où deux joueurs (ou deux équipes de deux) s'affrontent sur une table en renvoyant une balle au dessus d'un filet à l'aide d'une raquette. @fr
definition: 2人または4人(ダブルス)で、軽量のボールと小さなバットを使用して、ネットで区切られたテーブルで競われるラケット競技 @ja-jp
definition: Esporte de raquete para 2 ou 4 jogadores, que rebatem uma bola leve para a área do adversário, praticado sobre mesa divida por uma rede. @pt-br
definition: A racket sport for two or four (in doubles), who compete at a table divided by a net using a small bat to play a lightweight ball @en-gb
definition: Desporto de raquete para 2 ou 4 jogadores, que rebatem uma bola leve para a área do adversário, praticado sobre mesa divida por uma rede. @pt-pt
definition: Ballsport für zwei oder vier (im Doppel), wird auf einem Tisch ausgeübt, der durch ein Netz geteilt ist mit einem kleinen Schläger und einem leichten Ball. @de
definition: Un deporte de raqueta para dos o cuatro (en dobles), que compiten en una tabla dividida por una red utilizando una paleta liviana y una pelota de plástico. @es
definition: Sport con racchetta per due o quattro persone (in coppia) che competono su un tavolo diviso da una rete
note: typo fixed in Explanation @en-gb
note: nessuno
in scheme: Subject Code
created: 2000-10-30T12:00:00+00:00
modified: 2010-12-15T17:01:09+00:00
broader: Sport

Taekwon-Do
type: Concept
preferred label: taekwondo @pt-br
preferred label: Taekwondo @de
preferred label: テコンドー @ja-jp
definition: I combattimenti di Taekwondo (stile WTF) si svolgono su un campo quadrato di 12x12 m, tra due atleti muniti di protezioni. Il combattimento è articolato in tre round
definition: Kampfsportart, ursprünglich aus Korea. @de
definition: 朝鮮発祥の武道 @ja-jp
definition: Arte marcial de origem coreana. @pt-pt
definition: A martial art of Korean origin @en-gb
definition: art martial d'autodéfense et de combat d'origine coréenne @fr
definition: Un arte marcial de origen coreano, con especialidad en técnicas de patadas. @es
note: nessuno
in scheme: Subject Code
created: 2000-10-30T12:00:00+00:00
modified: 2010-12-15T17:01:09+00:00
broader: Sport
narrower: Al di sotto dei 49 kg
narrower: Al di sotto dei 58 kg
narrower: 49-57 kg
narrower: 58-68 kg
narrower: 57-67 kg
narrower: 68-80 kg
narrower: Oltre i 67 kg
narrower: Oltre gli 80 kg

tenis
type: Concept
preferred label: Tennis
preferred label: ténis @pt-pt
preferred label: tennis @en-gb
preferred label: tênis @pt-br
preferred label: テニス @ja-jp
definition: sport où deux joueurs (ou deux équipes de deux) s'affrontent sur un court en renvoyant une balle au dessus d'un filet à l'aide d'une raquette @fr
definition: Deporte donde dos jugadores o dos parejas, equipados con raquetas, compiten golpeando una pelota por encima de una red ubicada en la mitad del campo demarcado, con el objetivo de enviarla al lado opuesto y ponerla lejos del alcance rival. @es
definition: Sportart, bei der zwei Spieler oder vier im Doppel mit einem Schläger ausgestattet, einen Ball über ein Netz auf die gegnerische Seite des Feldes schlagen. Ziel ist es diesen so zu platzieren, dass er unerreicht innerhalb der Linie auf den Boden geht, damit werden Punkte erreicht. @de
definition: 2人のプレーヤー(ダブルスでは4人)がラケットでネット越しに対戦相手側のコート内へボールを打つ競技。ラインの内側で相手が届かないところを狙い得点を得る @ja-jp
definition: A sport where two players, four in doubles, equipped with a racket compete by hitting the ball over a net into the opponent's side of the court with the aim of putting it out of reach within the regulation lines, thus winning points. @en-gb
definition: Sport nel quale due giocatori, quattro se in coppia, competono colpendo una palla con una racchetta al di sopra di una rete che divide in due parti il campo allo scopo di ottenere punti lanciando la palla fuori dalla portata dell'avversario ma pur sempre all'interno delle linee del campo
definition: Desporto em que 2 jogadores, ou 4 em pares, se defrontam em campo dividido por rede, batendo com raquete uma bola de borracha para a área adversária. @pt-pt
definition: Esporte em que 2 jogadores, ou 4 em pares, se defrontam em quadra dividida por rede, rebatendo com raquete uma bola de borracha para a área adversária. @pt-br
note: nessuno
in scheme: Subject Code
created: 2000-10-30T12:00:00+00:00
modified: 2010-12-15T17:01:09+00:00
broader: Sport
narrower: soft tennis

triatlo
type: Concept
preferred label: triatlón @es
preferred label: トライアスロン @ja-jp
preferred label: Triathlon
preferred label: triathlon @en-gb
definition: An endurance multi-sport where competitors first swim, then cycle and then run a road race. Distances vary according to the competition, the Olympic version being 1.5, 40 and 10km respectively. @en-gb
definition: épreuve d'endurance qui comprend trois disciplines différentes enchaînées successivement (nage, cyclisme, course à pied). @fr
definition: Prova de resistência que inclui três disciplinas diferentes - natação, ciclismo e corrida a pé - executadas em cadeia. As distâncias variam de acordo com a competição. @pt-pt
definition: 競技者は最初に水泳、それから自転車、その後にランニングをする耐久の複合競技。距離は競技会によって様々で、オリンピックではそれぞれ1.5km、40km、10kmになる @ja-jp
definition: Un deporte de resistencia con varias disciplinas, donde los competidores primero nadan, luego afrontan una competencia ciclista y luego corren. Las distancias varían de acuerdo a la competición: la versión olímpica cumple 1,5, 4 y 10 kilómetros. @es
definition: Ein Ausdauersport, bei dem die Wettkämpfer erst Schwimmen, dann Radfahren und dann auf der Straße laufen. Je nach Wettbewerb variieren die Distanzen, die olympische Version erfordert 1,5 km, 40 km und 10 km. @de
definition: Sport multidisciplinare di resistenza nel quale i concorrenti, in ordine, nuotano, vanno in bicicletta e corrono per strada. Le distanze della competizione olimpica sono di 1, 5, 40 e 10 km
note: nessuno
note: typo fixed in Explanation @en-gb
in scheme: Subject Code
created: 2000-10-30T12:00:00+00:00
modified: 2010-12-15T17:01:09+00:00
broader: Sport
narrower: Nuoto
narrower: Ciclismo
narrower: Corsa

Pallavolo
type: Concept
preferred label: Volley-ball @fr
preferred label: voleibol @pt-pt
preferred label: volleyball @en-gb
preferred label: vôlei @pt-br
preferred label: vóleibol @es
preferred label: バレーボール @ja-jp
preferred label: Volleyball @de
definition: 2 équipes de 6 joueurs s'affrontent en faisant passer un ballon par-dessus un filet. Le but est d'empêcher le ballon de tomber au sol dans sa partie de terrain. @fr
definition: Due squadre di sei giocatori segnano punti mandando una palla nel campo avversario oltrepassando una rete che si trova ad una certa altezza da terra. I punti si guadagnano quando gli avversari non riescono a rinviare la palla
definition: 6人構成の2つのチームがボールを常に空中に保ちながら、ネット越しに対戦相手側となるコートにボールを打つことでポイントを記録する。相手がボールを返せないとポイントを得る @ja-jp
definition: Dos equipos de 6 jugadores intentan con sus manos anotar puntos al lanzar una pelota por encima de una red (en mitad del campo) hacia el lado rival. Los puntos se obtienen cuando el oponente falla en responder el envío o cuando la pelota toca el suelo. @es
definition: Jogo de bola que opõe duas equipes de 6 jogadores em quadra dividida ao meio por rede. Os jogadores usam as mãos para fazer passar a bola por cima da rede para cair na área adversária, marcando assim pontos. @pt-br
definition: Zwei Teams mit jeweils 6 machen Punkte indem sie den Ball über ein Netz in das gegnerische Spielfeld schlagen und versuchen ihn solange wie möglich in der Luft zu halten. Punkte werden gemacht wenn ein Fehler gemacht wird und der Ball an den Gegner zurück geht. @de
definition: Two teams of six record points by hitting a ball over a net into the opponent's half of the court, keeping it in the air at all times. Points are won when opponents fail to return the ball. @en-gb
definition: Jogo de bola que opõe duas equipas de 6 jogadores em campo dividido ao meio por rede. Os jogadores usam as mãos para fazer passar a bola por cima da rede para cair na área adversária, marcando assim pontos. @pt-pt
note: nessuno
in scheme: Subject Code
created: 2000-10-30T12:00:00+00:00
modified: 2010-12-15T17:01:09+00:00
broader: Sport
narrower: Beach volley

Pallanuoto
type: Concept
preferred label: polo acuático @es
preferred label: Wasserball @de
preferred label: 水球 @ja-jp
preferred label: polo aquático @pt-pt
preferred label: water polo @en-gb
preferred label: Water polo @fr
definition: Desporto náutico praticado em piscina e disputador por duas equipes de 7 nadadores, que só podem usar uma mão para passar a bola ou nadar com ela antes de arremessar ao gol adversário. @pt-br
definition: Desporto náutico praticado em piscina e disputador por duas equipas de 7 nadadores, que só podem usar uma mão para passar a bola ou nadar com ela antes de arremessar à baliza adversária. @pt-pt
definition: sport nautique qui se pratique dans une piscine : deux équipes de 7 joueurs essayent de marquer le plus de buts possibles à l'équipe adverse @fr
definition: Played in a pool between two teams of 7, who must stay afloat and can only use one hand to pass the ball or swim with it before trying to throw it into the opponents net to score goals. @en-gb
definition: Wird in einem Wasserbecken ausgetragen von zwei Teams mit jeweils 7 Spielern, die sich im Wasser befinden und nur eine Hand benutzen dürfen, um den Ball zu werfen oder mit diesem schwimmen müssen, bevor sie ihn in das gegnerische Netz werfen, um Punkte zu machen. @de
definition: 7人構成の2つのチームがプールで競技する。競技者は水中に浮んでいなくてはならず、片手のみを使ってボールをパスしたり、ゴールを獲得しようとして対戦相手のネットへボールを投げ込むまでボールと一緒に泳ぐ @ja-jp
definition: Jugado en una piscina entre dos equipos de siete, que deben mantenerse a flote. Sólo pueden utilizar una mano para pasar el balón e intentar marcar un gol. El equipo que ataca tiene 35 segundos de posesión de balón y no puede hundir el esférico. @es
definition: Si gioca in una piscina tra due squadre di sette giocatori ciascuna che cercano di stare a galla e possono usare soltanto una mano per passarsi la palla o nuotare con essa prima di cercare di tirare la palla nella rete avversaria per segnare
note: typo fixed in Explanation @en-gb
note: nessuno
in scheme: Subject Code
created: 2000-10-30T12:00:00+00:00
modified: 2010-12-15T17:01:09+00:00
broader: Sport

Sci nautico
type: Concept
preferred label: esquí náutico @es
preferred label: 水上スキー @ja-jp
preferred label: Ski nautique @fr
preferred label: water skiing @en-gb
preferred label: esqui náutico @pt-pt
preferred label: Wasserski @de
definition: On one or two skis contestants are pulled by a power boat along the water's surface @en-gb
definition: Uno o due sciatori tirati da una barca a motore su una superficie d'acqua
definition: Wettkämpfer wird auf einem oder zwei Skiern von einem Boot am Seil über die Wasseroberfläche gezogen. @de
definition: sur un ou deux skis, les concurrents, tirés par un bateau, évoluent sur l'eau @fr
definition: Los competidores, con uno o dos esquís, son impulsados por una embarcación a motor sobre la superficie del agua. @es
definition: Com um ou dois esquis, os participantes são puxados por uma embarcação a motor ao longo da superfície da água. @pt-br
definition: 1本か2本のスキーを履いた競技者をパワーボートが水面を引っ張る @ja-jp
note: nessuno
in scheme: Subject Code
created: 2000-10-30T12:00:00+00:00
modified: 2010-12-15T17:01:09+00:00
broader: Sport
narrower: Slalom
narrower: Acrobatico
narrower: Salto
narrower: Combinato

Sollevamento pesi
type: Concept
preferred label: 重量挙げ @ja-jp
preferred label: halterofilia @es
preferred label: weightlifting @en-gb
preferred label: halterofilismo @pt-br
preferred label: Haltérophilie @fr
preferred label: Gewichtheben @de
definition: Un deporte de fuerza donde el competidor debe levantar el máximo de peso posible @es
definition: Prova di forza nella quale gli atleti sollevano un peso il più pesante possibile
definition: Teste de força em que os atletas tentam levantar o máximo de peso possível. @pt-pt
definition: 競技者が出来る限り重い錘を持ち上げる力持ち競技 @ja-jp
definition: A strength test where competitors lift as heavy a weight as possible @en-gb
definition: Kräftemessen, bei dem die Wettkämpfer eine Gewicht so schwer wie möglich heben. @de
definition: sport de force et de vitesse d'exécution qui consiste à soulever la charge la plus lourde @fr
note: nessuno
in scheme: Subject Code
created: 2000-10-30T12:00:00+00:00
modified: 2010-12-15T17:01:09+00:00
broader: Sport
narrower: Strappo
narrower: Due tempi (salto e strappo)
narrower: 48kg
narrower: 53 kg
narrower: 63 kg
narrower: 75 kg
narrower: Oltre 75 kg
narrower: 56 kg
narrower: 62 kg
narrower: 69 kg
narrower: ７７ｋｇ級
narrower: 85 kg
narrower: 94 kg
narrower: １０５ｋｇ級
narrower: Più di 105 kg
narrower: Powerlifting

Windsurf
type: Concept
preferred label: windsurfing @en-gb
preferred label: windsurf @es
preferred label: Planche à voile @fr
preferred label: Windsurfen @de
preferred label: ウィンドサーフィン @ja-jp
definition: Contestants must complete a marked out course as fast as possible on a windsurf board @en-gb
definition: Contendientes deben completar una curso acuático demarcado tan rápido como puedan desplazándose en una tabla de vela @es
definition: 競技者はウインドサーブボードでできる限り早くコースを完走しなければならない(競技) @ja-jp
definition: compétitition consistant à parcourir une distance donnée dans un minimum de temps avec une planche à voile @fr
definition: Gli atleti devono completare il più velocemente possibile un percorso segnato stando su una tavola da windsurf
definition: Competição de prancha a vela em que os participantes devem completar o mais rápido possível um percurso aquático demarcado. @pt-br
definition: Competição de prancha à vela em que os participantes devem completar o mais rápido possível um percurso aquático demarcado. @pt-pt
definition: Wettkämpfer müssen so schnell wir möglich einen bestimmten Kurs auf einem Surfboard zurücklegen. @de
note: nessuno
in scheme: Subject Code
created: 2000-10-30T12:00:00+00:00
modified: 2010-12-15T17:01:09+00:00
broader: Sport
narrower: Oceano
narrower: Lago
narrower: Fiume
narrower: Terra

Lotta
type: Concept
preferred label: レスリング @ja-jp
preferred label: lucha @es
preferred label: luta livre @pt-pt
preferred label: Lutte @fr
preferred label: Ringen @de
preferred label: wrestling @en-gb
definition: Combattimento sportivo in cui ogni lottatore cerca di vincere tenendo l'avversario con le spalle al tappeto il tempo necessario per tenerlo sotto controllo. Anche i punti possono essere decisivi
definition: 格闘技でレスリング選手は相手を組み伏せ、十分な時間床に両肩を仰向けに押さえつけ(フォール)て制御する競技、これが決定的になるとポイントになる @ja-jp
definition: Kampfsport, bei dem jeder Ringer versucht den andern zu besiegen, indem er die beiden Schultern auf dem Boden hält. Punkte können auch entscheidend sein. @de
definition: Esporte de combate em que cada lutador tenta ganhar derrubando o adversário ou segurando os seus ombros para o manter no solo. @pt-br
definition: Combat sport where each wrestler attempts to win over his adversary, by holding both shoulders on the ground (fall) long enough to be in control. Points can also be decisive. @en-gb
definition: Deporte de combate donde cada luchador intenta ganar, apoyando los hombros de su rival contra el piso en un tiempo determinado. Los puntos pueden ser decisivos. @es
definition: sport de combat où deux lutteurs essaient de se faire tomber ou de maintenir un adversaire à terre sur les épaules @fr
definition: Desporto de combate em que cada lutador tenta ganhar derrubando o adversário ou segurando os seus ombros para o manter no solo. @pt-pt
note: nessuno
in scheme: Subject Code
created: 2000-10-30T12:00:00+00:00
modified: 2010-12-15T17:01:09+00:00
broader: Sport
narrower: Libera
narrower: Greco-romana
narrower: Superiore ai 130 kg
narrower: 130 kg
narrower: 97 kg
narrower: 85 kg
narrower: 76 kg
narrower: 69 kg
narrower: 63 kg
narrower: 58 kg
narrower: ５４ｋｇ級
narrower: Lotta svizzera

Evento sportivo
type: Concept
preferred label: eventos desportivos @pt-pt
preferred label: スポーツ大会 @ja-jp
preferred label: sports event @en-gb
preferred label: eventos esportivos @pt-br
preferred label: eventos deportivos @es
preferred label: Evènements sportifs @fr
preferred label: Sportereignisse @de
definition: Sportliche Veranstaltung @de
definition: Eventos desportivos @pt-pt
definition: スポーツ大会 @ja-jp
definition: eventos deportivos @es
definition: Sports meeting @en-gb
definition: Eventos esportivos @pt-br
definition: Evento sportivo
definition: rassemblement de sportifs @fr
note: nessuno
in scheme: Subject Code
created: 2000-10-30T12:00:00+00:00
modified: 2010-12-15T17:01:09+00:00
broader: Sport
narrower: Olimpiadi
narrower: Olimpiadi invernali
narrower: Universiade
narrower: Universiade invernale
narrower: Giochi del Commonwealth
narrower: Giochi invernali della buona volontà
narrower: Giochi Asiatici
narrower: Giochi Asiatici Invernali
narrower: Giochi panamericani
narrower: Giochi africani
narrower: Giochi mediterranei
narrower: Giochi sudest asiatici
narrower: Giochi panpacifici
narrower: Giochi del sudpacifico
narrower: Giochi panarabici
narrower: Giochi estivi della buona volontà
narrower: Giochi mondiali
narrower: Coppa del mondo
narrower: Coppa intercontinentale
narrower: Coppa continentale
narrower: Coppa internazionale
narrower: Coppa nazionale
narrower: Coppa interregionale
narrower: Coppa regionale
narrower: Coppa della lega
narrower: Campionato mondiale
narrower: Campionato intercontinentale
narrower: Campionato continentale di primo livello
narrower: Campionato continentale di secondo livello
narrower: Campionato continentale di terzo livello
narrower: Campionato nazionale di I livello
narrower: Campionato nazionale di II livello
narrower: Campionato nazionale di III livello
narrower: Campionato nazionale di IV livello
narrower: Campionato regionale
narrower: Gran Premio
narrower: Competizione intercontinentale
narrower: Competizione continentale
narrower: Competizione internazionale
narrower: Gara nazionale
narrower: Gara tra nazioni
narrower: Gara tra circoli
narrower: Gara amichevole
narrower: Competizione all-stars
narrower: Esibizione
narrower: Super Bowl
narrower: Giochi paraolimpici

rodeio
type: Concept
preferred label: rodeo @pt-pt
preferred label: Rodeo
preferred label: ロデオ @ja-jp
preferred label: Rodéo @fr
definition: Disciplina en la que toros o caballos salvajes deben ser montados y domados. @es
definition: A discipline where wild horses or bulls must be mounted and mastered @en-gb
definition: 野生馬または雄牛に乗って、支配しなければならない競技 @ja-jp
definition: Disziplin bei der wilde Pferde und Bullen beritten und gezähmt werden. @de
definition: Disciplina em que cavalos ou touros selvagens podem ser montados e domados. @pt-pt
definition: Disciplina em que cavalos ou bois selvagens podem ser montados e domados. @pt-br
definition: Disciplina in cui cavalli, vitelli, tori o altri animali devono essere domati
definition: discipline sportive qui consiste à monter et maitriser des chevaux et taureaux sauvages @fr
note: nessuno
in scheme: Subject Code
created: 2000-10-30T12:00:00+00:00
modified: 2010-12-15T17:01:09+00:00
broader: Sport
narrower: 樽回り競走
narrower: Vitello al lazo
narrower: Monta del toro
narrower: Bulldogging
narrower: saddle bronc
narrower: Senza sella
narrower: Capra al lazo

Mini golf
type: Concept
preferred label: ミニゴルフ @ja-jp
preferred label: minigolfe @pt-br
preferred label: mini golf @es
preferred label: mini golf sport @en-gb
preferred label: Minigolfsport @de
preferred label: Mini golf sport @fr
definition: Jogo semelhante ao golfe, praticado em campo artificial de menores dimensões. @pt-pt
definition: Gioco in cui le palle devono essere imbucate con una mazza in un percorso artificiale in meno tiri possibili
definition: A game where balls must be holed on an artificial course in as few strokes from the club as possible @en-gb
definition: より少ない打数でクラブから人工コース上の穴にボールを打ち込まなければならないゲーム @ja-jp
definition: Spiel bei dem Bälle eingelocht werden in einem speziellen Kurs mit so wenig Versuchen wie möglich. @de
definition: jeu consistant à placer une balle avec un club dans une série de trous répartis le long d'un parcours artificiel, et ce, en moins de coups possible @fr
definition: Juego similar al golf de campo, donde las pelotas deben ser embocadas en hoyos de una cancha artificial en la menor cantidad de golpes posibles. @es
note: nessuno
in scheme: Subject Code
created: 2000-10-30T12:00:00+00:00
modified: 2010-12-15T17:01:09+00:00
broader: Sport

バンディー
type: Concept
preferred label: Bandy
preferred label: bandy @en-gb
definition: Sport di squadra tradizionalmente giocato in Svezia e in Finlandia dal quale è derivato l'hockey su ghiaccio.
definition: Wird im Freien auf Eis gespielt. Die Größe des Spielfeldes entspricht einem Fußballfeld. Benutzt werden Schlittschuhe wie im Eishockey und ein kleiner Kunststoffball. Die Schläger der Spieler ähneln Eishockeyschlägern, sind aber kürzer und stärker gerundet. @de
definition: sorte de hockey sur glace joué en extérieur sur une surface grande comme un terrain de football @fr
definition: Se juega al aire libre, sobre hielo. El tamaño de la pista es aproximadamente el de una cancha de fútbol. Los patines son similares a los de hockey sobre hielo y Se utiliza una pequeña pelota. @es
definition: Played outdoors on ice. The size of the ice rink is about the size of a soccer field. Skates like ice hockey. A small hard ball is used for playing. Players play with sticks, much like in ice hockey, but the sticks are shorter and more rounded. @en-gb
definition: Espécie de hóquei no gelo, jogado ao ar livre, sobre uma superfície aproximadamente do tamanho de um campo de futebol. @pt-pt
definition: 屋外の氷上でプレーされる。アイス･リンクの大きさは、サッカー競技場の大きさ。スケート靴はアイスホッケーのようである。小さい堅いボールがプレーするために使われる。選手がスティックでプレーし、極めてアイスホッケーのようである。しかし、スティックはより短くて、そしていっそう丸い @ja-jp
note: Explanation shortened @en-gb
note: nessuno
in scheme: Subject Code
created: 2000-10-30T12:00:00+00:00
modified: 2010-12-15T17:01:09+00:00
broader: Sport

Frisbee
type: Concept
preferred label: フライングディスク @ja-jp
preferred label: disco volador @es
preferred label: flying disc @en-gb
preferred label: frisbee @pt-br
preferred label: disco voador @pt-pt
definition: jeu d'adresse entre des équipes qui se lancent un disque en matière plastique @fr
definition: Grupo de provas disputadas com um disco voador de plástico. @pt-pt
definition: A group of events all played with a flying plastic disc. The exact regulation for the disc is different in different events but it has to be unbroken of solid plastic and a production model with no modification. Flying disc is sometimes called Frisbee. @en-gb
definition: Un grupo de competencias, todas jugadas con un disco volador de plástico. La regulación exacta del disco difiere en los distintos eventos. También denominado Freesbe Bu. @es
definition: Eine Reihe von Wettbewerben, die mit einer fliegenden Kunststoffwurfscheibe gespielt werden. Die genauen Regeln für die Wurfscheiben variieren je nach Wettbewerb, aber verwendet werden unzerbrechliche aus solidem Kunststoff gefertigte Scheiben, deren Aussehen nie verändert ist. Manchmal auch Frisbee genannt. @de
definition: 全ての競技種目のグループは、フライング･プラスチック･ディスクでプレーされる。ディスクの正確なレギュレーションは、様々な競技種目で異なっている。しかし壊れていない固体のプラスチックで、変更がない生産モデルでなければならない。フライング･ディスクは、時々フリスビーと呼ばれる @ja-jp
definition: Serie di gare tutte con un disco volante di plastica. La grandezza del disco è diversa nelle varie gare
note: nessuno
note: Explanation shortened @en-gb
in scheme: Subject Code
created: 2000-10-30T12:00:00+00:00
modified: 2010-12-15T17:01:09+00:00
broader: Sport
narrower: Finale
narrower: Guts
narrower: Overall
narrower: Distanza
narrower: ディスカソン
narrower: ddc
narrower: SCF
narrower: Stile libero
narrower: Precisione
narrower: Golf con il disco

Floorball
type: Concept
preferred label: Unihockey @de
preferred label: floorball @pt-pt
preferred label: フロアボール @ja-jp
definition: Se juega bajo techo, en una cancha del tamaño de una de básquetbol. 6 jugadores por equipo, de los cuales uno es el portero, que opera de rodillas, pero sin un palo como en el hockey sobre hielo. Los jugadores usan palos plásticos y una pelota plástica l @es
definition: jeu de football joué sur un parquet couvert @fr
definition: Giocato al coperto in un campo di dimensioni pari a quelle del campo di pallacanestro. Sei atleti per squadra, il portiere gioca in ginocchio, ma non c'è il bastone per il goal come nell'hockey. Gli atleti usano mazze di plastica e una leggera palla di plastica che si passano per segnare goal
definition: Played indoors in a court the size of a basketball court. 6 players per team, of which one is a who plays in a kneeling position without a stick like in ice hockey. The other players use plastic clubs and a light plastic ball to pass and shoot goals. @en-gb
definition: Jogo de futebol em recinto fechado do tamanho de um campo de basquetebol, disputado por duas equipes de 6 jogadores, que usam bastões plásticos para bater uma bola de plástico leve. @pt-br
definition: Wird in der Halle gespielt auf einem Spielfeld in der Größe eines Basketballfeldes. Ein Team besteht aus fünf Feldspielern und einem Torwart. Der Torwart spielt auf Knien, aber nicht mit einem Torwartschläger wie im Eishockey. Die Spieler benutzen Kunststöcke und leichte Plastikbälle um Pässe und Tore zu schießen. @de
definition: Jogo de futebol em recinto fechado do tamanho de um campo de basquetebol, disputado por duas equipas de 6 jogadores, que usam bastões plásticos para bater uma bola de plástico leve. @pt-pt
definition: バスケットボールコートのサイズのコートで屋内でプレーする。1チーム6人のプレーヤーで1人がひざまずくが、アイスホッケーのようなゴールスティックはない。他のプレーヤーはパスやシュートをするためにプラスティッククラブと軽プラスティックボールを使用する @ja-jp
note: Explanation shortened @en-gb
note: nessuno
in scheme: Subject Code
created: 2000-10-30T12:00:00+00:00
modified: 2010-12-15T17:01:09+00:00
broader: Sport

casting
type: Concept
preferred label: lanzamiento @es
preferred label: Casting
preferred label: キャスティング @ja-jp
definition: Utilisation d'un équipement de pêche pour atteindre une cible et marquer des points @fr
definition: 釣具を使用し、目標に当てて得点を得る @ja-jp
definition: Uso de equipamento de pesca para atingir um alvo e marcar pontos. @pt-br
definition: Si usa un equipaggiamento adatto alla pesca per colpire un bersaglio e segnare punti
definition: Ziel- und Weitwerfen mit Angelgeräten. @de
definition: Usando un equipamiento de pesca para alcanzar una diana y anotar puntos @es
definition: Using fishing equipment to hit a target and score points @en-gb
note: nessuno
in scheme: Subject Code
created: 2000-10-30T12:00:00+00:00
modified: 2010-12-15T17:01:09+00:00
broader: Sport

Tiro alla fune
type: Concept
preferred label: Tauziehen @de
preferred label: cabo de guerra @pt-br
preferred label: 綱引き @ja-jp
preferred label: jogo da corda @pt-pt
preferred label: tug-of-war @en-gb
preferred label: Tug-of-war @fr
preferred label: tira y afloja con cuerda @es
definition: Due squadre tirano una fune ciascuna nella propria direzione
definition: Dos equipos tirando de cada lado de una cuerda @es
definition: Uma equipa tenta derrubar a equipa adversária, puxando uma corda. @pt-pt
definition: Deux équipes tirent d'une corde chacune de leur côté @fr
definition: Duas equipas puxam de cada lado de uma corda. @pt-br
definition: 2つのチームがロープを引っ張り合う @ja-jp
definition: Zwei Teams ziehen gegeneinander an einem Tau. @de
definition: Two teams pulling against each other on a rope @en-gb
note: nessuno
in scheme: Subject Code
created: 2000-10-30T12:00:00+00:00
modified: 2010-12-15T17:01:09+00:00
broader: Sport

Croquet
type: Concept
preferred label: croquet @pt-pt
preferred label: Crocket @de
preferred label: Croquette @fr
preferred label: クロッケー @ja-jp
preferred label: croquette @en-gb
definition: Using mallets to hit a ball through hoops @en-gb
definition: Juego en el cual se golpea una pelota con un mazo haciendola pasar por debajo de aros @es
definition: ボールを打ってフープ(鉄の門)をくぐらせるためにマレット(木槌)を使う @ja-jp
definition: Mit Schlägern werden Bälle durch kleine Pfostentore geschlagen. @de
definition: Sorte de jeu de maillet @fr
definition: Uso di martello di plastica per colpire una palla attraverso delle porte a forma di archetti
definition: Jogo em que se bate uma bola com um taco de madeira para passar debaixo de pequenos arcos fixados na relva. @pt-pt
definition: Jogo em que se bate uma bola com um taco de madeira para passar debaixo de pequenos arcos fixados na grama. @pt-br
note: nessuno
in scheme: Subject Code
created: 2000-10-30T12:00:00+00:00
modified: 2010-12-15T17:01:09+00:00
broader: Sport

Corsa di cani
type: Concept
preferred label: corrida de cães @pt-br
preferred label: Hunderennen @de
preferred label: ドッグレース @ja-jp
preferred label: carreras en trineo tirado por perros @es
preferred label: dog racing @en-gb
preferred label: Course de chiens @fr
definition: Competencia entre perros que corren una distancia determinada. @es
definition: 犬がトラックを走り回る @ja-jp
definition: Corrida de cães à volta de uma pista. @pt-br
definition: Dogs racing around a track @en-gb
definition: Hunderennen über eine vorgeschriebene Distanz. @de
definition: course de chiens @fr
definition: Corsa di cani su una pista
note: nessuno
in scheme: Subject Code
created: 2000-10-30T12:00:00+00:00
modified: 2010-12-15T17:01:09+00:00
broader: Sport
narrower: Slitta
narrower: Pista ovale

Skeleton
type: Concept
preferred label: skeleton @en-gb
preferred label: スケルトン @ja-jp
preferred label: esqueleto (skeleton) @es
definition: No skeleton, o esquiador, deitado de barriga para baixo num trenó especial, tenta descer o mais rápido possível uma pista de gelo. @pt-br
definition: In skeleton the competitor lays on his/hers stomach when racing down the course. The competitor must be on the sled when crossing the finishing line. The total time of all races in a competition is added together. @en-gb
definition: スケルトンでは、競技者はコース滑走時に、腹ばいになる。競技者はフィニッシュラインを超える時にソリの上にいなければならない。競技会での全レースの総使用時間が合算される @ja-jp
definition: Im Skeleton-Wettbewerb liegt der Athlet auf dem Bauch, während der Fahrt durch die Bahn (Kunsteis- oder Naturbahn). Der Athlet muss die Ziellinie auf dem Schlitten liegend überqueren. Die Gesamtzeit errechnet sich aus den Einzelzeiten der Läufe @de
definition: Descendre le plus vite possible une piste glacée sur une luge spéciale, à plat ventre, tête en avant. @fr
definition: Sport invernale individuale in cui gli atleti scendono lungo una pista ghiacciata su una slitta dotata di pattini, sdraiati in posizione prona con la testa in avanti
definition: En el Skeleton, el competidor va acostado boca abajo en el trineo durante la carrera. El competidor debe encontrarse dentro del trineo al cruzar la meta. El tiempo total de todas las carreras de una competencia se suma. El Skeleton es considerado el pri @es
note: Explanation shortened @en-gb
note: nessuno
in scheme: Subject Code
created: 2000-10-30T12:00:00+00:00
modified: 2010-12-15T17:01:09+00:00
broader: Sport

Football con regole australiane
type: Concept
preferred label: Football australien @fr
preferred label: fútbol con reglas australianas @es
preferred label: Australien Rules Football @de
preferred label: Australian rules football @en-gb
preferred label: futebol australiano @pt-br
preferred label: オーストラリアフットボール @ja-jp
definition: fútbol con reglas australianas @es
definition: オーストラリア式ルールの下で行われるフットボール @ja-jp
definition: variante du football américain appliquant les règles australiennes @fr
definition: Futebol jogado de acordo com as regras australianas. @pt-pt
definition: Football giocato seguendo regole australiane
definition: Football played under Australian rules @en-gb
definition: Football der mit australischen Regeln gespielt wird. @de
note: nessuno
in scheme: Subject Code
created: 2000-10-30T12:00:00+00:00
modified: 2010-12-15T17:01:09+00:00
broader: Sport

Football canadese
type: Concept
preferred label: fútbol canadiense @es
preferred label: Canadian football @en-gb
preferred label: Canadian Football @de
preferred label: futebol canadiano @pt-pt
preferred label: futebol canadense @pt-br
preferred label: カナディアンフットボール @ja-jp
preferred label: Football canadien @fr
definition: variante du football américain appliquant les règles canadiennes @fr
definition: Futebol jogado de acordo com as regras canadianas. @pt-pt
definition: fútbol canadiense @es
definition: カナダ式ルールの下で行われるフットボール @ja-jp
definition: Football played under Canadian rules @en-gb
definition: Football giocato con regole canadesi
definition: Futebol jogado de acordo com as regras canadenses. @pt-br
definition: Football der mit Kanadischen Regeln gespielt wird. @de
note: nessuno
in scheme: Subject Code
created: 2000-10-30T12:00:00+00:00
modified: 2010-12-15T17:01:09+00:00
broader: Sport

duatlo
type: Concept
preferred label: duatlón @es
preferred label: Duathlon
preferred label: duathlon @en-gb
preferred label: デュアスロン @ja-jp
definition: Epreuve de course à pied et de VTT @fr
definition: Duathlon @de
definition: Prova de corrida a pé e de MTB. @pt-br
definition: Prova de corrida a pé e de BTT. @pt-pt
definition: ランニングとバイク(自転車)という２つの種目を組み合わせた競技 @ja-jp
definition: Una variante del triathlon è il duathlon, articolato anch'esso in tre prove, ma con l'alternarsi di due discipine: la sequenza è infatti composta da una prima frazione di corsa, quindi una di ciclismo, per concludere con un'altra di corsa
definition: Duatlón @es
note: nessuno
in scheme: Subject Code
created: 2003-11-26T12:00:00+00:00
modified: 2012-07-10T12:00:00+00:00
broader: Sport

hornuss
type: Concept
preferred label: Hornussen @de
preferred label: Hornuss
preferred label: ホルヌッセン @ja-jp
definition: Swiss team sport with 16 or 18 men per team. A rubber puck is hit towards the field of the adversary team which tries to hit the puck in the air with a wooden board thrown in the air @en-gb
definition: Equipo de deporte suizo compuesto de 16 a 18 personas por equipo. Se lanza un disco de goma al campo de juego de los adversarios, los que tratan de lanzar el disco al aire con un tablero de madera. @es
definition: 1チーム16人または18人で行うスイスの競技。投げたゴム製パックを敵陣地に向かって打つために木製の板を投げる @ja-jp
definition: Sport svizzero di squadre formate da 16 o 18 atleti. Un puck di plastica è colpito verso il campo della squadra avversaria che cerca di mandarlo in aria con una mazza di legno
definition: Esporte de equipe suíço, com 16 a 18 pessoas por equipe, que tentam lançar para o campo adversário um disco de borracha com um painel de madeira. @pt-br
definition: Desporto suiço de equipa, com 16 a 18 pessoas por equipa, que tentam lançar para o campo adversário um disco de borracha com um painel de madeira. @pt-pt
definition: Schweizer Mannschaftsportart mit 16 oder 18 Spielern pro Team. Eine gummierte Scheibe (Hornuss) muss ins Feld der gegnerischen Mannschaft geschlagen werden, die versucht den Hornuss in der Luft mit einem hölzernen Abwehrbrett (Schindel) abzufangen. @de
definition: sport suisse @fr
note: nessuno
in scheme: Subject Code
created: 2003-11-26T12:00:00+00:00
modified: 2012-07-10T12:00:00+00:00
broader: Sport

Sfera del pugno
type: Concept
preferred label: punhobol @pt-pt
preferred label: Faustball @de
preferred label: Fist ball @fr
preferred label: フィストボール @ja-jp
preferred label: fist ball @en-gb
preferred label: balon puño @es
definition: Sport di squadra maschile simile alla pallavolo (con una rete molto più bassa)
definition: Esporte coletivo, semelhante ao vôlei, jogado em campo de grama, dividido ao meio por uma rede, e em que a bola é batida com os punhos ou braços. @pt-br
definition: Deporte masculino similar al volleyball (con una red más baja) ejecutado principalmente en clubes de gimnasia @es
definition: 主にスポーツクラブで行われているバレーボールに似た(大変低いネットを使用)男子の団体競技 @ja-jp
definition: sorte de volleyball @fr
definition: Men's team sport similar to volleyball (with a much lower net) executed mainly in gymnastics clubs @en-gb
definition: Mannschaftssport ähnlich dem Volleyball (mit einem niedriger gespannten Netz), wird hauptsächlich in Turnvereinen gespielt. @de
definition: Desporto coletivo, semelhante ao voleibol, jogado em campo relvado, dividido ao meio por uma rede, e em que a bola é batida com os punhos ou braços. @pt-pt
note: nessuno
in scheme: Subject Code
created: 2003-11-26T12:00:00+00:00
modified: 2012-07-10T12:00:00+00:00
broader: Sport

Pattinaggio in linea
type: Concept
preferred label: patinação em linha @pt-br
preferred label: Inline skating @fr
preferred label: patinagem em linha @pt-pt
preferred label: patinaje en línea @es
preferred label: Inline Skating @de
preferred label: inline skating @en-gb
preferred label: インラインスケート @ja-jp
definition: インラインスケートを使用する競技 @ja-jp
definition: Esportes de competição que usam patins em linha. @pt-br
definition: Sportlicher Wettbewerb auf Inlineskates. @de
definition: Deporte de Competición de patinaje en línea @es
definition: Competitive sports using inline skates @en-gb
definition: Desportos de competição que usam patins em linha. @pt-pt
definition: patin à roulettes en ligne @fr
definition: Sport competitivo nel quale si usano pattini in linea
note: nessuno
in scheme: Subject Code
created: 2003-11-26T12:00:00+00:00
modified: 2012-07-10T12:00:00+00:00
broader: Sport

Sci su erba
type: Concept
preferred label: esquí sobre césped @es
preferred label: esqui na relva @pt-pt
preferred label: Grasski @de
preferred label: 芝スキー @ja-jp
preferred label: Grass ski @fr
preferred label: grass ski @en-gb
preferred label: esqui na grama @pt-br
definition: Sci alpino su prato con sci dotati di rotelle
definition: Esqui alpino em patins com rodas sobre relva. @pt-pt
definition: Esquí con ruedas sobre césped. @es
definition: ski sur herbe @fr
definition: Esqui alpinos em patins com rodas sobre grama. @pt-br
definition: Alpine skiing on roller skis and grass @en-gb
definition: Alpiner Skirennsport mit Rollskiern auf Graspisten. @de
definition: 芝をローラースキーで滑るアルペンスキー @ja-jp
note: nessuno
in scheme: Subject Code
created: 2003-11-26T12:00:00+00:00
modified: 2012-07-10T12:00:00+00:00
broader: Sport

Snowbiking
type: Concept
preferred label: snowbiking @en-gb
preferred label: スノーバイク @ja-jp
preferred label: Skibob @de
definition: vélo sur neige @fr
definition: 雪上の個人スポーツ。競技者は短いスキーを履き、前後にスキーが付いたバイクに乗る。以前はスキーボブと呼ばれていた @ja-jp
definition: Einzelsportart auf Schnee auf einem Skibob, der Athlet benutzt zwei Kurz-Ski, bevorzugter Name: Skibob. @de
definition: Deporte individual en la nieve sobre una tabla @es
definition: Sport individuale sulla neve in sella ad una snow bike (bicicletta con sci al posto delle ruote), gli atleti hanno due mini sci.
definition: Individual sport on snow on a snow bike, the athlete has two mini skis, previous name: ski bob @en-gb
definition: Desporto individual com uma bicicleta sobre a neve. @pt-pt
definition: Esporte individual com uma bicicleta sobre a neve. @pt-br
note: nessuno
in scheme: Subject Code
created: 2003-11-26T12:00:00+00:00
modified: 2012-07-10T12:00:00+00:00
broader: Sport
broad match: http://cv.iptc.org/newscodes/mediatopic/20000822

Twirling
type: Concept
preferred label: twirling @pt-pt
preferred label: トワリング @ja-jp
definition: Competizione in squadra con majorette e una giuria
definition: compétition de majorettes @fr
definition: Competição de equipas com majorettes e um júri. @pt-pt
definition: Competição de equipes com majorettes e um júri. @pt-br
definition: Team competition with majorettes and a jury @en-gb
definition: Competencia de equipos con majoretes y un jurado @es
definition: Mannschaftswettbewerb mit Majoretten und einer Jury - (Tanzsportart mit einem Metallstab, dem Baton). @de
definition: バトントワリングの団体競技会 @ja-jp
note: nessuno
in scheme: Subject Code
created: 2003-11-26T12:00:00+00:00
modified: 2012-07-10T12:00:00+00:00
broader: Sport
broad match: http://cv.iptc.org/newscodes/mediatopic/20000822

Kendo
type: Concept
preferred label: kendo @en-gb
preferred label: 剣道 @ja-jp
definition: Arte marcial tradicional japonesa que usa uma espada de bambu. @pt-br
definition: Art martial traditionnel japonais utilisant une épée de bambou @fr
definition: Traditionelle japanische Kampfsportart mit einem Bambusschwert, auch Japanisches Fechten genannt. @de
definition: 竹刀を用いる日本古来の武道。海外では「Japanese fencing」と呼ばれることもある(国民体育大会競技種目) @ja-jp
definition: Tradizionale arte marziale giapponese nella quale si usa una spada in bambù
definition: Arte marcial tradicional del Japón con una espada de bambú. @es
definition: Japanese traditional martial art using a bamboo sword, sometimes called Japanese fencing. (Programme of National Sports Festival in Japan) @en-gb
note: nessuno
in scheme: Subject Code
created: 2004-04-22T12:00:00+00:00
modified: 2012-07-10T12:00:00+00:00
broader: Sport

Jukendo
type: Concept
preferred label: jukendo @pt-br
preferred label: 銃剣道 @ja-jp
definition: Arte marcial tradicional japonesa que usa uma baioneta em madeira. @pt-pt
definition: Arte marcial japonés con una arma de madera que simboliza un rifle con bayoneta @es
definition: Japanese traditional martial art using a model rifle made of wood. *Juken* means a rifle or gun with blade (bayonet). (Programme of National Sports Festival in Japan) @en-gb
definition: Japanische traditionelle Kampfsportart mit einem Holzgewehr. *Juken* bedeutet Gewehr oder Waffe mit Bajonett. (Programm des Nationalen Sportfestivals in Japan) @de
definition: Art martial traditionnel japonais avec une baïonnette en bois @fr
definition: 木製のライフル銃を用いる日本古来の武道。「銃剣」は銃に装着する刃を意味する(国民体育大会競技種目) @ja-jp
definition: Tradizionale arte marziale giapponese nella quale si usa un modello di fucile in legno. La parola *Juken* indica un fucile o una pistola con lama (baionetta).
note: nessuno
in scheme: Subject Code
created: 2004-04-22T12:00:00+00:00
modified: 2012-07-10T12:00:00+00:00
broader: Sport

naginata
type: Concept
preferred label: Naginata
preferred label: なぎなた @ja-jp
definition: Tradizionale arte marziale giapponese nella quale si usa una spada in legno dotata di asta. La parola *navigata* indica una lancia con una lama curva
definition: Japanische traditionelle Kampfsportart mit einem Holzschwert. *Naginata* bedeutet Speer mit einem gebogenen Blatt. (Programm des nationalen Sportfestivals in Japan) @de
definition: Art martial traditionnel japonais avec une longue canne recourbée en bois, le naginata @fr
definition: Arte marcial japonés con una espada curvada de madera @es
definition: Arte marcial tradicional japonesa que usa uma espada curva de madeira. @pt-br
definition: 木製の棒状の刀を用いる日本古来の武道。「なぎなた」とは湾曲した刀の付いた槍を意味する(国民体育大会競技種目) @ja-jp
definition: Japanese traditional martial art using a pole sword made of wood. *Naginata* means a spear with a curved blade. (Programme of National Sports Festival in Japan) @en-gb
note: nessuno
in scheme: Subject Code
created: 2004-04-22T12:00:00+00:00
modified: 2012-07-10T12:00:00+00:00
broader: Sport

kyudo
type: Concept
preferred label: 弓道 @ja-jp
preferred label: Kyudo
preferred label: Kyodo @de
preferred label: kiudo @es
definition: Tir à l'arc traditionnel du Japon @fr
definition: 竹製の弓と矢を用いる日本古来の武道。海外では「Japanese archery」と呼ばれることもある(国民体育大会競技種目) @ja-jp
definition: Arte marcial tradicional japonesa que usa um arco de bambu e flechas. @pt-pt
definition: Tiro con arco tradicional del Japón. @es
definition: Japanische traditionelle Kampfsportart mit einem Bambusbogen und Pfeilen, manchmal auch japanisches Bogenschießen genannt. (Programm des nationalen Sportfestivals in Japan) @de
definition: Tradizionale arte marziale giapponese nella quale si usano arco e frecce in legno, a volte è chiamato tiro con l'arco giapponese
definition: Japanese traditional martial art using a bamboo bow and arrows, sometimes called Japanese archery. (Programme of National Sports Festival in Japan) @en-gb
note: nessuno
in scheme: Subject Code
created: 2004-04-22T12:00:00+00:00
modified: 2012-07-10T12:00:00+00:00
broader: Sport

Kabaddi
type: Concept
preferred label: kabaddi @en-gb
preferred label: カバディ @ja-jp
definition: Die angreifende Seite punktet durch Berührung, die andere Seite durch Sicherung. Die wiederholten Angriffe nennt man *kabaddi*. @de
definition: Esporte de origem índia em que as duas equipes se perseguem, tocando ou capturando os jogadores adversários. @pt-br
definition: Sport d'équipe d'origine indienne à mi-chemin entre la lutte et le rugby @fr
definition: Desporto de origem indiana em que as duas equipas se perseguem, tocando ou capturando os jogadores adversários. @pt-pt
definition: The attacking side scores by touching, and the side to guard scores by capturing. The attacker continues calling it *kabaddi*. @en-gb
definition: 攻撃側はタッチすることで、防御側は捕まえることで得点する。攻撃側は「カバディ」と言い続ける @ja-jp
definition: Deporte de origen indio donde dos equipos se persiguen tocando o capturando los jugadores contrarios @es
definition: Gioco indiano. Due squadre devono segnare più punti possibili, toccando o bloccando i giocatori della squadra avversaria
note: nessuno
in scheme: Subject Code
created: 2004-04-22T12:00:00+00:00
modified: 2012-07-10T12:00:00+00:00
broader: Sport

sepak takraw
type: Concept
preferred label: Sepak Takraw
preferred label: sepaktakraw @pt-br
preferred label: セパタクロー @ja-jp
preferred label: Sepak takraw @fr
definition: Ein Spiel ähnlich dem Volleyball, bei dem man nicht unbedingt die Hände benutzen muss. Benutzt wird ein Rattanball. @de
definition: Sport similaire au volley-ball mais sans les mains @fr
definition: Gioco molto diffuso in Oriente simile alla pallavolo nel quale però non è permesso usare le mani.
definition: Juego parecido al voleíbol donde no se usa las manos y la pelota esta hecha de ratán. @es
definition: Jogo semelhante ao voleibol mas em que não se usam as mãos e a bola é feita de ratã ou de bambu. @pt-pt
definition: Jogo semelhante ao vôlei mas em que não se usam as mãos e a bola é feita de ratã ou de bambu. @pt-br
definition: The game like volleyball which must not use a hand. The ball made of rattan is used. (Programme of National Sports Festival in Japan) @en-gb
definition: 手を使ってはいけないバレーボールのような競技。籐製のボールが使用される(訳注：現在はプラスチック製のものを使用)(国民体育大会競技種目) @ja-jp
note: nessuno
in scheme: Subject Code
created: 2004-04-22T12:00:00+00:00
modified: 2012-07-10T12:00:00+00:00
broader: Sport

wushu
type: Concept
preferred label: Wushu
preferred label: 中国武術 @ja-jp
definition: Generally, Chinese traditional martial art. (Programme of National Sports Festival in Japan) @en-gb
definition: Art martial chinois traditionnel (art de la guerre) @fr
definition: 中国古来の武術の総称(国民体育大会競技種目) @ja-jp
definition: Arte marcial tradicional chinesa. @pt-pt
definition: Arte marcial tradicional de China @es
definition: Grundsätzliche chinesische traditionelle Kampfkunst. @de
definition: Arte marziale cinese
note: nessuno
in scheme: Subject Code
created: 2004-04-22T12:00:00+00:00
modified: 2012-07-10T12:00:00+00:00
broader: Sport

Freccette
type: Concept
preferred label: estatísticas (desporto) @pt-pt
preferred label: estatísticas (esporte) @pt-br
preferred label: Dart @de
preferred label: darts @en-gb
preferred label: ダーツ @ja-jp
definition: Os jogadores competem atirando dardos de metal a um alvo circular na parede, dividido em segmentos de várias cores. @pt-br
definition: Zwei Spieler werfen mit kleinen Pfeilen auf eine runde Scheibe, die in Segmente mit verschiedenen Zahlenwerten aufgeteilt ist. @de
definition: Two players compete by throwing metal darts at a wall-mounted circular board divided radially into segments of different scores @en-gb
definition: ２人の競技者が金属製の矢を壁に掛けられた円盤に投げる。円盤は放射状に区分され、得点が異なる。 @ja-jp
definition: Competizione fra due giocatori che lanciano dei dardi di metallo su un bersaglio, di forma circolare e diviso radialmente in vari segmenti corrispondenti ai punti, affisso ad un muro
note: nessuno
in scheme: Subject Code
created: 2006-08-21T12:00:00+00:00
modified: 2012-07-10T12:00:00+00:00
broader: Sport

Bodybuilding
type: Concept
preferred label: culturismo @pt-br
preferred label: bodybuilding @en-gb
preferred label: ボディービル @ja-jp
definition: Attività ginnica che stimola l'accrescimento delle masse muscolari, il cui risultato viene poi valutato in competizioni in cui i giudici si esprimono su sviluppo, simmetria, proporzioni, ecc.
definition: Modalidade em que os participantes exibem músculos muito desenvolvidos. @pt-pt
definition: Modellierung des Körpers durch gezielte Muskelübungen und Aufbau von Muskelmasse und der Definition ästhetischer Bewertung. @de
definition: 競技者は隆々たる筋肉を示し、全体としての美的効果を競う @ja-jp
definition: A person displays pronounced muscle tone and exaggerated muscle mass and definition for overall aesthetic effect @en-gb
note: nessuno
in scheme: Subject Code
created: 2006-08-21T12:00:00+00:00
modified: 2012-07-10T12:00:00+00:00
broader: Sport
broad match: http://cv.iptc.org/newscodes/mediatopic/20000822

futsal
type: Concept
preferred label: sports disciplinary action @en-gb
preferred label: Disziplinarmaßnahme im Sport @de
definition: Ações, incluindo multas e suspensões, atribuídas por equipas e organizações esportivas. @pt-br
definition: Sanktionen, einschließlich Geldstrafen und Suspendierungen, erhoben von Sportorganisationen und Sportmannschaften. @de
definition: Ações, incluindo multas e suspensões, atribuídas por equipas e organizações desportivas. @pt-pt
definition: Actions, including fines and suspensions levied by sports organisations and teams @en-gb
in scheme: Subject Code
created: 2007-08-28T12:00:00+00:00
modified: 2012-07-10T12:00:00+00:00
broader: Sport

Sportlerehrungen
type: Concept
preferred label: sports awards @en-gb
preferred label: prêmios esportivos @pt-br
preferred label: prémios desportivos @pt-pt
definition: Preise und Auszeichnungen die durch Sportorganisationen vergeben oder durch Sportler gewonnen werden. @de
definition: Awards and honors given by sports organisations or won by sports figures @en-gb
definition: Prémios e honras atribuídos por organizações desportivas. @pt-pt
definition: Prémios e honras atribuídos por organizações esportivas. @pt-br
in scheme: Subject Code
created: 2007-08-28T12:00:00+00:00
modified: 2012-07-10T12:00:00+00:00
broader: Sport
broad match: http://cv.iptc.org/newscodes/mediatopic/15000000

Paracadutismo
type: Concept
preferred label: Parachutisme @fr
preferred label: paraquedismo @pt-pt
preferred label: Fallschirmspringen @de
preferred label: parachuting @en-gb
preferred label: paracaidismo @es
preferred label: パラシューティング @ja-jp
definition: Epreuves de saut en parachute : précision d'atterrissage, voltige et vol relatif en individuel ou par équipe @fr
definition: Competições de paraquedismo: aterragens de precisão, volteio, individual ou por equipas. @pt-pt
definition: Fallschirmsprung Wettbewerbe: Punktlandungen, Spannweite, Einzel und im Team. @de
definition: パラシューティング競技:個人や団体による正確な着地、曲芸 @ja-jp
definition: Gare di paracadutismo: atterraggi precisi, volteggi, individuali e di squadra
definition: Parachuting competitions: precision landings, voltige, individual and team @en-gb
definition: Competiciones de paracaidismo (aterrizajes de precisión, volteretas o vórtice, individual o por equipos). @es
note: nessuno
in scheme: Subject Code
created: 2000-10-30T12:00:00+00:00
modified: 2010-12-15T17:01:09+00:00
broader: Sport Aviatori

Paracadutismo sportivo
type: Concept
preferred label: sky diving @en-gb
preferred label: salto em queda livre @pt-pt
preferred label: Sky Diving @de
preferred label: salto en caída libre @es
preferred label: Chute libre @fr
preferred label: スカイダイビング @ja-jp
definition: Parachuting competitions involving sky-diving @en-gb
definition: Competições de paraquedismo envolvendo salto em queda livre. @pt-br
definition: Epreuve de saut en parachute en chute libre @fr
definition: スカイダイビングを使ったパラシューティング競技 @ja-jp
definition: Competiciones de paracaidismo que involucran caída libre (salto desde una aeronave con movimientos durante la caída). @es
definition: Gare di paracadutismo sportivo in caduta libera
definition: Fallschirmsprung Wettbewerbe inklusive Sky Diving. @de
note: nessuno
in scheme: Subject Code
created: 2000-10-30T12:00:00+00:00
modified: 2010-12-15T17:01:09+00:00
broader: Sport Aviatori

Libera
type: Concept
preferred label: descenso en esquí (colina abajo) @es
preferred label: Abfahrtslauf @de
preferred label: downhill @pt-pt
preferred label: 滑降 @ja-jp
preferred label: Descente @fr
definition: Abfahrtslauf in Höchstgeschwindigkeit auf einer steilen Piste mit verteilten Kurven aber ohne Tore. Der/Die Schnellste gewinnt. @de
definition: Skiing at top speed down a steep slope with interspersed turns but no gates. The fastest wins. @en-gb
definition: Discesa alla massima velocità lungo un ripido pendio con varie curve sparse ma senza porte.
definition: Esquiar a máxima velocidad bajando en vueltas rápidas y ángulos cerrados, con curvas interpuestas, pero sin obstáculos. @es
definition: Esquiar a velocidade máxima por descida muito acentuada, com voltas rápidas e curvas acentuadas. Ganha o participante mais rápido. @pt-br
definition: course de vitesse sur un dénivelé important qui utilise au maximum le profil du terrain @fr
definition: 旗門のない急斜面を全速力で滑り降りるスキー競技。最速タイムを競う @ja-jp
note: nessuno
in scheme: Subject Code
created: 2000-10-30T12:00:00+00:00
modified: 2010-12-15T17:01:09+00:00
broader: Sci alpino
broad match: http://cv.iptc.org/newscodes/mediatopic/20001057

Gigante
type: Concept
preferred label: Slalom Géant @fr
preferred label: giant slalom @pt-pt
preferred label: slalom gigante. @es
preferred label: 大回転 @ja-jp
preferred label: Riesenslalom @de
definition: 斜面を滑り降りるスキー競技で、スーパー大回転よりも多くのターンと屈曲がある。最速タイムを競う @ja-jp
definition: Skiing down a slope, but with more turns and bends than in super-G skiing. The fastest wins. @en-gb
definition: Esquiar colina abaixo, mas com mais voltas e curvas do que na modalidade super G. Ganha o participante mais rápido. @pt-br
definition: Discesa con molte più curve e inclinazioni rispetto al Super g.
definition: Descenso de colina en esquí, pero sorteando más obstáculos y curvas que en el Super-G. El más veloz gana. @es
definition: Abfahrtslauf auf einer Piste, aber mit mehr Kurven und Drehungen als im Super G. Der/Die Schnellste gewinnt. @de
definition: course de vitesse nécessitant d'enchaîner des courbes d'un rayon moyen sur un tracé très mouvementé et balisé par des piquets @fr
note: nessuno
note: typo fixed in Explanation @en-gb
in scheme: Subject Code
created: 2000-10-30T12:00:00+00:00
modified: 2010-12-15T17:01:09+00:00
broader: Sci alpino
broad match: http://cv.iptc.org/newscodes/mediatopic/20001057

Super g
type: Concept
preferred label: Super-G @fr
preferred label: super G @en-gb
preferred label: スーパー大回転 @ja-jp
preferred label: Super G @de
preferred label: super g @es
definition: course qui combine la vitesse de la descente et le tracé du slalom géant @fr
definition: Skiing down a steep slope, but with more turns and bends than in the downhill. The fastest wins. @en-gb
definition: Discesa caratterizzata dalla velocità della Libera ed il tracciato del Gigante
definition: Esquiar colina abaixo, mas com mais voltas e curvas do que na modalidade downhill. Ganha o participante mais rápido. @pt-br
definition: 急斜面を滑り降りるスキー競技で、滑降より多くのターンと屈曲がある。最速タイムを競う @ja-jp
definition: Abfahrtslauf eine steile Piste hinunter, aber mit mehr Kurven und Drehungen als im Abfahrtslauf. Der/Die Schnellste gewinnt. @de
definition: Esquiar en vueltas, con más giros y curvas que el esquí colina abajo. El más rápido gana. @es
note: nessuno
in scheme: Subject Code
created: 2000-10-30T12:00:00+00:00
modified: 2010-12-15T17:01:09+00:00
broader: Sci alpino
broad match: http://cv.iptc.org/newscodes/mediatopic/20001057

slalom
type: Concept
preferred label: Slalom
preferred label: 回転 @ja-jp
definition: 通過する旗門の間隔が短く、小さめのターンを連続して行うスキー競技。２回の合計タイムで競う @ja-jp
definition: Skiers must zig-zag their way down a slope with closely positioned gates which they must negotiate. It is run over two legs with the combined fastest winning. @en-gb
definition: Os esquiadores devem descer a colina ziguezagueando através de pórticos colocados muito próximos uns dos outros. @pt-pt
definition: Skifahrer muss zick-zack die Piste herunterfahren mit eng gesteckten Toren, die er passieren muss. Wird über zwei Etappen gewertet, deren schnellste Kombination gewinnt. @de
definition: course qui impose aux skieurs de zigzaguer entre une soixantaine de piquets sans en oublier @fr
definition: Los esquiadores deben zigzaguear en su camino cuesta abajo y con el mejor registro posible, atravesando marcas delineadas por unos 60 banderines. @es
definition: Discesa a zig-zag passando attraverso porte ravvicinate.
note: nessuno
in scheme: Subject Code
created: 2000-10-30T12:00:00+00:00
modified: 2010-12-15T17:01:09+00:00
broader: Sci alpino
broad match: http://cv.iptc.org/newscodes/mediatopic/20001057

Combinata
type: Concept
preferred label: Kombination @de
preferred label: combinado @es
preferred label: Combiné @fr
preferred label: 複合 @ja-jp
preferred label: combined @en-gb
definition: Race, usually competed over two days that combines a downhill leg and a slalom leg rewarding the most complete skiers. Combined fastest time wins. @en-gb
definition: Rennen, in der Regel über zwei Tage, bei dem eine Abfahrtslaufetappe und eine Slalometappe kombiniert wird. Gewertet wird der perfekteste Skifahrer und die kombinierte schnellste Zeit gewinnt. @de
definition: 通常、滑降と回転の組み合わせで2日以上かけて競技を行い、最も完成されたスキーヤーとしての価値がある。組み合わせの合計タイムで競う @ja-jp
definition: Corrida, geralmente disputada durante dois dias, que combina uma prova de downhill e outra de slalom, premiando os esquiadores com os tempos combinados mais rápidos. @pt-br
definition: Carrera disputada en dos mangas, que combina una prueba de descenso y otra de slalom, premiando a los esquiadores más completos y rápidos. @es
definition: Gara in cui vengono associati i risultati di una libera e quelli di uno slalom
definition: course qui associe les résultats d'une descente et d'un slalom @fr
note: nessuno
in scheme: Subject Code
created: 2000-10-30T12:00:00+00:00
modified: 2010-12-15T17:01:09+00:00
broader: Sci alpino
broad match: http://cv.iptc.org/newscodes/mediatopic/20001057

National Football League (USA)
type: Concept
preferred label: ＮＦＬ @ja-jp
preferred label: liga nacional de fútbol americano (nfl). @es
preferred label: liga nacional de futebol americano @pt-pt
preferred label: NFL @de
preferred label: National Football League @fr
preferred label: (US) National Football League (NFL) (North American) @en-gb
definition: プロアメリカンフットボールチーム協会 @ja-jp
definition: The association of professional American football teams @en-gb
definition: Asociación de equipos estadounidenses, de fútbol americano profesional. @es
definition: association américaine de football professionnel (football américain) @fr
definition: Associação de equipes profissionais de futebol americano. @pt-br
definition: L'associazione americana del football professionale
definition: Associação de equipas profissionais de futebol americano. @pt-pt
definition: Die Vereinigung der Professionellen Teams des American Football. @de
note: nessuno
in scheme: Subject Code
created: 2000-10-30T12:00:00+00:00
modified: 2010-12-15T17:01:09+00:00
broader: Football americano
broad match: http://cv.iptc.org/newscodes/mediatopic/20000823

Entry deleted
type: Concept
preferred label: entry deleted @fr
preferred label: liga canadiana de futebol @pt-pt
preferred label: liga canadense de futebol @pt-br
preferred label: entrada borrada @es
preferred label: CFL @en-gb
preferred label: Kandadische Football Liga CFL @de
definition: 0 @es
definition: Entry deleted
definition: A Liga Canadense de Futebol (CFL ou LCF) é uma liga profissional, localizada no Canadá, que joga futebol canadense. @pt-br
definition: A Liga Canadiana de Futebol (CFL ou LCF) é uma liga profissional, localizada no Canadá, que joga futebol canadiano. @pt-pt
definition: Kandadische Football Liga CFL, auch bekannt als Ligue Canadienne de Football (LCF), ist eine Profi-Liga die ausschließlich in Kanada beheimatet ist und Canadian Football spielt. @de
definition: The Canadian Football League (CFL), also known as Ligue Canadienne de Football (LCF), is a professional league located entirely in Canada that plays Canadian football. @en-gb
note: re-added, with corresponding explanation @en-gb
note: nessuno
in scheme: Subject Code
created: 2000-10-30T12:00:00+00:00
modified: 2010-12-15T17:01:09+00:00
broader: Football americano
broad match: http://cv.iptc.org/newscodes/mediatopic/20000876

afl
type: Concept
preferred label: AFL-INATIVO @pt-pt
preferred label: AFL
preferred label: AFL-DEPRECATED @en-gb
preferred label: AFL-GELÖSCHT @de
preferred label: フットボール連盟 @ja-jp
definition: INATIVO-A Liga Americana de Futebol (AFL) foi uma liga de futebol americano que funcionou entre 1960 e 1969. Em 1970, a AFL foi fundida com a Liga Nacional de Futebol. @pt-pt
definition: Antigua denominación de la Liga canadiense de fútbol. El uso de este código debe limitarse a material de archivo. @es
definition: Lega canadese di football canadese (solo per materiale d'archivio)
definition: The American Football League (AFL) was a professional league of American football that operated from 1960 to 1969. In 1970, the AFL merged with the National Football League. @en-gb
definition: ligue de football américain au Canada (a fusionné en 1967 avec la NFL) @fr
definition: このカナダのフットボールリーグは現存せず、このタグの使用は記録文書の資料に限定されるべきである @ja-jp
definition: --- @de
note: nessuno
note: explanation fixed - and code deprecated @en-gb
in scheme: Subject Code
created: 2000-10-30T12:00:00+00:00
retired: 2007-08-28T00:00:00+00:00
modified: 2010-12-15T17:01:09+00:00
broader: Football americano
broad match: http://cv.iptc.org/newscodes/mediatopic/20000823

FITA/Tiro con l'arco con bersagli all'aperto
type: Concept
preferred label: FITA @de
preferred label: 国際アーチェリー連盟 @ja-jp
preferred label: fita/tiro al arco en exteriores @es
preferred label: FITA / federação internacional de tiro com arco @pt-br
preferred label: Style FITA @fr
preferred label: FITA / Outdoor target archery @en-gb
definition: Competição realizada ao ar livre, em campo aberto e plano, a várias distâncias. A competição de tiro dos Jogos Olímpicos faz parte do programa de tiro ao ar livre da Federação Internacional de Tiro com Arco (FITA). @pt-br
definition: Wettbewerb im Freien auf einem ebenen Feld mit unterschiedlichen Distanzen (zu den Zielscheiben). Als olympischer Wettbewerb zählt das Bogenschießen zu dem von der FITA veranstalteten Freiluftprogramm auf Zielscheiben. @de
definition: 競技は屋外において、見通しの良い(平らな)競技場の上で、種々の固定距離で行われる。オリンピック大会でのアーチェリー競技は、FITAの屋外ターゲット･アーチェリー･プログラムの一部 @ja-jp
definition: Competizione all'aperto secondo le regole della Federazione internazionale di tiro con l'arco (FITA)
definition: The competition is held outdoors on an open (flat) field, at various fixed distances. The archery competition in the Olympic Games is a part of the FITA outdoor target archery program. @en-gb
definition: Competición que se lleva a cabo en exteriores bajo normas de la Federación Internacional de Arquería, en una construcción abierta o un campo, sobre varias distancias y en series eliminatorias. @es
definition: compétitions suivant les règles de la Fédération Internationale de Tir à l'Arc qui consistent en une série d'éliminatoires puis des finales @fr
note: nessuno
in scheme: Subject Code
created: 2000-10-30T12:00:00+00:00
modified: 2010-12-15T17:01:09+00:00
broader: Tiro con l'arco
broad match: http://cv.iptc.org/newscodes/mediatopic/20000824

Balestra
type: Concept
preferred label: Tir à l'arbalète @fr
preferred label: tiro com besta @pt-br
preferred label: クロスボウ @ja-jp
preferred label: Armbrustschießen @de
preferred label: crossbow shooting @en-gb
preferred label: tiro con ballesta @es
definition: Tiro con la balestra verso bersagli situati a diverse distanze
definition: Tiro com besta contra alvos colocados a várias distâncias. @pt-br
definition: Disparar una ballesta contra objetivos desde diferentes puntos. @es
definition: 違った距離から的へクロスボウ(石弓)を放つこと @ja-jp
definition: Schießen mit der Armbrust auf Zielscheiben in unterschiedlichen Distanzen. @de
definition: Shooting with crossbow on targets from different distances @en-gb
definition: Tirer sur une cible avec une arbalète à des distances différentes. @fr
note: nessuno
in scheme: Subject Code
created: 2003-11-26T12:00:00+00:00
modified: 2012-07-10T12:00:00+00:00
broader: Tiro con l'arco

100 m
type: Concept
preferred label: 100m @fr
preferred label: １００ｍ @ja-jp
definition: Correr uma distância de 100 metros. Ganha o tempo mais rápido. @pt-pt
definition: Running over a distance of 100 metres with the fastest time winning @en-gb
definition: Competición que consiste en correr una distancia de 100m. Gana el mejor tiempo. @es
definition: Corsa nella distanza di 100 metri con il miglior tempo
definition: compétition qui consiste à courir 100 m dans le meilleur temps @fr
definition: Laufen über eine Distanz von 100 Metern, wobei die Bestzeit gewinnt. @de
definition: 100m競走 @ja-jp
note: nessuno
in scheme: Subject Code
created: 2000-10-30T12:00:00+00:00
modified: 2010-12-15T17:01:09+00:00
broader: Atletica leggera
broad match: http://cv.iptc.org/newscodes/mediatopic/20000844

200 m
type: Concept
preferred label: 200m @fr
preferred label: ２００ｍ @ja-jp
definition: Competición que consiste en correr una distancia de 200m en el mejor tiempo. @es
definition: compétition qui consiste à courir 200 m dans le meilleur temps @fr
definition: Corsa nella distanza di 200 metri con il miglior tempo
definition: Correr uma distância de 200 metros. Ganha o tempo mais rápido. @pt-pt
definition: Laufen über eine Distanz von 200 Metern, wobei die Bestzeit gewinnt. @de
definition: 200m競走 @ja-jp
definition: Running over a distance of 200 metres with the fastest time winning @en-gb
note: nessuno
in scheme: Subject Code
created: 2000-10-30T12:00:00+00:00
modified: 2010-12-15T17:01:09+00:00
broader: Atletica leggera
broad match: http://cv.iptc.org/newscodes/mediatopic/20000844

400 m
type: Concept
preferred label: ４００ｍ @ja-jp
preferred label: 400m @fr
definition: Corsa nella distanza di 400 metri con il miglior tempo
definition: Correr uma distância de 400 metros. Ganha o tempo mais rápido. @pt-pt
definition: Running over a distance of 400 metres with the fastest time winning @en-gb
definition: Laufen über eine Distanz von 400 Metern, wobei die Bestzeit gewinnt. @de
definition: 400m競走 @ja-jp
definition: Competición que consiste en correr una distancia de 400m en el mejor tiempo. @es
definition: compétition qui consiste à parcourir un tour de piste (400 m) dans le meilleur temps @fr
note: nessuno
in scheme: Subject Code
created: 2000-10-30T12:00:00+00:00
modified: 2010-12-15T17:01:09+00:00
broader: Atletica leggera
broad match: http://cv.iptc.org/newscodes/mediatopic/20000844

800 m
type: Concept
preferred label: 800m @fr
preferred label: ８００ｍ @ja-jp
definition: Correr uma distância de 800 metros. Ganha o tempo mais rápido. @pt-pt
definition: Running over a distance of 800 metres with the fastest time winning @en-gb
definition: Corsa nella distanza di 800 metri con il miglior tempo
definition: Competición que consiste en correr una distancia de 800m en el mejor tiempo. @es
definition: compétition qui consiste à parcourir deux tours de piste (800 m) dans le meilleur temps @fr
definition: Laufen über eine Distanz von 800 Metern, wobei die Bestzeit gewinnt. @de
definition: 800m競走 @ja-jp
note: nessuno
in scheme: Subject Code
created: 2000-10-30T12:00:00+00:00
modified: 2010-12-15T17:01:09+00:00
broader: Atletica leggera
broad match: http://cv.iptc.org/newscodes/mediatopic/20000838

1000 m
type: Concept
preferred label: 1000m @fr
preferred label: １０００ｍ @ja-jp
definition: Laufen über eine Distanz von 1000 Metern, wobei die Bestzeit gewinnt. @de
definition: 1,000m競走 @ja-jp
definition: Running over a distance of 1000 metres with the fastest time winning @en-gb
definition: Correr uma distância de 1000 metros. Ganha o tempo mais rápido. @pt-pt
definition: Competición que consiste en correr una distancia de 1000m en el mejor tiempo. @es
definition: compétition qui consiste à couvrir 1000 m en un temps minimum. @fr
definition: Corsa nella distanza di 1000 metri con il miglior tempo
note: nessuno
in scheme: Subject Code
created: 2000-10-30T12:00:00+00:00
modified: 2010-12-15T17:01:09+00:00
broader: Atletica leggera
broad match: http://cv.iptc.org/newscodes/mediatopic/20000838

1500 m
type: Concept
preferred label: 1500m @fr
preferred label: １５００ｍ @ja-jp
definition: Running over a distance of 1000 metres with the fastest time winning @en-gb
definition: Competición que consiste en correr una distancia de 1500m en el mejor tiempo. @es
definition: compétition qui consiste à couvrir 1500 m en un temps minimum. @fr
definition: Corsa nella distanza di 1500 metri con il miglior tempo
definition: Laufen über eine Distanz von 1500 Metern, wobei die Bestzeit gewinnt. @de
definition: Correr uma distância de 1500 metros. Ganha o tempo mais rápido. @pt-pt
definition: 1,500m競走 @ja-jp
note: nessuno
in scheme: Subject Code
created: 2000-10-30T12:00:00+00:00
modified: 2010-12-15T17:01:09+00:00
broader: Atletica leggera
broad match: http://cv.iptc.org/newscodes/mediatopic/20000838

Miglio
type: Concept
preferred label: milha @pt-br
preferred label: mile @en-gb
preferred label: １マイル @ja-jp
preferred label: Mile @fr
preferred label: milla @es
preferred label: Meile @de
definition: 1マイル競走 @ja-jp
definition: Competición que consiste en cubrir una milla en el mejor tiempo. @es
definition: Running over a distance of one mile with the fastest time winning @en-gb
definition: Correr uma distância de uma milha (1.609 m). Ganha o tempo mais rápido. @pt-pt
definition: compétition qui consiste à couvrir un mile en un temps minimum. @fr
definition: Corsa nella distanza del miglio con il miglior tempo
definition: Laufen über eine Distanz von 1 Meile, wobei die Bestzeit gewinnt. @de
note: nessuno
note: typo fixed in Explanation @en-gb
in scheme: Subject Code
created: 2000-10-30T12:00:00+00:00
modified: 2010-12-15T17:01:09+00:00
broader: Atletica leggera
broad match: http://cv.iptc.org/newscodes/mediatopic/20000836

2000 m
type: Concept
preferred label: ２０００ｍ @ja-jp
preferred label: 2000m @fr
definition: Laufen über eine Distanz von 2000 Metern, wobei die Bestzeit gewinnt. @de
definition: Corsa nella distanza di 2000 metri con il miglior tempo
definition: Correr uma distância de 2000 metros. Ganha o tempo mais rápido. @pt-pt
definition: Competición que consiste en correr una distancia de 2000m en el mejor tiempo. @es
definition: Running over a distance of 2000 metres with the fastest time winning @en-gb
definition: compétition qui consiste à couvrir 2000 m en un temps minimum. @fr
definition: 2,000m競走 @ja-jp
note: nessuno
in scheme: Subject Code
created: 2000-10-30T12:00:00+00:00
modified: 2010-12-15T17:01:09+00:00
broader: Atletica leggera
broad match: http://cv.iptc.org/newscodes/mediatopic/20000836

3000 m
type: Concept
preferred label: 3000m @fr
preferred label: ３０００ｍ @ja-jp
definition: Corsa nella distanza di 3000 metri con il miglior tempo
definition: 3,000m競走 @ja-jp
definition: Competición que consiste en correr una distancia de 3000m en el mejor tiempo. @es
definition: compétition qui consiste à couvrir 3000 m en un temps minimum. @fr
definition: Correr uma distância de 3000 metros. Ganha o tempo mais rápido. @pt-br
definition: Running over a distance of 3000 metres with the fastest time winning @en-gb
definition: Laufen über eine Distanz von 3000 Metern, wobei die Bestzeit gewinnt. @de
note: nessuno
in scheme: Subject Code
created: 2000-10-30T12:00:00+00:00
modified: 2010-12-15T17:01:09+00:00
broader: Atletica leggera
broad match: http://cv.iptc.org/newscodes/mediatopic/20000836

5000 m
type: Concept
preferred label: ５０００ｍ @ja-jp
preferred label: 5000m @fr
definition: Correr uma distância de 5000 metros. Ganha o tempo mais rápido. @pt-br
definition: compétition qui consiste à couvrir 5000 m en un temps minimum. @fr
definition: Competición que consiste en correr una distancia de 5000m en el mejor tiempo. @es
definition: Laufen über eine Distanz von 5000 Metern, wobei die Bestzeit gewinnt. @de
definition: Corsa nella distanza di 5000 metri con il miglior tempo
definition: 5,000m競走 @ja-jp
definition: Running over a distance of 5000 metres with the fastest time winning @en-gb
note: nessuno
in scheme: Subject Code
created: 2000-10-30T12:00:00+00:00
modified: 2010-12-15T17:01:09+00:00
broader: Atletica leggera
broad match: http://cv.iptc.org/newscodes/mediatopic/20000836

10.000 m
type: Concept
preferred label: 10000m @fr
preferred label: １００００ｍ @ja-jp
preferred label: 10 km @de
preferred label: 10,000 m @en-gb
definition: Correr uma distância de 10000 metros. Ganha o tempo mais rápido. @pt-br
definition: Corsa nella distanza di 10000 metri con il miglior tempo
definition: Running over a distance of 10,000 metres with the fastest time winning @en-gb
definition: 10,000m競走 @ja-jp
definition: Competición que consiste en correr una distancia de 10.000m en el mejor tiempo. @es
definition: Laufen über eine Distanz von 10000 Metern, wobei die Bestzeit gewinnt. @de
definition: compétition qui consiste à couvrir 10 000 m en un temps minimum. @fr
note: nessuno
in scheme: Subject Code
created: 2000-10-30T12:00:00+00:00
modified: 2010-12-15T17:01:09+00:00
broader: Atletica leggera
broad match: http://cv.iptc.org/newscodes/mediatopic/20000836

20 km
type: Concept
preferred label: 20km @de
preferred label: ２０ｋｍ競歩 @ja-jp
definition: Caminhar uma distância de 20 km em estradas públicas. Ganha o tempo mais rápido. @pt-br
definition: Laufen über eine Distanz von 20 km auf öffentlichen Straßen, wobei die Bestzeit gewinnt. @de
definition: Prueba de fondo en la que se camina sobre una distancia de 20km a través de caminos públicos, resultando vencedor el que obtenga el menor tiempo. @es
definition: épreuve de fond qui se déroule sur la voie publique sur 20 km. @fr
definition: Walking over a distance of 20 km on public roads with the fastest time winning @en-gb
definition: 公道を20kmの距離にわたって歩き、最速タイムを競う @ja-jp
definition: Competizione di corsa nella distanza di 20 Km su strada con il miglior tempo
note: nessuno
in scheme: Subject Code
created: 2000-10-30T12:00:00+00:00
modified: 2010-12-15T17:01:09+00:00
broader: Atletica leggera
broad match: http://cv.iptc.org/newscodes/mediatopic/20000841

1 ora
type: Concept
preferred label: １時間競歩 @ja-jp
preferred label: one hour @en-gb
preferred label: 1 Stunde @de
preferred label: una hora @es
preferred label: uma hora @pt-pt
preferred label: L'heure @fr
definition: Walking as far as possible in the time of one hour @en-gb
definition: 1時間内にできるだけ遠くに歩くこと @ja-jp
definition: Caminhar a maior distância possível no período de uma hora. @pt-pt
definition: Competizione che consiste nel coprire la massima distanza possibile nell'arco di un'ora
definition: Laufen so schnell wie möglich in 1 Stunde. @de
definition: épreuve de marche qui consiste à couvrir une distance maximale en une heure @fr
definition: Caminata que consiste en cubrir la mayor distancia posible en el lapso de una hora. @es
note: nessuno
in scheme: Subject Code
created: 2000-10-30T12:00:00+00:00
modified: 2010-12-15T17:01:09+00:00
broader: Atletica leggera
broad match: http://cv.iptc.org/newscodes/mediatopic/20000841

25.000
type: Concept
preferred label: 25000 @pt-br
preferred label: 25km @de
preferred label: 25 km @es
preferred label: ２５ｋｍ競歩 @ja-jp
definition: épreuve de marche qui consiste à couvrir une distance de 25km @fr
definition: 25kmの距離を歩き、最速タイムを競う @ja-jp
definition: Caminhar uma distância de 25 km. Ganha o tempo mais rápido. @pt-pt
definition: Walking over a distance of 25km with the fastest time winning @en-gb
definition: Laufen über eine Distanz von 25 km, wobei die Bestzeit gewinnt. @de
definition: Competizione nella distanza di 25 Km con il miglior tempo
definition: Caminar una distancia de 25km en el mejor tiempo. @es
note: nessuno
in scheme: Subject Code
created: 2000-10-30T12:00:00+00:00
modified: 2010-12-15T17:01:09+00:00
broader: Atletica leggera
broad match: http://cv.iptc.org/newscodes/mediatopic/20000841

30.000
type: Concept
preferred label: 30km @fr
preferred label: ３０ｋｍ競歩 @ja-jp
preferred label: 30000 @en-gb
preferred label: 30 km @de
definition: 30kmの距離を歩き、最速タイムを競う @ja-jp
definition: Caminhar uma distância de 30 km. Ganha o tempo mais rápido. @pt-br
definition: épreuve de marche qui consiste à couvrir une distance de 30 km @fr
definition: Competizione nella distanza di 30 Km con il miglior tempo
definition: Caminar una distancia de 30km en el mejor tiempo. @es
definition: Walking over a distance of 30kms with the fastest time winning @en-gb
definition: Laufen über eine Distanz von 30 km, wobei die Bestzeit gewinnt. @de
note: nessuno
in scheme: Subject Code
created: 2000-10-30T12:00:00+00:00
modified: 2010-12-15T17:01:09+00:00
broader: Atletica leggera
broad match: http://cv.iptc.org/newscodes/mediatopic/20000841

110 ostacoli
type: Concept
preferred label: 110m vallas @es
preferred label: 110 m hurdles @en-gb
preferred label: １１０ｍ障害 @ja-jp
preferred label: 110mhaies @fr
preferred label: 110 m barreiras @pt-pt
preferred label: 110 m Hürdenlauf @de
definition: course de vitesse sur 110 m parsemés de 10 haies @fr
definition: Corsa nella distanza di 110 metri da percorrere saltando 10 ostacoli collocati sulla pista con il miglior tempo
definition: Competição que consiste em correr uma distância de 110 metros saltando 10 barreiras colocadas ao longo da pista. @pt-br
definition: Rennen über 110 Meter so schnell wie möglich, wobei 10 Hürden auf der Strecke übersprungen werden müssen. @de
definition: Carrera de velocidad que consiste en cubrir 110 metros saltando diez vallas a lo largo del camino. @es
definition: Race consisting of covering 110 metres as fast as possible while jumping over 10 hurdles placed on the track @en-gb
definition: トラック上の10のハードルをとび越え、できるだけ速く110mを走るレース @ja-jp
note: nessuno
in scheme: Subject Code
created: 2000-10-30T12:00:00+00:00
modified: 2010-12-15T17:01:09+00:00
broader: Atletica leggera
broad match: http://cv.iptc.org/newscodes/mediatopic/20000834

400 ostacoli
type: Concept
preferred label: 400m vallas @es
preferred label: 400 m barreiras @pt-br
preferred label: ４００ｍ障害 @ja-jp
preferred label: 400 m hurdles @en-gb
preferred label: 400 m Hürdenlauf @de
preferred label: 400mhaies @fr
definition: Rennen über 400 Meter so schnell wie möglich, wobei 10 Hürden auf der Strecke übersprungen werden müssen. @de
definition: Corsa nella distanza di 400 metri da percorrere saltando 10 ostacoli collocati sulla pista con il miglior tempo
definition: Carrera de velocidad que consiste en cubrir 400 metros saltando diez vallas a lo largo del camino. @es
definition: Competição que consiste em correr uma distância de 400 metros saltando 10 barreiras colocadas ao longo da pista. @pt-pt
definition: トラック上の10のハードルをとび超え、できるだけ速く400mを走るレース @ja-jp
definition: course de vitesse sur un tour de piste (400 m) parsemé de 10 haies @fr
definition: Race consisting of covering 400 metres as fast as possible while jumping over 10 hurdles placed on the track @en-gb
note: nessuno
in scheme: Subject Code
created: 2000-10-30T12:00:00+00:00
modified: 2010-12-15T17:01:09+00:00
broader: Atletica leggera
broad match: http://cv.iptc.org/newscodes/mediatopic/20000834

3000 siepi
type: Concept
preferred label: 3000m con obstáculos @es
preferred label: 3000 m steeplechase @en-gb
preferred label: 3000 m obstáculos @pt-pt
preferred label: ３０００ｍ障害 @ja-jp
preferred label: 3000m steeple @fr
preferred label: 3000 m Hindernislauf @de
definition: Competição que consiste em correr uma distância de 3000 metros saltando 28 barreiras e 7 obstáculos de água colocados ao longo da pista. @pt-br
definition: Corsa nella distanza di 3000 metri, saltando 28 ostacoli alti 91,4 centimetri e sette ostacoli d'acqua, con il miglior tempo
definition: Carrera de velocidad que consiste en cubrir 3000 metros, saltando 28 vallas de 91.4 cm de altura y 7 obstáculos de agua. @es
definition: Race consisting of covering 3000 metres as fast as possible while jumping over 28 hurdles which are 91/4 centimetres high and seven water obstacles @en-gb
definition: 91.4cmの高さをもつ28のハードルと7つの水障害をジャンプしながら、できる限り早く3000mに到達する競技 @ja-jp
definition: Rennen über 3000 Meter so schnell wie möglich, wobei 28 Hürden auf der Strecke übersprungen werden müssen, die 9ü Zentimeter hoch sind und 7 Wasserhindernisse. @de
definition: course d'obstacles sur piste de 3000 m. L'épreuve comporte le franchissement de 28 haies d'une hauteur 91,4 cm et 7 sauts de rivière (un bassin artificiel). @fr
note: nessuno
in scheme: Subject Code
created: 2000-10-30T12:00:00+00:00
modified: 2010-12-15T17:01:09+00:00
broader: Atletica leggera
broad match: http://cv.iptc.org/newscodes/mediatopic/20000827

Salto in alto
type: Concept
preferred label: salto alto (de altura) @es
preferred label: salto em altura @pt-pt
preferred label: Saut en hauteur @fr
preferred label: 走り高跳び @ja-jp
preferred label: Hochsprung @de
preferred label: high jump @en-gb
definition: compétition consistant à sauter par la force de son corps le plus haut possible au dessus d'une barre transversale. L'athlète est éliminé après trois essais manqués successifs, indépendamment de la hauteur. @fr
definition: Competitors jump as high as possible over a bar which is raised each time they clear the height. The highest clearance wins. @en-gb
definition: Competizione che consiste nel superare con un salto una barra orizzontale, la cui altezza viene aumentata ogni volta che viene superata senza farla cadere. Vince chi salta più in alto
definition: 競技者は、その高さをクリアするごとに上げられるバーをできるだけ高く跳ぶ。最も高い(バー)をクリアした人が勝つ @ja-jp
definition: Prova em que os atletas saltam o mais alto possível sobre uma barra horizontal, que é subida a cada ronda de saltos. Ganha quem atingir a marca mais alta. @pt-br
definition: Prueba en la que el atleta debe saltar lo más alto posible sobre una barra transversal, la cual es elevada cada vez que la misma es sorteada sin derribarla. Consiste de tres intentos y se toma la marca más alta. @es
definition: Wettkämpfer springen so hoch wie möglich über eine Latte, die höher gehängt wird, wenn eine Höhe erreicht ist. Die höchste Höhe gewinnt. @de
note: nessuno
in scheme: Subject Code
created: 2000-10-30T12:00:00+00:00
modified: 2010-12-15T17:01:09+00:00
broader: Atletica leggera

Salto con l'asta
type: Concept
preferred label: Stabhochsprung @de
preferred label: pole vault @en-gb
preferred label: 棒高跳び @ja-jp
preferred label: salto com vara @pt-br
preferred label: Saut à la perche @fr
preferred label: salto con garrocha (pértiga) @es
preferred label: salto à vara @pt-pt
definition: Prova em que os atletas usam uma vara flexível para se projetarem com os pés para o ar e transpor uma barra horizontal que é subida a cada ronda de saltos. Ganha quem atingir a marca mais alta. @pt-br
definition: 競技者は、各ラウンドごとに高くされていくバーを、しなやかな棒を使って脚から宙に投げ出して跳躍し、クリアする @ja-jp
definition: Competitors use a flexible pole to propel themselves feet-first into the air and clear a bar which is raised higher at each round of jumps. @en-gb
definition: Wettkämpfer benutzen einen flexiblen Stab, mit dem sie sich selbst in die Luft befördern und eine Latte überspringen, die in jeder Runde höher gehängt wird. @de
definition: Competizione nella quale gli atleti, con l'aiuto di una lunga asta flessibile, si danno uno slancio nell'aria, nel tentativo di superare in altezza una barra orizzontale senza farla cadere
definition: Prueba en la que el atleta salta con una garrocha o pértiga, para propulsarse a si mismo con los pies en el aire y así alcanzar una barra, la cual es elevada en cada serie de saltos. @es
definition: compétition consistant à sauter à l'aide d'une perche flexible le plus haut possible au dessus d'une barre transversale. L'athlète est éliminé après trois essais manqués successifs, indépendamment de la hauteur. @fr
note: nessuno
note: typo fixed in Explanation @en-gb
in scheme: Subject Code
created: 2000-10-30T12:00:00+00:00
modified: 2010-12-15T17:01:09+00:00
broader: Atletica leggera

Salto in lungo
type: Concept
preferred label: salto em distância @pt-br
preferred label: salto em comprimento @pt-pt
preferred label: Weitsprung @de
preferred label: 走り幅跳び @ja-jp
preferred label: long jump @en-gb
preferred label: Saut en longueur @fr
preferred label: salto largo (de longitud) @es
definition: Wettkämpfer beschleunigen über eine kurze Distanz ihre Geschwindigkeit und springen dann so weit wie möglich ab einem vorgegeben Punkt in eine Sandgrube. Der weiteste Sprung gewinnt. @de
definition: Prova em que os atletas fazem uma corrida curta para ganhar velocidade até um ponto determinado e depois se impulsionam saltando para a frente antes de cairem sobre uma caixa de areia. Ganha quem fizer o salto mais longo. @pt-pt
definition: Dopo aver acquistato velocità con un breve scatto, gli atleti saltano in avanti da un dato punto il più lontano possibile in una pista di sabbia. Il salto più lungo vince
definition: Competitors build up speed over a short sprint and them attempt to jump as far forward as they can from a given point into sand trap. The longest jump wins. @en-gb
definition: Prueba en la que el atleta debe saltar la mayor distancia posible, desde un punto determinado, cayendo dentro de una superficie de arena. @es
definition: épreuve qui consiste à sauter le plus loin possible à partir d'une planche d'appel. @fr
definition: 競技者は、短距離で疾走し、与えられたポイントから砂場(サンドトラップ)の中へできる限り遠くへジャンプすることを試みる。最も遠くへジャンプした人が勝つ @ja-jp
note: nessuno
in scheme: Subject Code
created: 2000-10-30T12:00:00+00:00
modified: 2010-12-15T17:01:09+00:00
broader: Atletica leggera

Salto Triplo
type: Concept
preferred label: Dreisprung @de
preferred label: triple jump @en-gb
preferred label: salto triplo @pt-br
preferred label: triplo salto @pt-pt
preferred label: 三段跳び @ja-jp
preferred label: Triple saut @fr
preferred label: salto triple @es
definition: 競技者は、短距離で疾走し、その時にホップ、ステップ(スキップ)、ジャンプという技法を用いてできる限り遠くへジャンプすることを試みる。最も遠くへジャンプした人が勝つ @ja-jp
definition: Wettkämpfer beschleunigen ihre Geschwindigkeit über eine kurze Distanz und versuchen dann so weit wie möglich zu springen, wobei sie einen Hop, einen Step und einen Jump benutzen. Der längste Sprung gewinnt. @de
definition: saut en longueur précédé de deux bonds. Le saut s'effectuera de telle sorte que le concurrent retombe d'abord sur le pied avec lequel il a pris son appel, puis au second saut, sur l'autre pied à partir duquel le 3ème saut est fait. @fr
definition: Prova em que os atletas fazem uma corrida curta para ganhar velocidade até um ponto determinado e depois se impulsionam encadeando três saltos sucessivos que terminam com uma queda sobre uma caixa de areia. Ganha quem fizer o salto mais longo. @pt-br
definition: Prueba en la que los competidores tratan de alcanzar la mayor velocidad en tres piques cortos, con diferente pierna cada uno y luego saltar lo más lejos que puedan mediante una técnica determinada. @es
definition: Competitors build up speed over a short sprint and then attempt to jump as far forward as they can using a hop, skip and a jump technique. The longest jump wins. @en-gb
definition: Come il salto in lungo, ma preceduto da due slanci prima dell'ultimo salto in avanti possibile in una pista di sabbia. Il salto più lungo vince
note: typo fixed in Explanation @en-gb
note: nessuno
in scheme: Subject Code
created: 2000-10-30T12:00:00+00:00
modified: 2010-12-15T17:01:09+00:00
broader: Atletica leggera

Lancio del peso
type: Concept
preferred label: Lancer du poids @fr
preferred label: 砲丸投げ @ja-jp
preferred label: lanzamiento de bala (de peso) @es
preferred label: arremesso de peso @pt-br
preferred label: lançamento do peso @pt-pt
preferred label: shot put @en-gb
preferred label: Kugelstoßen @de
definition: Prova em que os atletas, posicionados dentro de um círculo que mede 2.13 metros de diâmetro, tentam lançar o mais longe possível uma bola de metal que pesa 7,26 kg para os homens e 4 kg para as mulheres. Ganha quem fizer o lançamento mais longo. @pt-pt
definition: Competitors stand in a circle with a 2.13 metres diameter and attempt to throw a metal ball weighing 7.26 kg for men and 4kg for women as far as possible. The longest throw wins. @en-gb
definition: lancer le plus loin possible un poids de l'épaule d'une seule main en restant à l'intérieur d'une aire de 2,13 m de diamètre. Le poids pèse 7,26 kg pour les hommes et 4 kg pour les femmes. @fr
definition: Dall'interno di un cerchio di 2,13 m. di diametro l'atleta lancia il più lontano possibile una sfera di metallo del peso di 7,26 kg per gli uomini e 4 kg per le donne. Il lancio più lungo vince
definition: 競技者は、直径2.13mの円の中に立ち、男子は7.26kg、女子は4kgの重さの金属のボールをできるだけ遠くに投げることを試みる。最も遠くへ投げた人が勝つ @ja-jp
definition: Wettkämpfer stehen in einem Kreis mit 2.13 Meter Durchmesser und versuchen eine Metallkugel mit einem Gewicht von 7.26 kg für Männer und 4 kg für Frauen, so weit wie möglich zu werfen. Der längste Wurf gewinnt. @de
definition: Los competidores lanzan, desde dentro de un círculo que mide 2.13 metros de diámetro, una bola de metal que pesa 7,26 kilogramos para los hombres y 4 kilogramos para las mujeres, lo mas lejos posible. El lanzamiento mas lejano gana. @es
note: nessuno
in scheme: Subject Code
created: 2000-10-30T12:00:00+00:00
modified: 2010-12-15T17:01:09+00:00
broader: Atletica leggera

Lancio del disco
type: Concept
preferred label: discus throw @en-gb
preferred label: lançamento de disco @pt-br
preferred label: Diskuswerfen @de
preferred label: Lancer du disque @fr
preferred label: 円盤投げ @ja-jp
preferred label: lançamento do disco @pt-pt
preferred label: lanzamiento de disco @es
definition: Prova em que os atletas, dentro de um círculo com 2.50 metros de diâmetro, dão várias voltas antes de lançarem o mais longe possível um disco de metal que pesa 2 kg para os homens e 1 kg para as mulheres. Ganha quem fizer o lançamento mais longo. @pt-pt
definition: Competitors stand in a netted circle with a 2.50 metres diameter and with a turning motion attempt to throw a discus weighing 2kg for men and 1kg for women as far as possible. The longest throw wins. @en-gb
definition: lancer un disque le plus loin possible à partir d'une aire de lancer d'un diamètre de 2,50 m .Le cercle est ceint aux trois quarts d'une cage de protection mesurant au moins 4 m de hauteur. Le disque pèse 2 kg pour les hommes et 1 kg pour les femmes. @fr
definition: Wettkämpfer stehen in einem vernetzten Kreis mit 2.50 Meter Durchmesser und versuchen mit einer Drehbewegung einen Diskus mit 2 kg Gewicht bei Männern und 1 kg für Frauen so weit wie möglich zu werfen. Der längste Wurf gewinnt. @de
definition: Dall'interno di un cerchio di 2,50 m. di diametro cinto per tre quarti da una rete di protezione alta 4 m., con un movimento ruotante l'atleta lancia il più lontano possibile un disco di 2 kg per gli uomini e 1 kg per le donne. Il lancio più lungo vince
definition: 競技者は、網で囲まれた直径2.5mの円の中に立ち、回転しながら、男子は2kg、女子は1kgの円盤を遠くに投げることを試みる。最も遠くへ投げた人が勝つ @ja-jp
definition: Desde dentro de un círculo de 2.50 metros de diámetro, los atletas deben realizar una serie de movimientos en giro y lanzar un disco metálico que pesa 2 kg para los hombres y 1 kg para las mujeres. El tiro de mayor distancia gana. @es
note: nessuno
in scheme: Subject Code
created: 2000-10-30T12:00:00+00:00
modified: 2010-12-15T17:01:09+00:00
broader: Atletica leggera

Lancio del martello
type: Concept
preferred label: lançamento de martelo @pt-br
preferred label: ハンマー投げ @ja-jp
preferred label: Lancer de marteau @fr
preferred label: lanzamiento de martillo @es
preferred label: Hammerwerfen @de
preferred label: lançamento do martelo @pt-pt
preferred label: hammer throw @en-gb
definition: 競技者は、網に囲まれた直径2.13mの円から金属製のボール、鎖、ハンドルで構成されるハンマーをできるだけ遠くに投げる。ハンマーの重さは男子は7.26kg、女子は4kg @ja-jp
definition: Los competidores deben lanzar lo más lejos posible un martillo, que consiste en una bola metalica sujetada por una cadena con manija, desde un círculo marcado de 2,13 mts. de diámetro. El martillo pesa 7,26 kg para la rama masculina y 4,0 kg para mujeres. @es
definition: Dall'interno di un cerchio di 2,13 m. di diametro cinto da una rete di protezione per gli spettatori, l'atleta lancia un martello costituito da una sfera, una catena e un'impugnatura, tutte in metallo. Il martello pesa 7,26 kg per gli uomini e 4 kg per le donne
definition: Prova em que os atletas, dentro de um círculo com 2.13 metros de diâmetro, lançam o mais longe possível um martelo (bola de metal, com cabo e pega) que pesa 7.26 kg para os homens e 4 kg para as mulheres. Ganha quem fizer o lançamento mais longo. @pt-pt
definition: lancer un marteau (une tête métallique, un câble et une poignée) le plus loin possible à partir d'une aire de 2,13 m de diamètre entouré d'un filet destiné à protéger les spectateurs. Le marteau pèse 7,26 kg pour les hommes et 4 kg pour les femmes. @fr
definition: Competitors throw a hammer consisting of a metal ball, chain and handle as far as they can from a netted circle which is 2.13 metres in diameter. The hammer weighs 7.26 kg for men and 4 kg for women. @en-gb
definition: Wettkämpfer werfen einen Hammer aus einem vernetzten Kreis mit 2.13 Meter Durchmesser, der aus einer Metallkugel, einer Kette und einem Griff besteht, so weit sie können. Der Hammer wiegt 7.26 kg bei Männern und 4 kg bei Frauen. @de
note: nessuno
in scheme: Subject Code
created: 2000-10-30T12:00:00+00:00
modified: 2010-12-15T17:01:09+00:00
broader: Atletica leggera

Lancio del giavellotto
type: Concept
preferred label: Speerwerfen @de
preferred label: lançamento de dardo @pt-br
preferred label: javelin throw @en-gb
preferred label: Lancer de javelot @fr
preferred label: lanzamiento de jabalina @es
preferred label: やり投げ @ja-jp
preferred label: lançamento do dardo @pt-pt
definition: Wettkämpfer versuchen in einer speziell markierten Wurfzone einen Speer so weit zu werfen wie möglich. Der Speer wiegt 800 Gramm für Männer und 600 Gramm für Frauen. @de
definition: Prova em que os atletas, a partir de uma área de lançamento própria, arremessam o mais longe possível um dardo que pesa 800 gramas para os homens e 600 gramas para as mulheres. Ganha quem fizer o lançamento mais longo. @pt-br
definition: 特別に示されたスローイングエリアの中にいる競技者は、投げやりのような槍をできるだけ遠くに投げることを試みる。槍の重さは男子は800g、女子は600g @ja-jp
definition: lancer un javelot le plus loin possible à partir d'un couloir d'élan de 30 à 36,5 m de long et de 4 m de large. Le poids du javelot est de 800 gr pour les hommes et 600 gr pour les femmes. @fr
definition: Competitors in a specially-designated throwing area attempt to fling a spear-like javelin as far as possible. The javelin weighs 800 grammes for men and 600 grammes for women. @en-gb
definition: Los competidores, en un área especialmente diseñada, deben lanzar una jabalina lo mas lejos posible. El útil pesa 800 gramos en el caso de los hombres y 600 en el femenino. @es
definition: Gli atleti gettano il più lontano possibile un giavellotto da un'area appositamente designata. Il giavellotto pesa 800 gr per gli uomini e 600 gr per le donne
note: nessuno
in scheme: Subject Code
created: 2000-10-30T12:00:00+00:00
modified: 2010-12-15T17:01:09+00:00
broader: Atletica leggera

Decathlon
type: Concept
preferred label: decathlon @en-gb
preferred label: Zehnkampf @de
preferred label: decatlo @pt-pt
preferred label: decatlón @es
preferred label: 十種競技 @ja-jp
definition: 2日間に渡って10種の違う競技で得点の積み重ねを必要とする男子個人競技。1日目－100m、走り幅跳び、砲丸投げ、走り高跳び、400m走、2日目－110mハードル、円盤投げ、棒高跳び、槍投げそして1500m走 @ja-jp
definition: Competición individual masculina que consiste en acumular puntos en 10 disciplinas diferentes, durante 2 días. Primer día: 100 m, salto largo, lanzamiento de bala, salto alto, y 400m. Segundo día: 110m vallas, disco, salto con garrocha, jabalina, y 1500m. @es
definition: Competição individual masculina envolvendo 10 provas diferentes durante 2 dias. 1º dia: 100m, salto em distância, lançamento de peso, salto em altura e 400m. 2º dia: 110m barreiras, lançamento de disco, salto com vara, lançamento de dardo e 1500m. @pt-br
definition: 10 épreuves individuelles que les athlètes disputent pendant 2 jours. 1er jour : 100 m, saut en longueur, lancer du poids, saut en hauteur, 400 m. 2ème jour : 110 m haies, lancer du disque, saut à la perche, lancer du javelot, 1.500 m. @fr
definition: Dieci prove individuali maschili in dieci diverse discipline in cui gli atleti accumulano punti nell'arco di due giorni: 1.giorno 100 m, salto in lungo, lancio del peso, salto in alto, 400 m; 2.giorno 110 ostacoli, lancio del disco, salto con l'asta, lancio del giavellotto e 1.500 m
definition: Einzelwettkampf der Männer, der das Erreichen von Punkten in 10 Disziplinen über 2 Tage anstrebt: 1. Tag - 1000 m, Weitsprung, Kugelstoßen, 400 m. 2. Tag - 110 m Hürden, Diskuswerfen, Stabhochsprung, Speerwerfen und 1500 m. @de
definition: Individual men's competition which involves accumulating points in 10 different disciplines over two days: 1st day - 100m, long-jump, shot-putt, high-jump, 400m. 2nd day - 110m hurdles, discus, pole-vault, javelin and 1,500 metres. @en-gb
definition: Competição individual masculina envolvendo 10 provas diferentes durante 2 dias. 1º dia: 100m, salto em comprimento, lançamento do peso, salto em altura e 400m. 2º dia: 110m barreiras, lançamento do disco, salto à vara, lançamento do dardo e 1500m. @pt-pt
note: nessuno
note: typo fixed in Explanation @en-gb
in scheme: Subject Code
created: 2000-10-30T12:00:00+00:00
modified: 2010-12-15T17:01:09+00:00
broader: Atletica leggera

4x100
type: Concept
preferred label: 4x100 m @de
preferred label: ４００ｍリレー @ja-jp
preferred label: Relais 4x100 m @fr
preferred label: 4 x 100m @es
definition: Team race involving four runners each covering 100 metres. @en-gb
definition: 100mずつを4人で走るリレー競技 @ja-jp
definition: Corrida de equipa em que 4 corredores fazem 100 metros cada um. @pt-pt
definition: Carrera de relevos por equipos de 4 corredores, los cuales deben de cubrir un recorrido de 100m cada uno. @es
definition: Staffetta con 4 corridori, ciascuno dei quali corre per 100 metri
definition: Corrida de equipe em que 4 corredores fazem 100 metros cada um. @pt-br
definition: épreuves par équipes de quatre coureurs sur 100m @fr
definition: Mannschaftsrennen mit 4 Läufern, von denen jeder 100 Meter läuft. @de
note: nessuno
in scheme: Subject Code
created: 2000-10-30T12:00:00+00:00
modified: 2010-12-15T17:01:09+00:00
broader: Atletica leggera
broad match: http://cv.iptc.org/newscodes/mediatopic/20000842

4x200
type: Concept
preferred label: Relais 4x200 m @fr
preferred label: 4 x 200m @es
preferred label: 4x200 m @pt-br
preferred label: ８００ｍリレー @ja-jp
definition: Staffetta con 4 corridori, ciascuno dei quali corre per 200 metri
definition: Team race involving four runners each covering 200 metres. @en-gb
definition: Corrida de equipa em que 4 corredores fazem 200 metros cada um. @pt-pt
definition: Carrera de relevos por equipos de 4 corredores, los cuales deben de cubrir un recorrido de 200m cada uno. @es
definition: Mannschaftsrennen mit 4 Läufern, von denen jeder 200 Meter läuft. @de
definition: épreuves par équipes de quatre coureurs sur 200m @fr
definition: 200mずつを4人で走るリレー競技 @ja-jp
definition: Corrida de equipe em que 4 corredores fazem 200 metros cada um. @pt-br
note: nessuno
in scheme: Subject Code
created: 2000-10-30T12:00:00+00:00
modified: 2010-12-15T17:01:09+00:00
broader: Atletica leggera
broad match: http://cv.iptc.org/newscodes/mediatopic/20000842

4x400
type: Concept
preferred label: 4x400 m @pt-pt
preferred label: Relais 4x400 m @fr
preferred label: １６００ｍリレー @ja-jp
preferred label: 4 x 400m @es
definition: 400mずつを4人で走るリレー競技 @ja-jp
definition: épreuves par équipes de quatre coureurs sur 400m @fr
definition: Corrida de equipa em que 4 corredores fazem 400 metros cada um. @pt-pt
definition: Team race involving four runners each covering 400 metres. @en-gb
definition: Carrera de relevos por equipos de 4 corredores, los cuales deben de cubrir un recorrido de 400m.cada uno. @es
definition: Mannschaftsrennen mit 4 Läufern, von denen jeder 400 Meter läuft. @de
definition: Staffetta con 4 corridori, ciascuno dei quali corre per 400 metri
definition: Corrida de equipe em que 4 corredores fazem 400 metros cada um. @pt-br
note: nessuno
in scheme: Subject Code
created: 2000-10-30T12:00:00+00:00
modified: 2010-12-15T17:01:09+00:00
broader: Atletica leggera
broad match: http://cv.iptc.org/newscodes/mediatopic/20000842

4x800
type: Concept
preferred label: 4x800 m @pt-br
preferred label: ３２００ｍリレー @ja-jp
preferred label: Relais 4x800 m @fr
preferred label: 4 x 800m @es
definition: Corrida de equipe em que 4 corredores fazem 800 metros cada um. @pt-br
definition: Mannschaftsrennen mit 4 Läufern, von denen jeder 800 Meter läuft. @de
definition: 800mずつを4人で走るリレー競技 @ja-jp
definition: Corrida de equipa em que 4 corredores fazem 800 metros cada um. @pt-pt
definition: Staffetta con 4 corridori, ciascuno dei quali corre per 800 metri
definition: Team race involving four runners each covering 800 metres. @en-gb
definition: épreuves par équipes de quatre coureurs sur 800m @fr
definition: Carrera de relevos por equipos de 4 corredores, los cuales deben de cubrir un recorrido de 800m cada uno. @es
note: nessuno
in scheme: Subject Code
created: 2000-10-30T12:00:00+00:00
modified: 2010-12-15T17:01:09+00:00
broader: Atletica leggera
broad match: http://cv.iptc.org/newscodes/mediatopic/20000842

4x1500
type: Concept
preferred label: ６０００ｍリレー @ja-jp
preferred label: 4 x 1500m @es
preferred label: Relais4x1500 m @fr
preferred label: 4x1500 m @en-gb
definition: Team race involving four runners each covering 1500 metres. @en-gb
definition: 1500mずつを4人で走るリレー競技 @ja-jp
definition: Corrida de equipa em que 4 corredores fazem 1500 metros cada um. @pt-pt
definition: Mannschaftsrennen mit 4 Läufern, von denen jeder 1500 Meter läuft. @de
definition: épreuves par équipes de quatre coureurs sur 1500m @fr
definition: Carrera de relevos por equipos de 4 corredores, los cuales deben de cubrir un recorrido de 1500m cada uno. @es
definition: Staffetta con 4 corridori, ciascuno dei quali corre per 1500 metri
definition: Corrida de equipe em que 4 corredores fazem 1500 metros cada um. @pt-br
note: nessuno
in scheme: Subject Code
created: 2000-10-30T12:00:00+00:00
modified: 2010-12-15T17:01:09+00:00
broader: Atletica leggera
broad match: http://cv.iptc.org/newscodes/mediatopic/20000842

Marcia 1h
type: Concept
preferred label: marcha 1 h @pt-pt
preferred label: walk 1 h @en-gb
preferred label: marcha de 1h @es
preferred label: Gehen 1 Stunde @de
preferred label: Marche 1h @fr
preferred label: １時間競歩 @ja-jp
definition: Competizione nella quale i concorrenti devono marciare per un'ora, mantenendo sempre almeno un piede in contatto con il terreno e senza correre
definition: 少なくとも片足を地面につけて走ることなく、1時間を歩く競技 @ja-jp
definition: Prueba en la cual los competidores deben marchar una hora, manteniendo al menos un pie en contacto con el suelo y no se les permite correr. @es
definition: épreuve d'une heure où l'athlète doit maintenir un contact permanent entre le sol et un de ses pieds sans jamais courir. @fr
definition: One-hour long race where competitors must maintain at least one foot in contact with the ground and are not allowed to run. @en-gb
definition: Prova de uma hora em que os atletas devem manter pelo menos um pé em contato com o chão e não podem correr. @pt-br
definition: Rennen über eine Stunde, wobei die Wettkämpfer einen Fuß immer auf dem Boden haben müssen und es nicht erlaubt ist zu rennen. @de
definition: Prova de uma hora em que os atletas devem manter pelo menos um pé em contacto com o chão e não podem correr. @pt-pt
note: nessuno
in scheme: Subject Code
created: 2000-10-30T12:00:00+00:00
modified: 2010-12-15T17:01:09+00:00
broader: Atletica leggera
broad match: http://cv.iptc.org/newscodes/mediatopic/20000841

Marcia 2 h
type: Concept
preferred label: marcha 2 h @pt-pt
preferred label: walk 2 h @en-gb
preferred label: ２時間競歩 @ja-jp
preferred label: marcha de 2h @es
preferred label: Marche 2h @fr
preferred label: Gehen 2 Stunden @de
definition: Rennen über zwei Stunden, wobei die Wettkämpfer einen Fuß immer auf dem Boden haben müssen und es nicht erlaubt ist zu rennen. @de
definition: Two-hour long walking race where competitors must maintain at least one foot in contact with the ground and are not allowed to run. @en-gb
definition: Prova de duas horas em que os atletas devem manter pelo menos um pé em contato com o chão e não podem correr. @pt-br
definition: Prova de duas horas em que os atletas devem manter pelo menos um pé em contacto com o chão e não podem correr. @pt-pt
definition: Prueba en la cual los competidores deben marchar dos horas, manteniendo al menos un pie en contacto con el suelo y no se les permite correr. @es
definition: épreuve de deux heures où l'athlète doit maintenir un contact permanent entre le sol et un de ses pieds sans jamais courir. @fr
definition: Competizione nella quale i concorrenti devono marciare per due ore, mantenendo sempre almeno un piede in contatto con il terreno e senza correre
definition: 少なくとも片足を地面につけて走ることなく、2時間を歩く競技 @ja-jp
note: nessuno
in scheme: Subject Code
created: 2000-10-30T12:00:00+00:00
modified: 2010-12-15T17:01:09+00:00
broader: Atletica leggera
broad match: http://cv.iptc.org/newscodes/mediatopic/20000841

10 km marcia
type: Concept
preferred label: 10 km marcha @es
preferred label: 10 km Gehen @de
preferred label: 10km marche @fr
preferred label: １０ｋｍ競歩 @ja-jp
preferred label: 10 km walk @en-gb
definition: Competizione di marcia nella distanza di 10 km, mantenendo sempre almeno un piede in contatto con il terreno e senza correre
definition: Prova de 10 km em que os atletas devem manter pelo menos um pé em contacto com o chão e não podem correr. @pt-pt
definition: épreuve d'une heure où l'athlète doit maintenir un contact permanent entre le sol et un de ses pieds sans jamais courir. @fr
definition: Rennen über 10 Kilometer, wobei die Wettkämpfer einen Fuß immer auf dem Boden haben müssen und es nicht erlaubt ist zu rennen. @de
definition: Prova de 10 km em que os atletas devem manter pelo menos um pé em contato com o chão e não podem correr. @pt-br
definition: Walking race over 10 kilometres where competitors must maintain at least one foot in contact with the ground and are not allowed to run. @en-gb
definition: 選手が少なくとも片方の足を地面に触れている状態で、走ることができない10kmの歩行レース @ja-jp
definition: Prueba en la que los competidores recorren 10 km manteniendo al menos un pie en contacto con el suelo y no se les permite correr. @es
note: nessuno
in scheme: Subject Code
created: 2000-10-30T12:00:00+00:00
modified: 2010-12-15T17:01:09+00:00
broader: Atletica leggera
broad match: http://cv.iptc.org/newscodes/mediatopic/20000841

15 km marcia
type: Concept
preferred label: 15km marche @fr
preferred label: 15 km marcha @es
preferred label: 15 km Gehen @de
preferred label: 15 km walk @en-gb
preferred label: １５ｋｍ競歩 @ja-jp
definition: Walking race over 15 kilometres where competitors must maintain at least one foot in contact with the ground and are not allowed to run. @en-gb
definition: Prueba en la que los competidores recorren 15 km manteniendo al menos un pie en contacto con el suelo y no se les permite correr. @es
definition: Competizione di marcia nella distanza di 15 km, mantenendo sempre almeno un piede in contatto con il terreno e senza correre
definition: 選手が少なくとも片方の足を地面に触れている状態で、走ることができない15kmの歩行レース @ja-jp
definition: Rennen über 15 Kilometer, wobei die Wettkämpfer einen Fuß immer auf dem Boden haben müssen und es nicht erlaubt ist zu rennen. @de
definition: Prova de 15 km em que os atletas devem manter pelo menos um pé em contacto com o chão e não podem correr. @pt-pt
definition: Prova de 15 km em que os atletas devem manter pelo menos um pé em contato com o chão e não podem correr. @pt-br
definition: épreuve sur 15 km où l'athlète doit maintenir un contact permanent entre le sol et un de ses pieds sans jamais courir. @fr
note: nessuno
in scheme: Subject Code
created: 2000-10-30T12:00:00+00:00
modified: 2010-12-15T17:01:09+00:00
broader: Atletica leggera
broad match: http://cv.iptc.org/newscodes/mediatopic/20000841

20 km marcia
type: Concept
preferred label: 20 km marcha @es
preferred label: ２０ｋｍ競歩 @ja-jp
preferred label: 20 km walk @en-gb
preferred label: 20 km Gehen @de
preferred label: 20km marche @fr
definition: Prova de 20 km em que os atletas devem manter pelo menos um pé em contacto com o chão e não podem correr. @pt-pt
definition: Walking race over 20 kilometres where competitors must maintain at least one foot in contact with the ground and are not allowed to run. @en-gb
definition: Prueba en la que los competidores recorren 20 km manteniendo al menos un pie en contacto con el suelo y no se les permite correr. @es
definition: Prova de 20 km em que os atletas devem manter pelo menos um pé em contato com o chão e não podem correr. @pt-br
definition: épreuve de 20 km où l'athlète doit maintenir un contact permanent entre le sol et un de ses pieds sans jamais courir. @fr
definition: 選手が少なくとも片方の足を地面に触れている状態で、走ることができない20kmの歩行レース @ja-jp
definition: Competizione di marcia nella distanza di 20 km, mantenendo sempre almeno un piede in contatto con il terreno e senza correre
definition: Rennen über 20 Kilometer, wobei die Wettkämpfer einen Fuß immer auf dem Boden haben müssen und es nicht erlaubt ist zu rennen. @de
note: nessuno
note: typo fixed in Explanation @en-gb
in scheme: Subject Code
created: 2000-10-30T12:00:00+00:00
modified: 2010-12-15T17:01:09+00:00
broader: Atletica leggera
broad match: http://cv.iptc.org/newscodes/mediatopic/20000841

30 km marcia
type: Concept
preferred label: 30 km marcha @pt-pt
preferred label: ３０ｋｍ競歩 @ja-jp
preferred label: 30 km Gehen @de
preferred label: 30 km walk @en-gb
preferred label: 30km marche @fr
definition: Walking race over 30 kilometres where competitors must maintain at least one foot in contact with the ground and are not allowed to run. @en-gb
definition: Rennen über 30 Kilometer, wobei die Wettkämpfer einen Fuß immer auf dem Boden haben müssen und es nicht erlaubt ist zu rennen. @de
definition: Prova de 30 km em que os atletas devem manter pelo menos um pé em contacto com o chão e não podem correr. @pt-pt
definition: épreuve de 30 km où l'athlète doit maintenir un contact permanent entre le sol et un de ses pieds sans jamais courir. @fr
definition: Prueba en la que los competidores recorren 30 km manteniendo al menos un pie en contacto con el suelo y no se les permite correr. @es
definition: Prova de 30 km em que os atletas devem manter pelo menos um pé em contato com o chão e não podem correr. @pt-br
definition: 選手が少なくとも片方の足を地面に触れている状態で、走ることができない30kmの歩行レース @ja-jp
definition: Competizione di marcia nella distanza di 30 km, mantenendo sempre almeno un piede in contatto con il terreno e senza correre
note: nessuno
in scheme: Subject Code
created: 2000-10-30T12:00:00+00:00
modified: 2010-12-15T17:01:09+00:00
broader: Atletica leggera
broad match: http://cv.iptc.org/newscodes/mediatopic/20000841

50 km marcia
type: Concept
preferred label: 50 km marcha @es
preferred label: ５０ｋｍ競歩 @ja-jp
preferred label: 50km marche @fr
preferred label: 50 km Gehen @de
preferred label: 50 km walk @en-gb
definition: Prova de 50 km em que os atletas devem manter pelo menos um pé em contato com o chão e não podem correr. @pt-br
definition: Prova de 50 km em que os atletas devem manter pelo menos um pé em contacto com o chão e não podem correr. @pt-pt
definition: Walking race over 50 kilometres where competitors must maintain at least one foot in contact with the ground and are not allowed to run. @en-gb
definition: Prueba en la que los competidores recorren 50 km manteniendo al menos un pie en contacto con el suelo y no se les permite correr. @es
definition: 選手が少なくとも片方の足を地面に触れている状態で、走ることができない50kmの歩行レース @ja-jp
definition: Rennen über 50 Kilometer, wobei die Wettkämpfer einen Fuß immer auf dem Boden haben müssen und es nicht erlaubt ist zu rennen. @de
definition: épreuve de 50 km où l'athlète doit maintenir un contact permanent entre le sol et un de ses pieds sans jamais courir. @fr
definition: Competizione di marcia nella distanza di 50 km, mantenendo sempre almeno un piede in contatto con il terreno e senza correre
note: nessuno
in scheme: Subject Code
created: 2000-10-30T12:00:00+00:00
modified: 2010-12-15T17:01:09+00:00
broader: Atletica leggera
broad match: http://cv.iptc.org/newscodes/mediatopic/20000841

100 ostacoli
type: Concept
preferred label: 100 m barreiras @pt-pt
preferred label: 100m vallas @es
preferred label: 100 m hurdles @en-gb
preferred label: 100m haies @fr
preferred label: １００ｍ障害 @ja-jp
preferred label: 100 m Hürdenlauf @de
definition: course de vitesse sur 100 m parsemés de 10 haies réservé aux femmes @fr
definition: I concorrenti devono percorrere 100 metri e superare 10 ostacoli collocati sul loro cammino
definition: Prova de velocidade que consiste em correr uma distância de 100 metros saltando 10 barreiras colocadas ao longo da pista. @pt-pt
definition: 100mの短距離走で、競技者は走路上に置かれた10個のハードルをクリアしなければならない @ja-jp
definition: Sprint over a distance of 100 metres with competitors having to clear 10 hurdles placed in their way. @en-gb
definition: Prueba reservada para mujeres en que las atletas deben de correr a máxima velocidad una distancia de 100m, saltando 10 vallas colocadas en su camino. @es
definition: Sprint über eine Distanz von 100 Metern, wobei die Wettkämpfer 10 Hürden passieren müssen, die auf der Strecke platziert sind. @de
note: nessuno
in scheme: Subject Code
created: 2000-10-30T12:00:00+00:00
modified: 2010-12-15T17:01:09+00:00
broader: Atletica leggera
broad match: http://cv.iptc.org/newscodes/mediatopic/20000834

5 km marcia
type: Concept
preferred label: 5 km marche @fr
preferred label: 5 km marcha @pt-br
preferred label: ５ｋｍ競歩 @ja-jp
preferred label: 5 km Gehen @de
preferred label: 5 km walk @en-gb
definition: Rennen über 5 Kilometer, wobei die Wettkämpfer einen Fuß immer auf dem Boden haben müssen und es nicht erlaubt ist zu rennen. @de
definition: Prueba en la que los competidores recorren 5 km manteniendo al menos un pie en contacto con el suelo y no se les permite correr. @es
definition: Competizione di marcia nella distanza di 5 km, mantenendo sempre almeno un piede in contatto con il terreno e senza correre
definition: Walking race over 5 kilometres where competitors must maintain at least one foot in contact with the ground and are not allowed to run. @en-gb
definition: Prova de 5 km em que os atletas devem manter pelo menos um pé em contato com o chão e não podem correr. @pt-br
definition: Prova de 5 km em que os atletas devem manter pelo menos um pé em contacto com o chão e não podem correr. @pt-pt
definition: 選手が少なくとも片方の足を地面に触れている状態で、走ることができない5kmの歩行レース @ja-jp
definition: épreuve de 5 km où l'athlète doit maintenir un contact permanent entre le sol et un de ses pieds sans jamais courir. Réservé aux femmes. @fr
note: nessuno
in scheme: Subject Code
created: 2000-10-30T12:00:00+00:00
modified: 2010-12-15T17:01:09+00:00
broader: Atletica leggera
broad match: http://cv.iptc.org/newscodes/mediatopic/20000841

Eptathlon
type: Concept
preferred label: heptatlo @pt-br
preferred label: Siebenkampf @de
preferred label: heptathlon @es
preferred label: 七種競技 @ja-jp
definition: 7épreuves individuelles que les athlètes féminines disputent pendant 2 jours. 1er jour : 100 m haies, saut en hauteur, lancer du poids, 200 m. 2ème jour : saut en longueur, lancer du javelot, 800 m. @fr
definition: 2日間に渡って7種の異なる競技を行う女子個人競技。1日目－100mハードル、走り高跳び、砲丸投げ、200m走、2日目－走り幅跳び、槍投げ、800m走 @ja-jp
definition: Einzelwettkampf der Frauen, umfasst 7 Disziplinen über 2 Tage: 1. Tag - 100 m Hürden, Hochsprung, Kugelstoßen, 200 Meter. 2. Tag - Weitsprung, Speerwerfen, 800 Meter. @de
definition: Competición individual de mujeres con pruebas en 7 disciplinas disputadas durante 2 días. Primer día: 100m. con vallas, salto alto, lanzamiento de bala, y 200 m. Segundo día: Salto largo, jabalina, y 800 m. @es
definition: Competição individual feminina que consiste em acumular pontos em 7 provas diferentes durante 2 dias. 1º dia: 100m barreiras, salto em altura, arremesso de peso e 200m. 2º dia: salto em distância, lançamento de dardo e 800m. @pt-br
definition: Individual women's competition involving seven separate disciplines over two days. 1st day - 100m hurdles, high-jump, shot-putt, 200 metres. 2nd day - long-jump, javelin, 800 metres. @en-gb
definition: Competizione individuale femminile che comprende 7 discipline da svolgere in due giorni. 1. giorno: 100 ostacoli, salto in alto, getto del peso, 200 metri. 2.giorno: salto in lungo, lancio del giavellotto, 800 metri
definition: Competição individual feminina que consiste em acumular pontos em 7 provas diferentes durante 2 dias. 1º dia: 100m barreiras, salto em altura, lançamento do peso e 200m. 2º dia: salto em comprimento, lançamento do dardo e 800m. @pt-pt
note: nessuno
note: typo fixed in Explanation @en-gb
in scheme: Subject Code
created: 2000-10-30T12:00:00+00:00
modified: 2010-12-15T17:01:09+00:00
broader: Atletica leggera

1500 m marcia
type: Concept
preferred label: 1500 m Gehen @de
preferred label: 1500 m marcha @pt-br
preferred label: 1500 m walk @en-gb
preferred label: １５００ｍ競歩 @ja-jp
preferred label: 1500m marche @fr
definition: Competizione di marcia nella distanza di 1500 metri, mantenendo sempre almeno un piede in contatto con il terreno e senza correre
definition: épreuve de 1500m où l'athlète doit maintenir un contact permanent entre le sol et un de ses pieds sans jamais courir. @fr
definition: Walking race over 1500 metres where competitors must maintain at least one foot in contact with the ground and are not allowed to run. @en-gb
definition: Prueba en la que los competidores recorren 1500m manteniendo al menos un pie en contacto con el suelo y no se les permite correr. @es
definition: 選手が少なくとも片方の足を地面に触れている状態で、走ることができない1500mの歩行レース @ja-jp
definition: Prova de 1500 m em que os atletas devem manter pelo menos um pé em contacto com o chão e não podem correr. @pt-pt
definition: Prova de 1500 m em que os atletas devem manter pelo menos um pé em contato com o chão e não podem correr. @pt-br
definition: Rennen über 1500 Meter, wobei die Wettkämpfer einen Fuß immer auf dem Boden haben müssen und es nicht erlaubt ist zu rennen. @de
note: nessuno
in scheme: Subject Code
created: 2000-10-30T12:00:00+00:00
modified: 2010-12-15T17:01:09+00:00
broader: Atletica leggera
broad match: http://cv.iptc.org/newscodes/mediatopic/20000841

2000 m marcia
type: Concept
preferred label: 2000 m marcha @pt-pt
preferred label: 2000m marche @fr
preferred label: 2000 m Gehen @de
preferred label: ２０００ｍ競歩 @ja-jp
preferred label: 2000 m walk @en-gb
definition: épreuve de 2000m où l'athlète doit maintenir un contact permanent entre le sol et un de ses pieds sans jamais courir. @fr
definition: Prova de 2000 m em que os atletas devem manter pelo menos um pé em contacto com o chão e não podem correr. @pt-pt
definition: Walking race over 2000 metres where competitors must maintain at least one foot in contact with the ground and are not allowed to run. @en-gb
definition: Competizione di marcia nella distanza di 2000 metri, mantenendo sempre almeno un piede in contatto con il terreno e senza correre
definition: 選手が少なくとも片方の足を地面に触れている状態で、走ることができない2000mの歩行レース @ja-jp
definition: Prova de 2000 m em que os atletas devem manter pelo menos um pé em contato com o chão e não podem correr. @pt-br
definition: Rennen über 2000 Meter, wobei die Wettkämpfer einen Fuß immer auf dem Boden haben müssen und es nicht erlaubt ist zu rennen. @de
definition: Prueba en la que los competidores recorren 2000m manteniendo al menos un pie en contacto con el suelo y no se les permite correr. @es
note: nessuno
in scheme: Subject Code
created: 2000-10-30T12:00:00+00:00
modified: 2010-12-15T17:01:09+00:00
broader: Atletica leggera
broad match: http://cv.iptc.org/newscodes/mediatopic/20000841

3000 m marcia
type: Concept
preferred label: 3000m marche @fr
preferred label: 3000 m Gehen @de
preferred label: 3000 marcha @pt-pt
preferred label: 3000 m walk @en-gb
preferred label: ３０００ｍ競歩 @ja-jp
preferred label: 3000 m marcha @es
definition: Competizione di marcia nella distanza di 3000 metri, mantenendo sempre almeno un piede in contatto con il terreno e senza correre
definition: Prova de 3000 m em que os atletas devem manter pelo menos um pé em contacto com o chão e não podem correr. @pt-pt
definition: Prova de 3000 m em que os atletas devem manter pelo menos um pé em contato com o chão e não podem correr. @pt-br
definition: épreuve de 3000m où l'athlète doit maintenir un contact permanent entre le sol et un de ses pieds sans jamais courir. @fr
definition: Walking race over 3000 metres where competitors must maintain at least one foot in contact with the ground and are not allowed to run. @en-gb
definition: Rennen über 3000 Meter, wobei die Wettkämpfer einen Fuß immer auf dem Boden haben müssen und es nicht erlaubt ist zu rennen. @de
definition: Prueba en la que los competidores recorren 3000m manteniendo al menos un pie en contacto con el suelo y no se les permite correr. @es
definition: 選手が少なくとも片方の足を地面に触れている状態で、走ることができない3000mの歩行レース @ja-jp
note: nessuno
in scheme: Subject Code
created: 2000-10-30T12:00:00+00:00
modified: 2010-12-15T17:01:09+00:00
broader: Atletica leggera
broad match: http://cv.iptc.org/newscodes/mediatopic/20000841

50 m
type: Concept
preferred label: ５０ｍ @ja-jp
preferred label: 50m @fr
definition: Breve gara di velocità sui 50 m
definition: Kurzstrecken Sprint über 50 Meter, wobei die schnellste Zeit gewinnt. @de
definition: 50mに渡り最も速いタイム(を出した人)が勝利する短距離競走 @ja-jp
definition: Carrera corta que consiste en cubrir 50m. en el menor tiempo posible @es
definition: Short sprint race over 50 metres with the fastest time winning. @en-gb
definition: Prova de velocidade que consiste em correr 50 m. Ganha o tempo mais rápido. @pt-pt
definition: compétition qui consiste à couvrir 50m en un temps minimum. @fr
note: nessuno
in scheme: Subject Code
created: 2000-10-30T12:00:00+00:00
modified: 2010-12-15T17:01:09+00:00
broader: Atletica leggera
broad match: http://cv.iptc.org/newscodes/mediatopic/20000844

50 ostacoli
type: Concept
preferred label: 50 m hurdles @en-gb
preferred label: 50m vallas @es
preferred label: 50m haies @fr
preferred label: 50 m Hürdenlauf @de
preferred label: ５０ｍ障害 @ja-jp
preferred label: 50 m barreiras @pt-pt
definition: Kurzstrecken Sprint über 50 Meter unterbrochen durch Hürden. @de
definition: Short sprint race over 50 metres interspersed with hurdles. @en-gb
definition: Prova de velocidade que consiste em correr 50 m com barreiras. Ganha o tempo mais rápido. @pt-br
definition: course de vitesse sur 50 m parsemés de haies @fr
definition: Breve gara di velocità sui 50 m ostacoli
definition: Carrera de 50 metros con vallas. @es
definition: 50mに渡りハードルが散在する短距離競走 @ja-jp
note: nessuno
in scheme: Subject Code
created: 2000-10-30T12:00:00+00:00
modified: 2010-12-15T17:01:09+00:00
broader: Atletica leggera
broad match: http://cv.iptc.org/newscodes/mediatopic/20000834

50 yards
type: Concept
preferred label: 50 yardas @es
preferred label: 50 jardas @pt-pt
preferred label: ５０ヤード @ja-jp
definition: 50ヤードに渡り最も速いタイム(を出した人)が勝利する短距離競走 @ja-jp
definition: Kurzstrecken Sprint über 50 Yards, wobei die schnellste Zeit gewinnt. @de
definition: Breve gara di velocità sulle 50 yarde
definition: Consiste en cubrir 50 yardas en el menor tiempo posible, con el más rápido como ganador. @es
definition: Short sprint race over 50 yards with the fastest time winning. @en-gb
definition: Prova de velocidade que consiste em correr 50 jardas. Ganha o tempo mais rápido. @pt-pt
definition: compétition qui consiste à couvrir 50 yards en un temps minimum. @fr
note: nessuno
in scheme: Subject Code
created: 2000-10-30T12:00:00+00:00
modified: 2010-12-15T17:01:09+00:00
broader: Atletica leggera
broad match: http://cv.iptc.org/newscodes/mediatopic/20000844

50 yards ostacoli
type: Concept
preferred label: 50 jardas barreiras @pt-pt
preferred label: 50 yards Hürdenlauf @de
preferred label: 50 yardas con vallas @es
preferred label: 50 yard haies @fr
preferred label: ５０ヤード障害 @ja-jp
preferred label: 50 yard hurdles @en-gb
definition: course de vitesse sur 50 yards parsemés de haies @fr
definition: Breve gara di velocità sulle 50 yarde a ostacoli
definition: Short sprint race over 50 yards interspersed with hurdles. @en-gb
definition: Kurzstrecken Sprint über 50 Yards, unterbrochen durch Hürden. @de
definition: 50ヤードに渡りハードルが散在する短距離競走 @ja-jp
definition: Prova de velocidade que consiste em correr 50 jardas com barreiras. Ganha o tempo mais rápido. @pt-br
definition: Igual a la anterior pero con vallas interpuestas en el camino. @es
note: nessuno
in scheme: Subject Code
created: 2000-10-30T12:00:00+00:00
modified: 2010-12-15T17:01:09+00:00
broader: Atletica leggera
broad match: http://cv.iptc.org/newscodes/mediatopic/20000834

60 m
type: Concept
preferred label: 60m @es
preferred label: ６０ｍ @ja-jp
definition: Prova de velocidade que consiste em correr 60 m. Ganha o tempo mais rápido. @pt-br
definition: Breve gara di velocità sui 60 m
definition: Kurzstrecken Sprint über 60 Meter, wobei die schnellste Zeit gewinnt. @de
definition: Short sprint race over 60 metres with the fastest time winning. @en-gb
definition: Carrera corta de 60m. con el más rápido como ganador. @es
definition: 60メートルに渡り最も速いタイム(を出した人)が勝利する短距離競走(short sprint race) @ja-jp
definition: compétition qui consiste à couvrir 60 m en un temps minimum. @fr
note: nessuno
in scheme: Subject Code
created: 2000-10-30T12:00:00+00:00
modified: 2010-12-15T17:01:09+00:00
broader: Atletica leggera
broad match: http://cv.iptc.org/newscodes/mediatopic/20000844

60 m ostacoli
type: Concept
preferred label: 60 m barreiras @pt-pt
preferred label: 60 m Hürdenlauf @de
preferred label: 60m vallas @es
preferred label: ６０ｍ障害 @ja-jp
preferred label: 60m haies @fr
preferred label: 60 m hurdles @en-gb
definition: Breve gara di velocità sui 60 m ostacoli
definition: Kurzstrecken Sprint über 60 Meter, unterbrochen durch Hürden. @de
definition: Prova de velocidade que consiste em correr 60 m com barreiras. Ganha o tempo mais rápido. @pt-br
definition: 60メートルに渡りハードルが散在する短距離競走(short sprint race) @ja-jp
definition: Igual pero con vallas. @es
definition: course de vitesse sur 60 m parsemés de haies @fr
definition: Short sprint race over 60 metres interspersed with hurdles. @en-gb
note: nessuno
in scheme: Subject Code
created: 2000-10-30T12:00:00+00:00
modified: 2010-12-15T17:01:09+00:00
broader: Atletica leggera
broad match: http://cv.iptc.org/newscodes/mediatopic/20000834

６０ヤード
type: Concept
preferred label: 60 yards
preferred label: 60 jardas @pt-pt
preferred label: 60 yardas @es
definition: Prova de velocidade que consiste em correr 60 jardas. Ganha o tempo mais rápido. @pt-br
definition: Short sprint race over 60 yards with the fastest time winning. @en-gb
definition: Breve gara di velocità sulle 60 yarde
definition: 60ヤードに渡り最も速いタイム(を出した人)が勝利する短距離競走(short sprint race) @ja-jp
definition: Kurzstrecken Sprint über 60 Yards, wobei die schnellste Zeit gewinnt. @de
definition: compétition qui consiste à couvrir 60 yards en un temps minimum. @fr
definition: Igual que la de 50, pero en 60 yardas. @es
note: nessuno
in scheme: Subject Code
created: 2000-10-30T12:00:00+00:00
modified: 2010-12-15T17:01:09+00:00
broader: Atletica leggera
broad match: http://cv.iptc.org/newscodes/mediatopic/20000844

60 yards ostacoli
type: Concept
preferred label: 60 yard haies @fr
preferred label: ６０ヤード障害 @ja-jp
preferred label: 60 yard hurdles @en-gb
preferred label: 60 yards Hürdenlauf @de
preferred label: 60 jardas barreiras @pt-br
preferred label: 60 yardas con vallas @es
definition: Kurzstrecken Sprint über 60 Yards unterbrochen von Hürden. @de
definition: Prova de velocidade que consiste em correr 60 jardas com barreiras. Ganha o tempo mais rápido. @pt-pt
definition: Short sprint race over 60 yards interspersed with hurdles. @en-gb
definition: Carrera de 60 yardas con vallas interpuestas en el camino. @es
definition: Breve gara di velocità sulle 60 yarde a ostacoli
definition: 60ヤードに渡りハードルが散在する短距離競走(short sprint race) @ja-jp
definition: course de vitesse sur 60 yards parsemés de haies @fr
note: nessuno
note: typo fixed in Explanation @en-gb
in scheme: Subject Code
created: 2000-10-30T12:00:00+00:00
modified: 2010-12-15T17:01:09+00:00
broader: Atletica leggera
broad match: http://cv.iptc.org/newscodes/mediatopic/20000834

100 yards
type: Concept
preferred label: 100 jardas @pt-pt
preferred label: １００ヤード @ja-jp
preferred label: 100 yardas @es
definition: 100ヤードに渡り最も速いタイム(を出した人)が勝利する短距離競走(sprint race) @ja-jp
definition: Prova de velocidade que consiste em correr 100 jardas. Ganha o tempo mais rápido. @pt-pt
definition: Sprint über 100 Yards, wobei die schnellste Zeit gewinnt. @de
definition: compétition qui consiste à couvrir 100 yards en un temps minimum. @fr
definition: Sprint race over 100 yards with the fastest time winning. @en-gb
definition: Carrera de 100 yardas con el más rápido como ganador. @es
definition: Breve gara di velocità sulle 100 yarde
note: nessuno
in scheme: Subject Code
created: 2000-10-30T12:00:00+00:00
modified: 2010-12-15T17:01:09+00:00
broader: Atletica leggera
broad match: http://cv.iptc.org/newscodes/mediatopic/20000844

100 yards ostacoli
type: Concept
preferred label: 100 jardas barreiras @pt-pt
preferred label: 100 yard hurdles @en-gb
preferred label: 100 yard haies @fr
preferred label: 100 yardas con vallas @es
preferred label: 100 yards Hürdenlauf @de
preferred label: １００ヤード障害 @ja-jp
definition: Sprint über 100 Yards unterbrochen durch Hürden. @de
definition: Prova de velocidade que consiste em correr 100 jardas com barreiras. Ganha o tempo mais rápido. @pt-pt
definition: 100ヤードに渡りハードルが散在する短距離競走(sprint race) @ja-jp
definition: Breve gara di velocità sulle 100 yarde a ostacoli
definition: Sprint race over 100 yards interspersed with hurdles. @en-gb
definition: course de vitesse sur 100 yards m parsemés de haies @fr
definition: Igual pero con vallas @es
note: nessuno
in scheme: Subject Code
created: 2000-10-30T12:00:00+00:00
modified: 2010-12-15T17:01:09+00:00
broader: Atletica leggera
broad match: http://cv.iptc.org/newscodes/mediatopic/20000834

300m
type: Concept
preferred label: 300 m
preferred label: ３００ｍ @ja-jp
definition: Carrera de velocidad en 300 metros. @es
definition: compétition qui consiste à couvrir 300 m en un temps minimum. @fr
definition: Race over 300 metres with the fastest time winning. @en-gb
definition: Prova que consiste em correr 300 m. Ganha o tempo mais rápido. @pt-br
definition: Corsa di 300 m
definition: 300メートルに渡り最も速いタイム(を出した人)が勝利する競走 @ja-jp
definition: Rennen über 300 Meter, wobei die schnellste Zeit gewinnt. @de
note: nessuno
in scheme: Subject Code
created: 2000-10-30T12:00:00+00:00
modified: 2010-12-15T17:01:09+00:00
broader: Atletica leggera
broad match: http://cv.iptc.org/newscodes/mediatopic/20000844

300 yards
type: Concept
preferred label: 300 yardas @es
preferred label: ３００ヤード @ja-jp
preferred label: 300 jardas @pt-br
definition: Prova que consiste em correr 300 jardas. Ganha o tempo mais rápido. @pt-pt
definition: Carrera de velocidad sobre 300 yardas. @es
definition: Corsa di 300 yards
definition: Race over 300 yards with the fastest time winning. @en-gb
definition: compétition qui consiste à couvrir 300 yards en un temps minimum. @fr
definition: Rennen über 300 Yards, wobei die schnellste Zeit gewinnt. @de
definition: 300ヤードに渡り最も速いタイム(を出した人)が勝利する競走 @ja-jp
note: nessuno
in scheme: Subject Code
created: 2000-10-30T12:00:00+00:00
modified: 2010-12-15T17:01:09+00:00
broader: Atletica leggera
broad match: http://cv.iptc.org/newscodes/mediatopic/20000844

４４０ヤード
type: Concept
preferred label: 440 yards
preferred label: 440 jardas @pt-br
preferred label: 440 yardas @es
definition: Prova que consiste em correr 440 jardas. Ganha o tempo mais rápido. @pt-pt
definition: compétition qui consiste à couvrir 440 yards en un temps minimum. @fr
definition: Rennen über 440 Yards wobei die schnellste Zeit gewinnt. @de
definition: Corsa di 440 yards
definition: Race over 440 yards with the fastest time winning. @en-gb
definition: 440ヤードに渡り最も速いタイム(を出した人)が勝利する競走 @ja-jp
definition: Igual pero en 440 yardas. @es
note: nessuno
in scheme: Subject Code
created: 2000-10-30T12:00:00+00:00
modified: 2010-12-15T17:01:09+00:00
broader: Atletica leggera
broad match: http://cv.iptc.org/newscodes/mediatopic/20000838

500 m
type: Concept
preferred label: 500m @es
preferred label: ５００ｍ @ja-jp
definition: Rennen über 500 Metern wobei die schnellste Zeit gewinnt. @de
definition: Race over 500 metres with the fastest time winning. @en-gb
definition: compétition qui consiste à couvrir 500 m en un temps minimum. @fr
definition: Prova que consiste em correr 500 m. Ganha o tempo mais rápido. @pt-br
definition: 500メートルに渡り最も速いタイム(を出した人)が勝利する競走 @ja-jp
definition: Carrera de velocidad con trazado de 500 metros. @es
definition: Gara di 500 m
note: nessuno
in scheme: Subject Code
created: 2000-10-30T12:00:00+00:00
modified: 2010-12-15T17:01:09+00:00
broader: Atletica leggera
broad match: http://cv.iptc.org/newscodes/mediatopic/20000838

５００ヤード
type: Concept
preferred label: 500 jardas @pt-pt
preferred label: 500 yards
preferred label: 500 yardas @es
definition: Carrera de velocidad sobre 500 yardas. @es
definition: Corsa di 500 yards
definition: Race over 500 yards with the fastest time winning. @en-gb
definition: Prova que consiste em correr 500 jardas. Ganha o tempo mais rápido. @pt-br
definition: Rennen über 500 Yards wobei die schnellste Zeit gewinnt. @de
definition: compétition qui consiste à couvrir 500 yards en un temps minimum. @fr
definition: 500ヤードに渡り最も速いタイム(を出した人)が勝利する競走 @ja-jp
note: nessuno
in scheme: Subject Code
created: 2000-10-30T12:00:00+00:00
modified: 2010-12-15T17:01:09+00:00
broader: Atletica leggera
broad match: http://cv.iptc.org/newscodes/mediatopic/20000838

600m
type: Concept
preferred label: 600 m
preferred label: ６００ｍ @ja-jp
definition: 600メートルに渡り最も速いタイム(を出した人)が勝利する競走 @ja-jp
definition: Prova que consiste em correr 600 m. Ganha o tempo mais rápido. @pt-pt
definition: Rennen über 600 Meter, wobei die schnellste Zeit gewinnt. @de
definition: compétition qui consiste à couvrir 600 m en un temps minimum. @fr
definition: Carrera de velocidad en 600 metros. @es
definition: Corsa di 600 m
definition: Race over 600 metres with the fastest time winning. @en-gb
note: nessuno
in scheme: Subject Code
created: 2000-10-30T12:00:00+00:00
modified: 2010-12-15T17:01:09+00:00
broader: Atletica leggera
broad match: http://cv.iptc.org/newscodes/mediatopic/20000838

600 yards
type: Concept
preferred label: 600 jardas @pt-br
preferred label: ６００ヤード @ja-jp
preferred label: 600 yardas @es
definition: Corsa di 600 yards
definition: Prova que consiste em correr 600 jardas. Ganha o tempo mais rápido. @pt-pt
definition: compétition qui consiste à couvrir 600 yards en un temps minimum. @fr
definition: Carrera de velocidad sobre 600 yardas. @es
definition: 600ヤードに渡り最も速いタイム(を出した人)が勝利する競走 @ja-jp
definition: Rennen über 600 Yards wobei die schnellste Zeit gewinnt. @de
definition: Race over 600 yards with the fastest time winning. @en-gb
note: nessuno
in scheme: Subject Code
created: 2000-10-30T12:00:00+00:00
modified: 2010-12-15T17:01:09+00:00
broader: Atletica leggera
broad match: http://cv.iptc.org/newscodes/mediatopic/20000838

880 jardas
type: Concept
preferred label: 880 yardas @es
preferred label: 880 yards
preferred label: ８８０ヤード @ja-jp
definition: Race over 880 yards with the fastest time winning. @en-gb
definition: Prova que consiste em correr 880 jardas. Ganha o tempo mais rápido. @pt-pt
definition: 880ヤードに渡り最も速いタイム(を出した人)が勝利する競走 @ja-jp
definition: Carrera de velocidad para distancia de 880 yardas. @es
definition: compétition qui consiste à couvrir 880 yards en un temps minimum. @fr
definition: Rennen über 880 yards, wobei die schnellste Zeit gewinnt. @de
definition: Corsa di 880 yards
note: nessuno
in scheme: Subject Code
created: 2000-10-30T12:00:00+00:00
modified: 2010-12-15T17:01:09+00:00
broader: Atletica leggera
broad match: http://cv.iptc.org/newscodes/mediatopic/20000838

1000 yards
type: Concept
preferred label: 1000 yardas @es
preferred label: 1000 jardas @pt-br
preferred label: １０００ヤード @ja-jp
definition: Prova que consiste em correr 1000 jardas. Ganha o tempo mais rápido. @pt-pt
definition: compétition qui consiste à couvrir 1000 yards en un temps minimum. @fr
definition: Race over 1000 yards with the fastest time winning. @en-gb
definition: 1000ヤードに渡り最も速いタイム(を出した人)が勝利する競走 @ja-jp
definition: Carrera de 1000 yardas en el menor tiempo posible. @es
definition: Corsa di 1000 yards
definition: Rennen über 1000 Yards wobei die schnellste Zeit gewinnt. @de
note: nessuno
in scheme: Subject Code
created: 2000-10-30T12:00:00+00:00
modified: 2010-12-15T17:01:09+00:00
broader: Atletica leggera
broad match: http://cv.iptc.org/newscodes/mediatopic/20000838

2 miglia
type: Concept
preferred label: 2 milhas @pt-br
preferred label: 2 miles @fr
preferred label: 2 millas @es
preferred label: 2 Meilen @de
preferred label: ２マイル @ja-jp
definition: Carrera de velocidad en 2 millas. @es
definition: Race over two miles with the fastest time winning. @en-gb
definition: Prova que consiste em correr 2 milhas. Ganha o tempo mais rápido. @pt-br
definition: 2マイルに渡り最も速いタイム(を出した人)が勝利する競走 @ja-jp
definition: Corsa di 2 miglia
definition: Rennen über 2 Meilen, wobei die schnellste Zeit gewinnt. @de
definition: compétition qui consiste à couvrir 2 miles en un temps minimum. @fr
note: nessuno
in scheme: Subject Code
created: 2000-10-30T12:00:00+00:00
modified: 2010-12-15T17:01:09+00:00
broader: Atletica leggera
broad match: http://cv.iptc.org/newscodes/mediatopic/20000836

3 miglia
type: Concept
preferred label: 3 miles @fr
preferred label: ３マイル @ja-jp
preferred label: 3 milhas @pt-br
preferred label: 3 Meilen @de
preferred label: 3 millas @es
definition: Rennen über 3 Meilen, wobei die schnellste Zeit gewinnt. @de
definition: Corsa di 3 miglia
definition: 3マイルに渡り最も速いタイム(を出した人)が勝利する競走 @ja-jp
definition: Prova que consiste em correr 3 milhas. Ganha o tempo mais rápido. @pt-pt
definition: Carrera de velocidad en 3 millas. @es
definition: compétition qui consiste à couvrir 3 miles en un temps minimum. @fr
definition: Race over three miles with the fastest time winning. @en-gb
note: nessuno
in scheme: Subject Code
created: 2000-10-30T12:00:00+00:00
modified: 2010-12-15T17:01:09+00:00
broader: Atletica leggera
broad match: http://cv.iptc.org/newscodes/mediatopic/20000836

6 miglia
type: Concept
preferred label: 6 milhas @pt-br
preferred label: 6 miles @en-gb
preferred label: ６マイル @ja-jp
preferred label: 6 Meilen @de
preferred label: 6 millas @es
definition: Race over six miles with the fastest time winning. @en-gb
definition: Carrera de velocidad en 6 millas . @es
definition: Prova que consiste em correr 6 milhas. Ganha o tempo mais rápido. @pt-pt
definition: compétition qui consiste à couvrir 6 miles en un temps minimum. @fr
definition: 6マイルに渡り最も速いタイム(を出した人)が勝利する競走 @ja-jp
definition: Rennen über 6 Meilen, wobei die schnellste Zeit gewinnt. @de
definition: Corsa di 6 miglia
note: nessuno
in scheme: Subject Code
created: 2000-10-30T12:00:00+00:00
modified: 2010-12-15T17:01:09+00:00
broader: Atletica leggera
broad match: http://cv.iptc.org/newscodes/mediatopic/20000836

4x1 miglio
type: Concept
preferred label: 4x1 milha @pt-pt
preferred label: 4x1 mile @en-gb
preferred label: ４マイルリレー @ja-jp
preferred label: Relais 4x1 mile @fr
preferred label: 4x1 milla @es
preferred label: 4x1 Meile @de
definition: Corrida de equipa em que 4 corredores fazem 1 milha cada um. @pt-pt
definition: Corrida de equipe em que 4 corredores fazem 1 milha cada um. @pt-br
definition: Staffetta con 4 atleti per squadra che corrono per un miglio ciascuno
definition: Mannschaftsrennen mit vier Läufern in jedem Team über eine Meile. @de
definition: 各チーム4人の走者が1マイルずつを走るリレー競技 @ja-jp
definition: Team Relay race with four runners on each team running for one mile. @en-gb
definition: épreuve par équipes de quatre coureurs sur 1 mile @fr
definition: Carrera de relevos por equipo, con 4 atletas por equipo corriendo por 1 milla. @es
note: nessuno
in scheme: Subject Code
created: 2000-10-30T12:00:00+00:00
modified: 2010-12-15T17:01:09+00:00
broader: Atletica leggera
broad match: http://cv.iptc.org/newscodes/mediatopic/20000842

Pentathlon
type: Concept
preferred label: Fünfkampf @de
preferred label: pentathlon @en-gb
preferred label: 五種競技 @ja-jp
preferred label: pentatlo @pt-pt
preferred label: pentatlon @es
definition: Competição em pista fechada composta por 60 m barreiras, salto em altura, arremesso de peso, salto em distância, 800 m. @pt-br
definition: Competizione su cinque prove: 60 ostacoli, salto in alto, lancio del giavellotto, salto in lungo, 800 metri
definition: Only indoor, 60m hurdles, high jump, shot put, long jump, 800 m @en-gb
definition: Competição em pista fechada composta por 60 m barreiras, salto em altura, lançamento do peso, salto em comprimento, 800 m. @pt-pt
definition: Epreuve en salle comprenant un 60 m haies, du saut en hauteur, lancer du poids, saut en longueur et un 800 m @fr
definition: Competición en sala compuesto por un 60m vallas, salto de altura, lanzamiento de bala, salto en largo y 800 metros @es
definition: Aktuell bei DM/EM/WM in der Halle: 60 m Hürden, Hochsprung, Kugelstoßen, Weitsprung und 800 m. @de
definition: 室内のみ、60mハードル、走り高跳び、砲丸投げ、走り幅跳び、800m走 @ja-jp
note: nessuno
in scheme: Subject Code
created: 2004-04-22T12:00:00+00:00
modified: 2012-07-10T12:00:00+00:00
broader: Atletica leggera

Major League - American League
type: Concept
preferred label: Major League Baseball - liga americana @pt-br
preferred label: American League @fr
preferred label: liga mayor de béisbol (profesional estadounidense) - liga americana @es
preferred label: Major League Baseball (North American Professional) - American League @en-gb
preferred label: ＭＬＢア・リーグ @ja-jp
definition: Baseball Liga bestehend aus 14 Teams. @de
definition: Lega professionisti formata da 14 squadre
definition: Liga de béisbol compuesta por 14 equipos. @es
definition: 14チームで構成される野球のリーグ @ja-jp
definition: Liga de beisebol composta por 14 equipas. @pt-pt
definition: Liga de beisebol composta por 14 equipes. @pt-br
definition: Baseball league comprising 14 teams. @en-gb
definition: une des 2 ligues de la Major League de Base-ball composée de 14 équipes @fr
note: nessuno
in scheme: Subject Code
created: 2000-10-30T12:00:00+00:00
modified: 2010-12-15T17:01:09+00:00
broader: Baseball
broad match: http://cv.iptc.org/newscodes/mediatopic/20000849

Major League - National League
type: Concept
preferred label: Major League Baseball (North American Professional) - National League @de
preferred label: Major League Baseball - liga nacional @pt-pt
preferred label: ＭＬＢナ・リーグ @ja-jp
preferred label: liga mayor de béisbol (profesional estadounidense) - liga nacional. @es
preferred label: National League @fr
definition: Liga de beisebol composta por 16 equipes. @pt-br
definition: Liga de beisebol composta por 16 equipas. @pt-pt
definition: 16チームで構成される野球のリーグ @ja-jp
definition: une des 2 ligues de la Major League de Base-ball composée de 16 équipes @fr
definition: Baseball league comprising 16 teams. @en-gb
definition: Baseball Liga bestehend aus 16 Teams. @de
definition: Lega professionisti formata da 16 squadre
definition: Liga de béisbol compuesta por 16 equipos. @es
note: nessuno
in scheme: Subject Code
created: 2000-10-30T12:00:00+00:00
modified: 2010-12-15T17:01:09+00:00
broader: Baseball
broad match: http://cv.iptc.org/newscodes/mediatopic/20000849

Major League - special
type: Concept
preferred label: liga mayor de béisbol - especial (de las principales estrellas). @es
preferred label: Major League Baseball (North American Professional) - Spezial (z.B. All-Star, World Series) @de
preferred label: Special @fr
preferred label: Major League Baseball - liga especial @pt-br
preferred label: ＭＬＢオールスター @ja-jp
preferred label: Major League Baseball (North American Professional) - Special (e.g. All-Star, World Series) @en-gb
definition: Baseball competition other than the World Series. @en-gb
definition: Altri tipi di competizione
definition: Competición de béisbol distinta a la serie mundial. @es
definition: Baseball Wettbewerb außerhalb der Wold Series. @de
definition: compétition de base-ball autre que le world series @fr
definition: Competição de beisebol diferente da World Series. @pt-pt
definition: ワールドシリーズ以外の野球の試合 @ja-jp
note: nessuno
in scheme: Subject Code
created: 2000-10-30T12:00:00+00:00
modified: 2010-12-15T17:01:09+00:00
broader: Baseball
broad match: http://cv.iptc.org/newscodes/mediatopic/20000849

Baseball palla gomma
type: Concept
preferred label: rubberball baseball @en-gb
preferred label: béisbol con pelota blanda. @es
preferred label: Rubberball @de
preferred label: 軟式野球 @ja-jp
preferred label: Rubberball baseball @fr
preferred label: beisebol de bola de borracha @pt-br
definition: También llamado softball o béisbol blando, se juega con pelota de goma de menor grado de dureza, dependiendo de las edades o categorías de los jugadores. @es
definition: Sometimes called ''soft baseball,'' the game is played with a rubber baseball of varying degrees of hardness depending upon the age and level of the players. @en-gb
definition: Manchmal als *Softbaseball* bezeichnet, das Spiel wird mit einem gummierten Ball unterschiedlicher Härte, abhängig vom Alter und der Spielstärke der Spieler durchgeführt. @de
definition: 時々*soft baseball*と呼ばれ、ゲームはプレーヤーの年代とレベルによって硬度を変えたゴム製の野球ボールで行われる @ja-jp
definition: jeu de base-ball pratiquée avec une balle de caoutchouc @fr
definition: Chiamato a volte ‘soft baseball',si gioca con una palla di gomma di vari gradi di durezza in base a età e livello dei giocatori
definition: *Também denominado **soft baseball**, é um jogo de beisebol disputado com uma bola de borracha de dureza variável, dependendo das idades e níveis dos jogadores.* @pt-pt
definition: *Também denominado **soft baseball**, é um jogo de beisebol disputado com uma bola de borracha de dureza variável, dependendo das idades ou níveis dos jogadores.* @pt-br
note: nessuno
in scheme: Subject Code
created: 2000-10-30T12:00:00+00:00
modified: 2010-12-15T17:01:09+00:00
broader: Baseball

Major League Playoffs
type: Concept
preferred label: Major League Baseball Playoffs @pt-br
preferred label: Playoffs @fr
preferred label: playoffs de la liga mayor de béisbol @es
preferred label: ＭＬＢプレーオフ @ja-jp
definition: Consists of several rounds of play to determine representatives to the U.S.-based World Series @en-gb
definition: 米国を拠点として開催されるワールドシリーズの代表チームを決めるために行われる数試合のこと @ja-jp
definition: Fase final de classificação que consiste em vários encontros para determinar os representantes da World Series de beisebol norte-americana. @pt-br
definition: chaque équipe dispute un championnat à l'intérieur de sa ligue de base-ball. A la fin de la saison ont lieu les play-offs @fr
definition: Besteht aus verschiedenen Spielrunden, um die Repräsentanten der U.S. World Series zu bestimmen. @de
definition: Turni di playoff della Major League
definition: Fase final de clasificación que consiste de varios encuentros, para determinar los representantes de Estados Unidos, tomando como base las series mundiales. @es
note: nessuno
in scheme: Subject Code
created: 2003-11-26T12:00:00+00:00
modified: 2012-07-10T12:00:00+00:00
broader: Baseball
broad match: http://cv.iptc.org/newscodes/mediatopic/20000849

World Series
type: Concept
preferred label: series mundiales @es
preferred label: ＭＬＢワールドシリーズ @ja-jp
definition: Definición de liga que consiste en una serie de siete juegos anuales, entre los dos mejores equipos de la Liga Americana y Nacional de Béisbol, para determinar el campeón. @es
definition: 米国を拠点として毎年行われる、メジャーリーグ野球に属する2つのチームで、総合チャンピオンを決めるために行われる一連の試合 @ja-jp
definition: les vainqueurs des plays-offs des deux ligues de base-ball s'affrontent dans un combat de 7 matches @fr
definition: U.S.-jährliche Serie von Spielen zwischen den zwei besten Teams der Major League Baseball, um die Besten zu ermitteln. @de
definition: Série de jogos anuais da World Series de beisebol norte-americana entre as duas primeiras equipes da Major League Baseball para determinar o campeão. @pt-br
definition: U.S.-based annual series of games between the top two teams of Major League Baseball to determine the overall champion @en-gb
definition: Série de jogos anuais da World Series de beisebol norte-americana entre as duas primeiras equipas da Major League Baseball para determinar o campeão. @pt-pt
definition: Finali fra i due vincitori dei playoff
note: nessuno
in scheme: Subject Code
created: 2003-11-26T12:00:00+00:00
modified: 2012-07-10T12:00:00+00:00
broader: Baseball
broad match: http://cv.iptc.org/newscodes/mediatopic/20000849

NBA
type: Concept
preferred label: nba - asociación nacional de básquetbol (profesional estadounidense) @es
preferred label: ＮＢＡ @ja-jp
preferred label: National Basketball Association (North American Professional) @en-gb
preferred label: National Basketball Association (NBA, North American Professional) @de
definition: A NBA é a organização que gere o basquete profissional nos Estados Unidos. A NBA é formada por duas conferências (Este e Oeste) e por 4 divisões (Atlântica e Central para Este, Centro-oeste e Pacífico para Oeste). @pt-br
definition: La National Basket Association (NBA) gère le basket professionnel américain. 2 conférences (est, ouest), 4 divisions ( Atlantique et Centrale pour l'est et Centre-Ouest et Pacifique pour l'ouest), @fr
definition: The NBA is the umbrella organisation running professional basketball in the United States. The NBA is made up of two conferences (east and west), four divisions (Atlantic and Central for the East, and Midwest and Pacific for the west). @en-gb
definition: A NBA é a organização que gere o basquetebol profissional nos Estados Unidos. A NBA é formada por duas conferências (Este e Oeste) e por 4 divisões (Atlântica e Central para Este, Centro-Oeste e Pacífico para Oeste). @pt-pt
definition: NBAは米国でプロバスケットボールを管理する組織である。NBAは(東部と西部)の2つの連盟、4つのディビジョン(東部にはアトランティックとセントラル、そして西部にはミッドウェストとパシフィック)がある @ja-jp
definition: La NBA es la organización que nuclea el básquetbol profesional en los Estados Unidos. Está compuesta de dos conferencias (Este y Oeste) y cuatro divisiones (Atlántico y Central para el Este, Medioeste y Pacífico para el Oeste). @es
definition: Die NBA ist der Dachverband des professionellen Basketball in den USA. Die NBA besteht aus zwei Konferenzen (ost und west), 4 Abteilungen (Atlantik und Zentral für den Osten, Mittelwesten und Pazifik für den Westen). @de
definition: National Basketball Association, la pallacanestro professionale negli Stati Uniti.
note: typo fixed in Explanation @en-gb
note: nessuno
in scheme: Subject Code
created: 2000-10-30T12:00:00+00:00
modified: 2010-12-15T17:01:09+00:00
broader: Basket
broad match: http://cv.iptc.org/newscodes/mediatopic/20000851

Professionale femminile
type: Concept
preferred label: 女子プロバスケットリーグ @ja-jp
preferred label: Ligue professionnelle féminine @fr
preferred label: WNBA @pt-br
preferred label: liga profesional femenina @es
preferred label: professional - Women general @en-gb
preferred label: Professional - Frauen allgemein @de
definition: Liga de basquetebol profissional feminino. @pt-pt
definition: Professionelle Liga der Frauen. @de
definition: Liga de basquete profissional feminino. @pt-br
definition: Liga Profesional Femenina @es
definition: 女子のプロリーグ @ja-jp
definition: Lega professionale femminile
definition: ligue professionnelle féminine. @fr
definition: Women's professional league @en-gb
note: nessuno
in scheme: Subject Code
created: 2000-10-30T12:00:00+00:00
modified: 2010-12-15T17:01:09+00:00
broader: Basket
broad match: http://cv.iptc.org/newscodes/mediatopic/20000851

Netball svizzero
type: Concept
preferred label: Swiss netball @en-gb
preferred label: netball suíço @pt-br
preferred label: Netball suisse @fr
preferred label: netball suizo @es
preferred label: スイス・ネットボール @ja-jp
preferred label: Schweizer Korbball @de
definition: バスケットボールに似ているが、ゴールには板がついてない。主に女性が行う @ja-jp
definition: Esporte feminino semelhante ao basquetebol, mas sem tabela para sustentar o cesto e regras suíças. @pt-br
definition: Similar al básquetbol, pero sin tablero. Principalmente jugado por mujeres. @es
definition: Ähnlich dem Basketball. Der Korb ist ohne Brett. Wird hauptsächlich von Frauen gespielt. @de
definition: Desporto feminino semelhante ao basquetebol, mas sem tabela para sustentar o cesto e regras suíças. @pt-pt
definition: Similar to Basketball. Basket without a board. Mainly executed by women @en-gb
definition: Simile alla pallacanestro, ma privo dell'asse di sostegno del canestro. Praticato principalmente da donne
definition: Sport féminin similaire au basket-ball, mais sans planche pour soutenir le panier appliquant les réglements suisses. @fr
note: nessuno
in scheme: Subject Code
created: 2003-11-26T12:00:00+00:00
modified: 2012-07-10T12:00:00+00:00
broader: Basket
broad match: http://cv.iptc.org/newscodes/mediatopic/20001010

Netball tedesco
type: Concept
preferred label: netball alemão @pt-pt
preferred label: ドイツ・ネットボール @ja-jp
preferred label: Netball allemand @fr
preferred label: German netball @en-gb
preferred label: netball alemán @es
preferred label: Deutscher Korbball @de
definition: Igual al Netball suizo, pero con reglas alemanas. @es
definition: Sport féminin similaire au basket-ball, mais sans planche pour soutenir le panier appliquant les réglements allemands @fr
definition: Simile al netball svizzero ma con specifiche regole tedesche
definition: Same as Swiss Netball, but with specific German rules @en-gb
definition: Das gleiche wie Schweizer Korbball, aber mit eigenen deutschen Regeln. @de
definition: O mesmo que o netball suíço, mas com regras alemãs específicas. @pt-pt
definition: スイスネットボールと同じ、しかしドイツ特有のルールを伴う @ja-jp
note: nessuno
in scheme: Subject Code
created: 2003-11-26T12:00:00+00:00
modified: 2012-07-10T12:00:00+00:00
broader: Basket
broad match: http://cv.iptc.org/newscodes/mediatopic/20001010

Netball olandese
type: Concept
preferred label: Netball néerlandais @fr
preferred label: netball holandés @es
preferred label: オランダ・ネットボール @ja-jp
preferred label: netball holandês @pt-br
preferred label: Niederländischer Korbball @de
preferred label: Dutch netball @en-gb
definition: Sport féminin similaire au basket-ball, mais sans planche pour soutenir le panier appliquant les réglements néerlandais @fr
definition: スイスネットボールと同じ、しかしオランダ特有のルールを伴う @ja-jp
definition: Same as Swiss Netball, but with specific Dutch rule @en-gb
definition: Simile al netball svizzero ma con specifiche regole olandesi
definition: O mesmo que o netball suíço, mas com regras holandesas específicas. @pt-br
definition: Similar al Netball suizo, pero con reglas holandesas. @es
definition: Das gleiche wie Schweizer Korbball, aber mit eigenen niederländischen Regeln. @de
note: nessuno
in scheme: Subject Code
created: 2003-11-26T12:00:00+00:00
modified: 2012-07-10T12:00:00+00:00
broader: Basket
broad match: http://cv.iptc.org/newscodes/mediatopic/20001010

7,5 km
type: Concept
preferred label: ７．５ｋｍ @ja-jp
preferred label: 7.5 km @pt-pt
preferred label: esquí 7,5 km @es
preferred label: Sprint der Damen @de
definition: Epreuve de sprint disputée contre la montre. Les concurrents s'élancent toutes les 30 secondes pour 3 tours de circuit sur 7,5 km. @fr
definition: Timed cross country skiing race. Competitors set off at 30sec intervals for three circuits totalling 7.5km. @en-gb
definition: 時間を競うクロスカントリースキーレース。競技者は30秒間隔で合計で7.5kmの3つのコースに出発する @ja-jp
definition: Competizione in cui i concorrenti partono ad intervalli di 30 secondi uno dall'altro per compiere tre giri per un totale di 7,5 km
definition: Corrida de esqui de fundo em contrarrelógio. Os participantes partem com intervalos de 30 segundos para 3 circuitos, num total de 7.5 km. @pt-pt
definition: Carrera de esquí a campo traviesa contrarreloj. Cada competidor recorre 7.500 m en tres circuitos, separados por intervalos de 30 segundos cada uno. @es
definition: Rennen mit drei Runden. Es wird zwischen den Runden einmal liegend, einmal stehend geschossen. Pro Fehlschuss muss eine Strafrunde gelaufen werden. @de
definition: Corrida de esqui de fundo contra o relógio. Os participantes partem com intervalos de 30 segundos para 3 circuitos, num total de 7.5 km. @pt-br
note: nessuno
in scheme: Subject Code
created: 2000-10-30T12:00:00+00:00
modified: 2010-12-15T17:01:09+00:00
broader: biatlón
broad match: http://cv.iptc.org/newscodes/mediatopic/20000852

10 Km
type: Concept
preferred label: 10 km @pt-pt
preferred label: １０ｋｍ @ja-jp
preferred label: Sprint der Herren @de
definition: Corrida de velocidade para homens, de perseguição para mulheres. @pt-pt
definition: Epreuve de sprint pour les hommes, de poursuite pour les femmes @fr
definition: 男子はスプリントレース、女子は追跡 @ja-jp
definition: Competizione di velocità per gli uomini e di inseguimento per le donne
definition: Rennen mit drei Runden. Es wird zwischen den Runden einmal liegend, einmal stehend geschossen. Pro Fehlschuss muss eine Strafrunde gelaufen werden. @de
definition: Carrera de velocidad para hombres, en 10 km, con largada posterior de mujeres @es
definition: Sprint races for men, pursuit for women. @en-gb
note: nessuno
in scheme: Subject Code
created: 2000-10-30T12:00:00+00:00
modified: 2010-12-15T17:01:09+00:00
broader: biatlón
broad match: http://cv.iptc.org/newscodes/mediatopic/20000852

15 Km
type: Concept
preferred label: 15 km @es
preferred label: Einzelrennen der Damen @de
preferred label: 7.5 km @pt-pt
preferred label: １５ｋｍ @ja-jp
definition: Competizione di velocità femminile sotto forma di inseguimento in tre giri con le concorrenti fatte partire ad intervalli di un minuto una dall'altra
definition: Competição individual feminina em formato de velocidade, disputada em três voltas, num total de 7.5 km. As participantes partem com intervalos de 1 minuto. @pt-pt
definition: Individual women's race in sprint format staged over three laps with competitors setting off at intervals of a minute. @en-gb
definition: 競技者が、1分おきに出発して3周回する、女子個人のスプリント競技 @ja-jp
definition: course individuelle dames, disputée sur le modèle du sprint avec 3 boucles de circuit. Les concurrents s'élancent toutes les minutes. @fr
definition: Rennen über fünf Runden. Es wird zwischen den Runden abwechselnd je zweimal liegend und stehend auf fünf Ziele geschossen. Jeder Fehlschuss wird durch eine Strafminute kompensiert. @de
definition: Carrera individual para damas disputada en la modalidad sprint, que consiste en etapas de tres vueltas al circuito de 15 km. Las competidoras largan con intervalos de un minuto. @es
note: typo fixed in Explanation @en-gb
note: nessuno
in scheme: Subject Code
created: 2000-10-30T12:00:00+00:00
modified: 2010-12-15T17:01:09+00:00
broader: biatlón
broad match: http://cv.iptc.org/newscodes/mediatopic/20000852

20 Km
type: Concept
preferred label: 20 km @pt-br
preferred label: Einzelrennen der Herren @de
preferred label: ２０ｋｍ @ja-jp
definition: Competição individual masculina em formato de velocidade, disputada em três voltas, num total de 20 km. Os participantes partem com intervalos de 1 minuto. @pt-pt
definition: Competizione di velocità individuale maschile in cinque giri dove i concorrenti partono ad intervalli di un minuto uno dall'altro
definition: Individual men's race in sprint format staged over five laps with competitors setting off at intervals of a minute. @en-gb
definition: course individuelle hommes, disputée sur le modèle du sprint avec 5 boucles de circuit. Les concurrents s'élancent toutes les minutes. @fr
definition: Rennen über fünf Runden. Es wird zwischen den Runden abwechselnd je zweimal liegend und stehend auf fünf Ziele geschossen. Jeder Fehlschuss wird durch eine Strafminute kompensiert. @de
definition: 競技者が、1分おきに出発して5周回する、男子個人のスプリント競技 @ja-jp
definition: Carrera individual para hombres en la modalidad sprint, que consiste en etapas de cinco vueltas al circuito de 20 km, a intervalos de un minuto @es
note: nessuno
in scheme: Subject Code
created: 2000-10-30T12:00:00+00:00
modified: 2010-12-15T17:01:09+00:00
broader: biatlón
broad match: http://cv.iptc.org/newscodes/mediatopic/20000852

Staffetta 4 x 7,5 km
type: Concept
preferred label: ３０ｋｍリレー @ja-jp
preferred label: 4x7.5 km relay @en-gb
preferred label: 4x7.5 km revezamento @pt-br
preferred label: Relais 4x7.5 km @fr
preferred label: Staffelrennen @de
preferred label: relevo de 4x7,5 km @es
preferred label: 4x7.5 km estafetas @pt-pt
definition: Equipas compostas de 4 biatletas que cobrem uma distância de 7.5 km cada um com duas rondas de tiro ao alvo. @pt-pt
definition: Squadre formate da quattro atleti di biathlon e ciascuna deve coprire una distanza di 7,5 km con due cicli di tiro al bersaglio
definition: 各チーム4人のバイアスロン選手で構成され、1人が2ラウンドのターゲット射撃を含む7.5kmの距離を受け持つチーム競技 @ja-jp
definition: Equipes compostas de 4 biatletas que cobrem uma distância de 7.5 km cada um com duas rondas de tiro ao alvo. @pt-br
definition: Consiste en equipos de cuatro biatletas, que cubren una distancia de 7,5 km cada uno, con dos rondas de tiro al blanco. @es
definition: Teams consisting of four biathletes with each team covering a distance of 7.5km with two rounds of target shooting. @en-gb
definition: Le relais : Chaque équipe est composée de 4 biathlètes. Chacun parcourt 7,5 km et participe à 2 séances de tir. Le départ est groupé @fr
definition: Teams mit vier Biathleten pro Mannschaft, die eine Teilstrecke von drei Runden mit 7,5 km (Herren) oder 6 km (Damen) abdecken. Es wird zwischen den Runden einmal liegend und einmal stehend auf fünf Ziele geschossen. Es gibt drei Nachladepatronen. Reichen die nicht aus, muss pro Fehlschuss eine Strafrunde gelaufen werden. @de
note: nessuno
in scheme: Subject Code
created: 2000-10-30T12:00:00+00:00
modified: 2010-12-15T17:01:09+00:00
broader: biatlón
broad match: http://cv.iptc.org/newscodes/mediatopic/20000852

Inseguimento 12,5 km
type: Concept
preferred label: persecución 12,5 km @es
preferred label: １２．５ｋｍ追い抜き @ja-jp
preferred label: Mixed Staffel @de
preferred label: 15.5 km perseguição @pt-pt
preferred label: Poursuite 12.5 km @fr
preferred label: 12.5 km pursuit @en-gb
definition: スプリントの結果でスタート順が決まる。レースはターゲット射撃(立ったまま又はうつ伏せ)を含み5周続ける @ja-jp
definition: A largada é determinada pelos resultados da corrida de velocidade. Corrida disputada em 5 voltas ao circuito e com rondas de tiro ao alvo (de pé ou deitado). @pt-br
definition: A ordem de partida é determinada pelos resultados da corrida de velocidade. Corrida disputada em 5 voltas ao circuito e com rondas de tiro ao alvo (de pé ou deitado). @pt-pt
definition: Teams mit vier Biathleten mit je zwei Damen und zwei Herren pro Mannschaft, die eine Teilstrecke von 3 Runden mit 7,5 km (Herren) oder 6 km (Damen) abdecken. Es wird zwischen den Runden einmal liegend und einmal stehend auf fünf Ziele geschossen. Es gibt drei Nachladepatronen. Reichen die nicht aus, muss pro Fehlschuss eine Strafrunde gelaufen werden. @de
definition: La partenza è determinata dai risultati dell'inseguimento
definition: Poursuite: Le départ est déterminé par les résultats du sprint. Course disputée sur 5 tours de circuit et entrecoupée de séances de tir (debout ou couché). @fr
definition: La largada se determina por los resultados del sprint. Una carrera lleva 5 rondas intercaladas por posiciones de tiro al blanco ( de pie o acostado). @es
definition: The start is determined by the results from the sprint. A race held over five laps with target shooting (standing or prone) @en-gb
note: nessuno
in scheme: Subject Code
created: 2000-10-30T12:00:00+00:00
modified: 2010-12-15T17:01:09+00:00
broader: biatlón
broad match: http://cv.iptc.org/newscodes/mediatopic/20000852

8-ball
type: Concept
preferred label: ８ボール @ja-jp
preferred label: 8 bolas @es
preferred label: 8er Ball @de
preferred label: 8 ball @fr
definition: Le jeu de la huit se joue avec 15 boules et une blanche. Un joueur doit rentrer le groupe de boules numérotées de 1 à 7, ou les billes pleines, tandis que l'autre doit rentrer les billes numérotées de 9 à 15, ou les rayées, puis la noire. @fr
definition: Juego de 15 bolas numeradas o diferenciadas y 1 blanca. El primer jugador tiene como objetivo embocar las bolas numeradas del 1 al 7( lisas) y el segundo las numeradas del 9 al 15 (o rayadas). Luego, el primero que emboca la bola negra gana. @es
definition: A game using 15 balls and a white. The first player aims to pot the balls numbered 1-7 (solids) with the second player potting balls 9-15 (stripes). After that the first player to pot the black wins. @en-gb
definition: Spiel mit 15 Bälle und einem weißen. Der erste Spieler versucht die Bälle mit der Nummer 1-7 (uni), der zweite Spieler die Bälle 9-15 (gestreift) einzulochen. Danach gewinnt der Spieler, der die schwarze Kugel zuerst einlocht. @de
definition: Jogo de 15 bolas numeradas e uma branca. O primeiro jogador deve tentar introduzir no buraco as bolas numeradas de 1 a 7 e o segundo as bolas de 9 a 15. Depois disso, ganha quem introduzir a bola preta (8). @pt-pt
definition: Gioco a 15 palle, in cui andranno messe in buca o le piene o le mezze, lasciando la 8 per ultima.
definition: Jogo de 15 bolas numeradas e uma branca. O primeiro jogador deve tentar introduzir no buraco as bolas numeradas 1-7 e o segundo as bolas 9-15. Depois disso, ganha quem introduzir a bola preta. @pt-br
definition: 15個の玉と 1つの白玉を使用する競技。最初の競技者は1から7番の玉(模様なし)をポケットに狙い、2番目の競技者は9から15番の玉(縦縞)をポケットに入れる。その後黒玉を最初にポケットに入れた競技者の勝ち @ja-jp
note: nessuno
in scheme: Subject Code
created: 2000-10-30T12:00:00+00:00
modified: 2010-12-15T17:01:09+00:00
broader: Biliardo, snooker e pool
broad match: http://cv.iptc.org/newscodes/mediatopic/20001015

9 palle
type: Concept
preferred label: 9 bolas @es
preferred label: 9 ball @fr
preferred label: 9er Ball @de
preferred label: ９ボール @ja-jp
definition: Jogo de 9 bolas numeradas e uma branca. A cada jogada, o jogador deve acertar primeiro na bola com o número mais baixo, mesmo que não seja ela a entrar no buraco. @pt-br
definition: Le jeu de la neuf se joue avec 9 billes numérotées de 1 à 9 et une blanche. A chaque coup, la première boule touchée doit être celle qui a le plus faible numéro, même si celle-ci ne doit pas être forcément celle que l'on rentre. @fr
definition: Spiel mit neun Kugeln 1-9 und einer weißen. Bei jeder Runde muss der Spieler die Kugel mit der geringsten Zahl einlochen. @de
definition: 1から9の数字が書かれた9個のボールと白いボールを使うゲーム。各々交代で、番号の一番小さいボールを突く @ja-jp
definition: A game played with nine balls numbered 1-9, and a white. On each turn the player must hit the lowest numbered ball. @en-gb
definition: Gioco in cui ci sono nove palle numerate ed una bianca. Il giocatore deve colpire, a turno, la palla con il numero più basso.
definition: Juego en el que se utilizan 9 bolas numeradas del 1 al 9 y una blanca. En cada turno el jugador debe golpear la bola de menor número. @es
note: nessuno
in scheme: Subject Code
created: 2000-10-30T12:00:00+00:00
modified: 2010-12-15T17:01:09+00:00
broader: Biliardo, snooker e pool
broad match: http://cv.iptc.org/newscodes/mediatopic/20001015

14.1
type: Concept
preferred label: 14/1 endlos @de
preferred label: １４．１コンティニュアス @ja-jp
preferred label: 14.1 continu @fr
preferred label: 14.1 continuo @es
definition: 競技者が指定したボールをポケットに突き入れる。それが成功した時、得点が貰える。それが失敗するまで続けることができる。15個目のボールを打つ前に再び14個の球を三角形枠で準備して競技する @ja-jp
definition: Le joueur doit indiquer la boule à rentrer et la poche correspondante. Il obtient un point pour chaque boule légalement rentrée et continue tant qu'il n'a pas raté son coup. Celui qui atteint le premier le score prédéterminé (150 habituellement) a gagné. @fr
definition: O jogador indica a bola que pretende introduzir e em que buraco, somando pontos por cada tacada bem-sucedida e continuando até cometer um erro. Ganha o jogador que atingir a pontuação predeterminada (geralmente 150 pontos). @pt-br
definition: A player nominates the ball he is attempting to pot and into which pocket. He collects points for each successful hit. He continues until he makes a mistake. Before hitting the 15th ball, the 14 reds are set up again in the triangle. @en-gb
definition: Der Spieler gibt an, welche Kugel er in welches Loch spielen will. Er sammelt Punkte für jeden erfolgreichen Versuch, solange bis er einen Fehler macht. Bevor er den 15ten Ball einlocht, werden die 14 anderen wieder in die Triangel gelegt. @de
definition: Un jugador selecciona una bola a introducir en el hoyo, sumando puntos en cada golpe exitoso. El mismo continúa hasta que cometa un error. El jugador que alcance la marca predeterminada de 150 pts. se lleva la victoria. @es
definition: Un giocatore indica la palla che cerca di imbucare e in quale buca e colleziona punti per ogni colpo finché non fa un errore
note: Explanation shortened @en-gb
note: nessuno
in scheme: Subject Code
created: 2000-10-30T12:00:00+00:00
modified: 2010-12-15T17:01:09+00:00
broader: Biliardo, snooker e pool
broad match: http://cv.iptc.org/newscodes/mediatopic/20001015

Continuo - ANNULLATO
type: Concept
preferred label: continuo @es
preferred label: contínuo-INATIVO @pt-br
preferred label: コンティニュアス-使用不可 @ja-jp
preferred label: continuous-DEPRECATED @en-gb
preferred label: Continuous @fr
preferred label: Endlos-GELÖSCHT @de
definition: NA @pt-br
definition: ANNULLATO
definition: --- @de
note: DEPRECATED in V 16 @en-gb
note: ANNULLATO in V 16
in scheme: Subject Code
created: 2000-10-30T12:00:00+00:00
retired: 2005-08-26T00:00:00+00:00
modified: 2010-12-15T17:01:09+00:00
broader: Biliardo, snooker e pool

Altri - ANNULLATO
type: Concept
preferred label: other-DEPRECATED @en-gb
preferred label: otra @es
preferred label: Freie Partie-GELÖSCHT @de
preferred label: その他-使用不可 @ja-jp
preferred label: outro-INATIVO @pt-br
preferred label: Other @fr
definition: --- @de
definition: ANNULLATO
definition: autre catégorie de jeu de billard @fr
definition: NA @pt-br
definition: Otra categoría del juego de billar @es
note: DEPRECATED in V 16 @en-gb
note: ANNULLATO in V 16
in scheme: Subject Code
created: 2000-10-30T12:00:00+00:00
retired: 2005-08-26T00:00:00+00:00
modified: 2010-12-15T17:01:09+00:00
broader: Biliardo, snooker e pool

Snooker
type: Concept
preferred label: スヌーカー @ja-jp
preferred label: snooker @pt-pt
preferred label: sinuca @pt-br
definition: Two players using a cue and a white ball to *sink* other coloured balls in a correct order on a baize table and to cause an opponent to miss-hit by positioning the white ball in an inappropriate place - snookering. @en-gb
definition: Biliardo inglese, giocato con stecca, 15 palle rosse, 6 di vari colori ed una bianca.
definition: *Dois jogadores usam um taco e uma bola branca para **afundar** no buraco as bolas coloridas de forma correta, dificultando a tarefa do adversário ao colocar a bola branca que ele deve bater em posições inapropriadas.* @pt-br
definition: Zwei Spieler benutzen einen Queue und eine weiße Kugel, um die anderen farbigen Kugeln in der richtigen Reihenfolge einzulochen. Wenn die farbigen Kugeln nicht auf direktem Wege angespielt werden können, wird der Spieler zu einer schwierigen Lösung gezwungen (gesnookert) @de
definition: ２人の競技者が緑のクロス張りのテーブル上で、キューにより白い玉を弾き、定められた順番に従い他の色の玉を穴に落とす。白い玉を不適切な位置に置くことで対抗者のミスを誘う @ja-jp
note: nessuno
in scheme: Subject Code
created: 2006-08-21T12:00:00+00:00
modified: 2012-07-10T12:00:00+00:00
broader: Biliardo, snooker e pool

Bob a due
type: Concept
preferred label: two-man sled @en-gb
preferred label: trineo doble @es
preferred label: Zweierbob @de
preferred label: Bob à deux @fr
preferred label: ２人乗り @ja-jp
preferred label: trenó de 2 @pt-br
definition: Discesa compiuta da squadre composte di due concorrenti
definition: Carrera en trineo que consiste en un equipo de dos competidores. @es
definition: race consisting of a team of two competitors @en-gb
definition: course avec un equipage à deux concurrents @fr
definition: Rennen mit einem Team aus zwei Wettkämpfern. @de
definition: Corrida de trenó com uma equipe de 2 participantes. @pt-br
definition: 2人1組で行われる競技 @ja-jp
definition: Corrida de trenó com uma equipa de 2 participantes. @pt-pt
note: nessuno
in scheme: Subject Code
created: 2000-10-30T12:00:00+00:00
modified: 2010-12-15T17:01:09+00:00
broader: bobsleigh
broad match: http://cv.iptc.org/newscodes/mediatopic/20000854

Bob a quattro
type: Concept
preferred label: ４人乗り @ja-jp
preferred label: four-man sled @en-gb
preferred label: Viererbob @de
preferred label: trenó de 4 @pt-pt
preferred label: trineo de cuatro @es
preferred label: Bob à quatre @fr
definition: Corrida de trenó com uma equipa de 4 participantes. @pt-pt
definition: race consisting of a team of four competitors @en-gb
definition: Corrida de trenó com uma equipe de 2 participantes. @pt-br
definition: Discesa compiuta da squadre composte di quattro concorrenti
definition: course avec un equipage à quatre concurrents @fr
definition: 4人1組で行われる競技 @ja-jp
definition: Carrera en trineo que consiste en un equipo de cuatro competidores. @es
definition: Rennen mit einem Team aus vier Wettkämpfern. @de
note: nessuno
in scheme: Subject Code
created: 2000-10-30T12:00:00+00:00
modified: 2010-12-15T17:01:09+00:00
broader: bobsleigh
broad match: http://cv.iptc.org/newscodes/mediatopic/20000854

Supermassimi
type: Concept
preferred label: スーパーヘビー級 @ja-jp
preferred label: peso superpesado @pt-pt
preferred label: Super-Schwergewicht @de
preferred label: super-heavyweight @en-gb
preferred label: Super-lourds @fr
definition: catégorie de poids variant selon les fédérations @fr
definition: Weight category in boxing which varies according to the federation @en-gb
definition: Gewichtsklasse im Boxen die je nach Verband variiert. @de
definition: 連盟による様々な体重別のカテゴリー @ja-jp
definition: Categoría de peso que varía de acuerdo a la federación. @es
definition: Categoria de peso que varia consoante a federação. @pt-br
definition: Categoria di peso che varia in base alla federazione
note: nessuno
in scheme: Subject Code
created: 2000-10-30T12:00:00+00:00
modified: 2010-12-15T17:01:09+00:00
broader: Pugilato
broad match: http://cv.iptc.org/newscodes/mediatopic/20000856

Massimi
type: Concept
preferred label: peso pesado @pt-br
preferred label: heavyweight @en-gb
preferred label: Lourds @fr
preferred label: ヘビー級 @ja-jp
preferred label: Schwergewicht @de
definition: Gewichtsklasse im Boxen die je nach Verband variiert. @de
definition: catégorie de poids variant selon les fédérations @fr
definition: Weight category in boxing which varies according to the federation @en-gb
definition: 連盟による様々な体重別のカテゴリー @ja-jp
definition: Categoría de peso que varía de acuerdo a la federación. @es
definition: Categoria de peso que varia consoante a federação. @pt-br
definition: Categoria di peso che varia in base alla federazione
note: nessuno
in scheme: Subject Code
created: 2000-10-30T12:00:00+00:00
modified: 2010-12-15T17:01:09+00:00
broader: Pugilato
broad match: http://cv.iptc.org/newscodes/mediatopic/20000856

Mediomassimi
type: Concept
preferred label: Mi-lourds @fr
preferred label: peso cruzador @pt-br
preferred label: cruiserweight @en-gb
preferred label: Halbschwergewicht @de
preferred label: peso crucero @es
preferred label: クルーザー級 @ja-jp
preferred label: peso cruzeiro @pt-pt
definition: Weight category in boxing which varies according to the federation @en-gb
definition: 連盟による様々な体重別のカテゴリー @ja-jp
definition: Categoría de peso que varía de acuerdo a la federación. @es
definition: Gewichtsklasse im Boxen die je nach Verband variiert. @de
definition: Categoria de peso que varia consoante a federação. @pt-pt
definition: catégorie de poids variant selon les fédérations @fr
definition: Categoria di peso che varia in base alla federazione
note: nessuno
in scheme: Subject Code
created: 2000-10-30T12:00:00+00:00
modified: 2010-12-15T17:01:09+00:00
broader: Pugilato
broad match: http://cv.iptc.org/newscodes/mediatopic/20000856

Massimi leggeri
type: Concept
preferred label: ライトヘビー級 @ja-jp
preferred label: Moyens @fr
preferred label: light-heavyweight @en-gb
preferred label: peso pesado ligero @es
preferred label: peso meio pesado @pt-br
preferred label: Leicht-Schwergewicht @de
definition: 連盟による様々な体重別のカテゴリー @ja-jp
definition: Weight category in boxing which varies according to the federation @en-gb
definition: Categoria de peso que varia consoante a federação. @pt-br
definition: Categoría de peso que varía de acuerdo a la federación. @es
definition: Categoria di peso che varia in base alla federazione
definition: catégorie de poids variant selon les fédérations @fr
definition: Gewichtsklasse im Boxen die je nach Verband variiert. @de
note: nessuno
in scheme: Subject Code
created: 2000-10-30T12:00:00+00:00
modified: 2010-12-15T17:01:09+00:00
broader: Pugilato
broad match: http://cv.iptc.org/newscodes/mediatopic/20000856

Supermedi
type: Concept
preferred label: スーパーミドル級 @ja-jp
preferred label: Super-Mittelgewicht @de
preferred label: peso supermediano @es
preferred label: peso supermédio @pt-br
preferred label: super-middleweight @en-gb
preferred label: Super mi-moyens @fr
definition: Categoria di peso che varia in base alla federazione
definition: Categoria de peso que varia consoante a federação. @pt-br
definition: 連盟による様々な体重別のカテゴリー @ja-jp
definition: Gewichtsklasse im Boxen die je nach Verband variiert. @de
definition: Weight category in boxing which varies according to the federation @en-gb
definition: catégorie de poids variant selon les fédérations @fr
definition: Categoría de peso que varía de acuerdo a la federación. @es
note: nessuno
in scheme: Subject Code
created: 2000-10-30T12:00:00+00:00
modified: 2010-12-15T17:01:09+00:00
broader: Pugilato
broad match: http://cv.iptc.org/newscodes/mediatopic/20000856

Medi
type: Concept
preferred label: ミドル級 @ja-jp
preferred label: peso médio @pt-pt
preferred label: Mittelgewicht @de
preferred label: middleweight @en-gb
preferred label: Mi-moyens @fr
preferred label: medio pesado @es
definition: Categoría de peso que varía de acuerdo a la federación. @es
definition: Categoria di peso che varia in base alla federazione
definition: catégorie de poids variant selon les fédérations @fr
definition: Categoria de peso que varia consoante a federação. @pt-pt
definition: Gewichtsklasse im Boxen die je nach Verband variiert. @de
definition: 連盟による様々な体重別のカテゴリー @ja-jp
definition: Weight category in boxing which varies according to the federation @en-gb
note: nessuno
in scheme: Subject Code
created: 2000-10-30T12:00:00+00:00
modified: 2010-12-15T17:01:09+00:00
broader: Pugilato
broad match: http://cv.iptc.org/newscodes/mediatopic/20000856

Medi leggeri
type: Concept
preferred label: peso médio ligeiro @pt-br
preferred label: Super légers @fr
preferred label: Leicht-Mittelgewicht @de
preferred label: ライトミドル級 @ja-jp
preferred label: light-middleweight @en-gb
preferred label: peso medioligero @es
definition: Gewichtsklasse im Boxen die je nach Verband variiert. @de
definition: Categoria de peso que varia consoante a federação. @pt-pt
definition: 連盟による様々な体重別のカテゴリー @ja-jp
definition: Categoria di peso che varia in base alla federazione
definition: Weight category in boxing which varies according to the federation @en-gb
definition: catégorie de poids variant selon les fédérations @fr
definition: Categoría de peso que varía de acuerdo a la federación. @es
note: nessuno
in scheme: Subject Code
created: 2000-10-30T12:00:00+00:00
modified: 2010-12-15T17:01:09+00:00
broader: Pugilato
broad match: http://cv.iptc.org/newscodes/mediatopic/20000856

Welter
type: Concept
preferred label: Weltergewicht @de
preferred label: Légers @fr
preferred label: welterweight @en-gb
preferred label: peso meio médio @pt-pt
preferred label: peso welter @es
preferred label: ウエルター級 @ja-jp
definition: Categoria de peso que varia consoante a federação. @pt-br
definition: Weight category in boxing which varies according to the federation @en-gb
definition: catégorie de poids variant selon les fédérations @fr
definition: Categoria di peso che varia in base alla federazione
definition: Gewichtsklasse im Boxen die je nach Verband variiert. @de
definition: Categoría de peso que varía de acuerdo a la federación. @es
definition: 連盟による様々な体重別のカテゴリー @ja-jp
note: nessuno
in scheme: Subject Code
created: 2000-10-30T12:00:00+00:00
modified: 2010-12-15T17:01:09+00:00
broader: Pugilato
broad match: http://cv.iptc.org/newscodes/mediatopic/20000856

Superleggeri
type: Concept
preferred label: ライトウエルター級 @ja-jp
preferred label: light-welterweight @en-gb
preferred label: peso meio médio leve @pt-br
preferred label: peso meio médio ligeiro @pt-pt
preferred label: Leicht-Weltergewicht @de
preferred label: peso welter ligero @es
preferred label: Super-plumes @fr
definition: Categoria di peso che varia in base alla federazione
definition: 連盟による様々な体重別のカテゴリー @ja-jp
definition: Categoria de peso que varia consoante a federação. @pt-br
definition: catégorie de poids variant selon les fédérations @fr
definition: Categoría de peso que varía de acuerdo a la federación. @es
definition: Weight category in boxing which varies according to the federation @en-gb
definition: Gewichtsklasse im Boxen die je nach Verband variiert. @de
note: nessuno
in scheme: Subject Code
created: 2000-10-30T12:00:00+00:00
modified: 2010-12-15T17:01:09+00:00
broader: Pugilato
broad match: http://cv.iptc.org/newscodes/mediatopic/20000856

leggeri
type: Concept
preferred label: Leichtgewicht @de
preferred label: peso ligeiro @pt-pt
preferred label: peso leve @pt-br
preferred label: lightweight @en-gb
preferred label: peso ligero @es
preferred label: Plumes @fr
preferred label: ライト級 @ja-jp
definition: Categoría de peso que varía de acuerdo a la federación. @es
definition: Categoria di peso che varia in base alla federazione
definition: Categoria de peso que varia consoante a federação. @pt-br
definition: Gewichtsklasse im Boxen die je nach Verband variiert. @de
definition: Weight category in boxing which varies according to the federation @en-gb
definition: 連盟による様々な体重別のカテゴリー @ja-jp
definition: catégorie de poids variant selon les fédérations @fr
note: nessuno
in scheme: Subject Code
created: 2000-10-30T12:00:00+00:00
modified: 2010-12-15T17:01:09+00:00
broader: Pugilato
broad match: http://cv.iptc.org/newscodes/mediatopic/20000856

Superpiuma
type: Concept
preferred label: super-featherweight @en-gb
preferred label: peso superpluma @es
preferred label: peso superpena @pt-br
preferred label: スーパーフェザー級 @ja-jp
preferred label: Super-Federgewicht @de
preferred label: Super-poids plumes @fr
definition: Gewichtsklasse im Boxen die je nach Verband variiert. @de
definition: Categoria de peso que varia consoante a federação. @pt-pt
definition: Categoria di peso che varia in base alla federazione
definition: Categoría de peso que varía de acuerdo a la federación. @es
definition: Weight category in boxing which varies according to the federation @en-gb
definition: catégorie de poids variant selon les fédérations @fr
definition: 連盟による様々な体重別のカテゴリー @ja-jp
note: nessuno
in scheme: Subject Code
created: 2000-10-30T12:00:00+00:00
modified: 2010-12-15T17:01:09+00:00
broader: Pugilato
broad match: http://cv.iptc.org/newscodes/mediatopic/20000856

Piuma
type: Concept
preferred label: peso pluma @pt-pt
preferred label: peso pena @pt-br
preferred label: Federgewicht @de
preferred label: featherweight @en-gb
preferred label: Poids-plume @fr
preferred label: フェザー級 @ja-jp
definition: Gewichtsklasse im Boxen die je nach Verband variiert. @de
definition: Categoria di peso che varia in base alla federazione
definition: Categoria de peso que varia consoante a federação. @pt-pt
definition: Categoría de peso que varía de acuerdo a la federación. @es
definition: 連盟による様々な体重別のカテゴリー @ja-jp
definition: Weight category in boxing which varies according to the federation @en-gb
definition: catégorie de poids variant selon les fédérations @fr
note: nessuno
in scheme: Subject Code
created: 2000-10-30T12:00:00+00:00
modified: 2010-12-15T17:01:09+00:00
broader: Pugilato
broad match: http://cv.iptc.org/newscodes/mediatopic/20000856

Supergallo
type: Concept
preferred label: peso supergalo @pt-br
preferred label: super-bantamweight @en-gb
preferred label: super gallo @es
preferred label: Super coq @fr
preferred label: スーパーバンタム級 @ja-jp
preferred label: Super-Bantamgewicht @de
definition: 連盟による様々な体重別のカテゴリー @ja-jp
definition: Categoria de peso que varia consoante a federação. @pt-pt
definition: Categoria di peso che varia in base alla federazione
definition: Gewichtsklasse im Boxen die je nach Verband variiert. @de
definition: catégorie de poids variant selon les fédérations @fr
definition: Weight category in boxing which varies according to the federation @en-gb
definition: Categoría de peso que varía de acuerdo a la federación. @es
note: nessuno
in scheme: Subject Code
created: 2000-10-30T12:00:00+00:00
modified: 2010-12-15T17:01:09+00:00
broader: Pugilato
broad match: http://cv.iptc.org/newscodes/mediatopic/20000856

Gallo
type: Concept
preferred label: バンタム級 @ja-jp
preferred label: peso galo @pt-pt
preferred label: Bantamgewicht @de
preferred label: gallo @es
preferred label: Coq @fr
preferred label: bantamweight @en-gb
definition: Categoria di peso che varia in base alla federazione
definition: Categoria de peso que varia consoante a federação. @pt-pt
definition: Categoría de peso que varía de acuerdo a la federación. @es
definition: catégorie de poids variant selon les fédérations @fr
definition: Gewichtsklasse im Boxen die je nach Verband variiert. @de
definition: 連盟による様々な体重別のカテゴリー @ja-jp
definition: Weight category in boxing which varies according to the federation @en-gb
note: nessuno
in scheme: Subject Code
created: 2000-10-30T12:00:00+00:00
modified: 2010-12-15T17:01:09+00:00
broader: Pugilato
broad match: http://cv.iptc.org/newscodes/mediatopic/20000856

Supermosca
type: Concept
preferred label: supermosca @es
preferred label: Super-Fliegengewicht @de
preferred label: peso supermosca @pt-br
preferred label: super-flyweight @en-gb
preferred label: スーパーフライ級 @ja-jp
preferred label: Super-mouches @fr
definition: Gewichtsklasse im Boxen die je nach Verband variiert. @de
definition: Weight category in boxing which varies according to the federation @en-gb
definition: Categoria de peso que varia consoante a federação. @pt-pt
definition: Categoría de peso que varía de acuerdo a la federación. @es
definition: catégorie de poids variant selon les fédérations @fr
definition: 連盟による様々な体重別のカテゴリー @ja-jp
definition: Categoria di peso che varia in base alla federazione
note: nessuno
in scheme: Subject Code
created: 2000-10-30T12:00:00+00:00
modified: 2010-12-15T17:01:09+00:00
broader: Pugilato
broad match: http://cv.iptc.org/newscodes/mediatopic/20000856

Mosca
type: Concept
preferred label: flyweight @en-gb
preferred label: Fliegengewicht @de
preferred label: フライ級 @ja-jp
preferred label: peso mosca @pt-br
preferred label: Mouches @fr
definition: Weight category in boxing which varies according to the federation @en-gb
definition: Categoria de peso que varia consoante a federação. @pt-pt
definition: catégorie de poids variant selon les fédérations @fr
definition: Categoria di peso che varia in base alla federazione
definition: 連盟による様々な体重別のカテゴリー @ja-jp
definition: Categoría de peso que varía de acuerdo a la federación. @es
definition: Gewichtsklasse im Boxen die je nach Verband variiert. @de
note: nessuno
in scheme: Subject Code
created: 2000-10-30T12:00:00+00:00
modified: 2010-12-15T17:01:09+00:00
broader: Pugilato
broad match: http://cv.iptc.org/newscodes/mediatopic/20000856

Mosca leggeri
type: Concept
preferred label: Leicht-Fliegengewicht @de
preferred label: peso mosca ligeiro @pt-pt
preferred label: ライトフライ級 @ja-jp
preferred label: peso mosca ligero @es
preferred label: Mi-mouches @fr
preferred label: light flyweight @en-gb
definition: Gewichtsklasse im Boxen die je nach Verband variiert. @de
definition: Weight category in boxing which varies according to the federation @en-gb
definition: Categoria de peso que varia consoante a federação. @pt-br
definition: 連盟による様々な体重別のカテゴリー @ja-jp
definition: Categoria di peso che varia in base alla federazione
definition: catégorie de poids variant selon les fédérations @fr
definition: Categoría de peso que varía de acuerdo a la federación. @es
note: nessuno
in scheme: Subject Code
created: 2000-10-30T12:00:00+00:00
modified: 2010-12-15T17:01:09+00:00
broader: Pugilato
broad match: http://cv.iptc.org/newscodes/mediatopic/20000856

Paglia
type: Concept
preferred label: peso mínimo @pt-br
preferred label: ストロー級 @ja-jp
preferred label: peso palha @pt-pt
preferred label: Pailles @fr
preferred label: Papiergewicht @de
preferred label: straw @en-gb
preferred label: peso paja (el más liviano de todos) @es
definition: Weight category in boxing which varies according to the federation @en-gb
definition: Categoria de peso que varia consoante a federação. @pt-pt
definition: 連盟による様々な体重別のカテゴリー @ja-jp
definition: Gewichtsklasse im Boxen die je nach Verband variiert. @de
definition: Categoria di peso che varia in base alla federazione
definition: catégorie de poids variant selon les fédérations @fr
definition: Categoría de peso que varía de acuerdo a la federación. @es
note: nessuno
in scheme: Subject Code
created: 2000-10-30T12:00:00+00:00
modified: 2010-12-15T17:01:09+00:00
broader: Pugilato
broad match: http://cv.iptc.org/newscodes/mediatopic/20000856

IBF
type: Concept
preferred label: 国際ボクシング連盟 @ja-jp
preferred label: fib (ifb) @es
definition: 国際ボクシング連盟 @ja-jp
definition: Internationaler Boxverband. @de
definition: Federação Internacional de Boxe. @pt-br
definition: International Boxing Federation
definition: Federación Internacional de Boxeo @es
definition: organisme fédérateur international @fr
definition: International boxing federation @en-gb
note: nessuno
in scheme: Subject Code
created: 2000-10-30T12:00:00+00:00
modified: 2010-12-15T17:01:09+00:00
broader: Pugilato
broad match: http://cv.iptc.org/newscodes/mediatopic/20000856

WBA
type: Concept
preferred label: 世界ボクシング協会 @ja-jp
preferred label: amb (wba) @es
definition: Associação Mundial de Boxe. @pt-br
definition: World Boxing Association
definition: Weltboxverband @de
definition: 世界ボクシング協会 @ja-jp
definition: organisme fédérateur international @fr
definition: World boxing association @en-gb
definition: Asociación Mundial de Boxeo @es
note: nessuno
in scheme: Subject Code
created: 2000-10-30T12:00:00+00:00
modified: 2010-12-15T17:01:09+00:00
broader: Pugilato
broad match: http://cv.iptc.org/newscodes/mediatopic/20000856

cmb (wbc)
type: Concept
preferred label: WBC
preferred label: 世界ボクシング評議会 @ja-jp
definition: Weltboxrat @de
definition: World boxing council @en-gb
definition: Consejo Mundial de Boxeo @es
definition: Conselho Mundial de Boxe. @pt-br
definition: World Boxing Council
definition: 世界ボクシング評議会 @ja-jp
definition: organisme fédérateur international @fr
note: nessuno
in scheme: Subject Code
created: 2000-10-30T12:00:00+00:00
modified: 2010-12-15T17:01:09+00:00
broader: Pugilato
broad match: http://cv.iptc.org/newscodes/mediatopic/20000856

WBO
type: Concept
preferred label: 世界ボクシング機構 @ja-jp
preferred label: omb (wco) @es
definition: Weltboxorganisation @de
definition: Organização Mundial de Boxe. @pt-br
definition: 世界ボクシング機構 @ja-jp
definition: World Boxing Organisation
definition: World boxing organisation @en-gb
definition: organisme fédérateur international @fr
definition: Organización Mundial de Boxeo @es
note: nessuno
in scheme: Subject Code
created: 2000-10-30T12:00:00+00:00
modified: 2010-12-15T17:01:09+00:00
broader: Pugilato
broad match: http://cv.iptc.org/newscodes/mediatopic/20000856

Pugilato francese
type: Concept
preferred label: boxeo francés @es
preferred label: savate @pt-br
preferred label: Französisch Boxen @de
preferred label: フレンチボクシング @ja-jp
preferred label: Boxe française @fr
preferred label: French boxing @en-gb
definition: sport de combat utilisant des mouvements de percussion (coups) qui permettent de frapper avec toutes les surfaces des pieds et le devant des poings @fr
definition: Lotta sportiva nella quale sono permessi calci con ogni parte del piede e pugni con la loro parte frontale
definition: 足のすべての部分でキックが許され、かつ、拳の正面でパンチすることも許可される格闘技 @ja-jp
definition: Kampfsportart bei der alle Teile des Fußes treten dürfen und schlagen mit dem vorderen Teil der Fäuste ebenfalls erlaubt ist. @de
definition: Esporte de combate em que é permitido bater com todas as partes dos pés e socar com a parte frontal dos punhos. @pt-br
definition: Deporte de combate en el cual se permite dar patadas y golpear con la parte frontal del puño. @es
definition: Combat sport in which kicking with all parts of the feet are permitted and punching with the front of the fist is also allowed @en-gb
definition: Desporto de combate em que é permitido bater com todas as partes dos pés e socar com a parte frontal dos punhos. @pt-pt
note: nessuno
in scheme: Subject Code
created: 2000-10-30T12:00:00+00:00
modified: 2010-12-15T17:01:09+00:00
broader: Pugilato
broad match: http://cv.iptc.org/newscodes/mediatopic/20000856

Pugilato thai
type: Concept
preferred label: Thai Boxen @de
preferred label: Boxe Thai @fr
preferred label: muay thai @pt-pt
preferred label: boxeo tailandés @es
preferred label: Thai boxing @en-gb
preferred label: タイ式ボクシング @ja-jp
definition: Forma de boxeo que permite el uso de puños, pies, rodillas, codos y piernas. @es
definition: こぶし、足、ひざ、肘と足の殴打を要するボクシングスタイル @ja-jp
definition: Form of boxing involving punches with fists, feet, knees, elbows and legs. @en-gb
definition: Forma di pugilato in cui è permesso picchiare con pugni, piedi, ginocchia, gomiti e gambe
definition: Desporto de combate envolvendo golpes com punhos, pés, joelhos, cotovelos e pernas. @pt-pt
definition: Esporte de combate envolvendo golpes com punhos, pés, joelhos, cotovelos e pernas. @pt-br
definition: sport de combat qui utilise les frappes avec les poings,les pieds, les tibias, les genoux et le coude @fr
definition: Form des Boxens mit Faustschlägen, Füßen, Knien, Elbögen und Beinen. @de
note: nessuno
in scheme: Subject Code
created: 2000-10-30T12:00:00+00:00
modified: 2010-12-15T17:01:09+00:00
broader: Pugilato
broad match: http://cv.iptc.org/newscodes/mediatopic/20000856

Slalom
type: Concept
preferred label: slalom @pt-pt
preferred label: Kanuslalom @de
preferred label: スラローム @ja-jp
preferred label: slalom acuático @es
definition: Disciplina en aguas *vivas* que consiste en atravesar puertas compuestas de dos varas suspendidas verticalmente en el agua. Los competidores deben atravesar las mismas. @es
definition: Discesa in acque agitate su un percorso indicato da porte costituite da pali sospesi verticalmente sulla superficie dell'acqua
definition: course en eaux vives sur un parcours matérialisé par des portes formées de 2 perches suspendues verticalement au-dessus de l'eau @fr
definition: Wildwasserstrecke, die mit Toren ausgeweisen wird, die vertikal zwischen zwei Pfosten über das Wasser verlaufen. Wettkämpfer müssen die Brücken passieren oder erhalten Strafpunkte. @de
definition: 急流のコースに、水の上に垂直に浮かぶ２本のポールからなるゲートを並べる。競技者は、ゲートを通り抜けなければならない。そうしなければ、ペナルティーを受ける @ja-jp
definition: White water course set out with gates consisting of two poles suspended vertically over the water. Competitors must negotiate the gates or face penalties @en-gb
definition: Corrida em rios realizada com portas (duas varas suspensas verticalmente na água) que os participantes têm de atravessar com as suas embarcações. @pt-pt
definition: Corrida em águas vivas realizada com portas (duas varas suspensas verticalmente na água) que os participantes têm de atravessar com suas embarcações. @pt-br
note: nessuno
in scheme: Subject Code
created: 2000-10-30T12:00:00+00:00
modified: 2010-12-15T17:01:09+00:00
broader: Canoa, Kayak

pista
type: Concept
preferred label: 200 m
preferred label: ２００ｍ @ja-jp
preferred label: 200m @fr
definition: Corrida de 200m. @pt-pt
definition: 200mの距離で開催されるレース @ja-jp
definition: course en ligne sur 200m @fr
definition: Corsa su 200 m
definition: Rennen über eine Strecke von 200 m @de
definition: race held over 200m @en-gb
definition: Carrera sostenida sobre 200 metros lineales. @es
note: nessuno
in scheme: Subject Code
created: 2000-10-30T12:00:00+00:00
modified: 2010-12-15T17:01:09+00:00
broader: Canoa, Kayak

500 m
type: Concept
preferred label: 500m @fr
preferred label: ５００ｍ @ja-jp
definition: Corrida de 500m. @pt-pt
definition: Rennen über eine Strecke von 500 m @de
definition: course en ligne sur 500m @fr
definition: race held over 500m @en-gb
definition: Corsa su 500 m
definition: Carrera sostenida sobre 500 metros lineales. @es
definition: 500mの距離で開催されるレース @ja-jp
note: nessuno
in scheme: Subject Code
created: 2000-10-30T12:00:00+00:00
modified: 2010-12-15T17:01:09+00:00
broader: Canoa, Kayak

1000 m
type: Concept
preferred label: １０００ｍ @ja-jp
preferred label: 1000m @fr
definition: 1000mの距離で開催されるレース @ja-jp
definition: Corrida de 1000m. @pt-br
definition: Rennen über eine Strecke von 1000 m @de
definition: course en ligne sur 1000m @fr
definition: Corsa su 1000 m
definition: Carrera sostenida sobre 1000 metros lineales. @es
definition: race held over 1000m @en-gb
note: nessuno
in scheme: Subject Code
created: 2000-10-30T12:00:00+00:00
modified: 2010-12-15T17:01:09+00:00
broader: Canoa, Kayak

K1
type: Concept
preferred label: k1 @es
preferred label: カヤックシングル @ja-jp
definition: Caiaque de 1 lugar (embarcação fechada para uma pessoa sentada em assento fixo que rema com remo de duas pás). @pt-br
definition: Imbarcazione chiusa ad un posto in cui il concorrente è seduto su un sedile fisso e usa una pagaia
definition: Embarcación para una persona sentada en asiento fijo con remo de dos extremos. @es
definition: Kayak une place (bateau fermé et l'athlète pagaie en position assise à l'aide d'une pagaie double) @fr
definition: Ein geschlossenes Boot, worin die Wettkämpfer in festen Sitzen sitzen und ein Doppelpaddel benutzen. @de
definition: an enclosed boat with the competitor sitting on a fixed seat for one person using a double bladed paddle @en-gb
definition: Caiaque de 1 lugar (embarcação fechada para uma pessoa sentada em assento fixo que rema com pagaia dupla). @pt-pt
definition: 1人乗りの座席が固定され囲いがあるボートの競技で一対のパドルを使う @ja-jp
note: nessuno
in scheme: Subject Code
created: 2000-10-30T12:00:00+00:00
modified: 2010-12-15T17:01:09+00:00
broader: Canoa, Kayak
broad match: http://cv.iptc.org/newscodes/mediatopic/20000979

K2
type: Concept
preferred label: カヤックペア @ja-jp
preferred label: k2 @es
definition: Kayak deux places (bateau fermé et les athlètes pagaient en position assise à l'aide d'une pagaie double) @fr
definition: Caiaque de 2 lugares (embarcação fechada para duas pessoas sentadas em assento fixo que remam com remo de duas pás). @pt-br
definition: Embarcación para dos personas sentadas en asiento fijo con remo de dos extremos. @es
definition: Imbarcazione chiusa a due posti in cui i concorrenti usano pagaie
definition: 2人乗りの座席が固定され囲いがあるボートの競技で一対のパドルを使う @ja-jp
definition: Ein geschlossenes Boot in dem die Wettkämpfer zu zweit in einem festen Sitz sitzen und ein Doppelpaddel benutzen. @de
definition: Caiaque de 2 lugares (embarcação fechada para duas pessoas sentadas em assento fixo que remam com pagaia dupla). @pt-pt
definition: an enclosed boat with the competitor sitting on a fixed seat for two people using double bladed paddles. @en-gb
note: nessuno
in scheme: Subject Code
created: 2000-10-30T12:00:00+00:00
modified: 2010-12-15T17:01:09+00:00
broader: Canoa, Kayak
broad match: http://cv.iptc.org/newscodes/mediatopic/20000979

K4
type: Concept
preferred label: k4 @es
preferred label: カヤックフォア @ja-jp
definition: Ein geschlossenes Boot in dem die Wettkämpfer zu viert in einem festen Sitz sitzen und ein Doppelpaddel benutzen. @de
definition: Imbarcazione chiusa a quattro posti in cui i concorrenti usano pagaie
definition: Caiaque de 4 lugares (embarcação fechada para 4 pessoas sentadas em assento fixo que remam com remo de duas pás). @pt-br
definition: Embarcación para cuatro personas sentadas en asiento fijo con remo de dos extremos. @es
definition: Kayak quatre places (bateau fermé et les athlètes pagaient en position assise à l'aide d'une pagaie double) @fr
definition: 4人乗りの座席が固定され囲いがあるボートの競技で一対のパドルを使う @ja-jp
definition: Caiaque de 4 lugares (embarcação fechada para quatro pessoas sentadas em assento fixo que remam com pagaia dupla). @pt-pt
definition: an enclosed boat with the competitor sitting on a fixed seat for four people using double bladed paddles. @en-gb
note: nessuno
in scheme: Subject Code
created: 2000-10-30T12:00:00+00:00
modified: 2010-12-15T17:01:09+00:00
broader: Canoa, Kayak
broad match: http://cv.iptc.org/newscodes/mediatopic/20000979

C1
type: Concept
preferred label: カナディアンシングル @ja-jp
preferred label: c1 @es
definition: One-seater canoe (open boat with competitor using a single bladed paddle. @en-gb
definition: Einsitzer Kanu (offenes Boot) mit Wettkämpfern die ein Einzelpaddel benutzen. @de
definition: Canoa ad un posto, il concorrente usa un remo ad una pala
definition: Canoa abierta para una persona, que utiliza remo de un solo extremo. @es
definition: Canoa de 1 lugar (embarcação aberta para uma pessoa que rema com remo simples). @pt-br
definition: Canoa de 1 lugar (embarcação aberta para uma pessoa que rema com pagaia simples). @pt-pt
definition: Canoë une place (bateau ouvert. L'athlète prend appui sur sa jambe avant fléchie et le genou de la jambe arrière. Il se propulse avec une pagaie simple). @fr
definition: 1人乗りカヌー(デッキなし)競技者は片側のみブレードのついたパドルを使用する @ja-jp
note: nessuno
in scheme: Subject Code
created: 2000-10-30T12:00:00+00:00
modified: 2010-12-15T17:01:09+00:00
broader: Canoa, Kayak
broad match: http://cv.iptc.org/newscodes/mediatopic/20000877

C2
type: Concept
preferred label: カナディアンペア @ja-jp
preferred label: c2 @es
definition: 2人乗りカヌー(デッキなし)競技者は片側のみブレードのついたパドルを使用する @ja-jp
definition: Zweisitzer Kanu. (offenes Boot) mit Wettkämpfern die ein Einzelpaddel benutzen. @de
definition: Canoa de 2 lugares (embarcação aberta para duas pessoas que remam com remo simples). @pt-br
definition: Canoa de 2 lugares (embarcação aberta para duas pessoas que remam com pagaia simples). @pt-pt
definition: Canoa a due posti, i concorrenti usano un remo ad una pala ciascuno
definition: Two-seater canoe (open boat) - competitors use a single bladed paddle. @en-gb
definition: Canoë deux places (bateau ouvert. Les athlètes prennent appui sur leur jambe avant fléchie et leur genou de la jambe arrière. Ils se propulsent avec une pagaie simple). @fr
definition: Canoa abierta para dos personas, utilizando remo de un solo extremo. @es
note: nessuno
in scheme: Subject Code
created: 2000-10-30T12:00:00+00:00
modified: 2010-12-15T17:01:09+00:00
broader: Canoa, Kayak
broad match: http://cv.iptc.org/newscodes/mediatopic/20000877

C4
type: Concept
preferred label: カナディアンフォア @ja-jp
preferred label: c4 @es
definition: Canoa a quattro posti, i concorrenti usano un remo ad una pala ciascuno
definition: Canoa de 4 lugares (embarcação aberta para quatro pessoas que remam com remo simples). @pt-br
definition: Viersitzer Kanu (offenes Boot) mit Wettkämpfern die ein Einzelpaddel benutzen. @de
definition: 4人乗りカヌー(デッキなし)競技者は片側のみブレードのついたパドルを使用する @ja-jp
definition: Four-seater canoe (open boat) with each competitor using a single bladed paddle. @en-gb
definition: Canoa para cuatro personas, utilizando remo de un solo extremo. @es
definition: Canoa de 4 lugares (embarcação aberta para quatro pessoas que remam com pagaia simples). @pt-pt
definition: Canoë quatre places (bateau ouvert. Les athlètes prennent appui sur leur jambe avant fléchie et leur genou de la jambe arrière. Ils se propulsent avec une pagaie simple). @fr
note: nessuno
in scheme: Subject Code
created: 2000-10-30T12:00:00+00:00
modified: 2010-12-15T17:01:09+00:00
broader: Canoa, Kayak
broad match: http://cv.iptc.org/newscodes/mediatopic/20000877

Canoa a vela
type: Concept
preferred label: Kanusegeln @de
preferred label: Canoe à voile @fr
preferred label: canoe sailing @en-gb
preferred label: canoa à vela @pt-pt
preferred label: カヌーセーリング @ja-jp
preferred label: canoa a vela @es
definition: A race involving a canoe equipped with a sail. @en-gb
definition: 帆を備えているカヌーが対象のレース @ja-jp
definition: Corrida de canoa com vela. @pt-pt
definition: Ein Rennen mit einem Kanu mit Segel. @de
definition: course de canoë à voile @fr
definition: Una gara su canoa munita di vela
definition: Carrera que involucra a canoas con una vela. @es
note: nessuno
in scheme: Subject Code
created: 2000-10-30T12:00:00+00:00
modified: 2010-12-15T17:01:09+00:00
broader: Canoa, Kayak

Pontoniering
type: Concept
preferred label: ポントニーリング @ja-jp
preferred label: pontoniering @en-gb
preferred label: none @es
definition: sport militaire utilisant des bateaux similaires aux canoës @fr
definition: Sport di squadra, di tradizione militare, simile alla regata di canoa ma su imbarcazioni
definition: Esporte de equipa, de tradição militar, que usa barcos semelhantes às canoas. @pt-br
definition: Desporto de equipa, de tradição militar, que usa barcos semelhantes às canoas. @pt-pt
definition: Deporte colectivo, de tradición militar, similar a la regata de canoas, pero en botes. @es
definition: 団体競技、軍の伝統、カヌー・レガッタに似ている、漕艇に属する @ja-jp
definition: Team sport, military tradition, similar to canoe regatta, in boats @en-gb
definition: Mannschaftssport in militärischer Tradition mit Booten, ähnlich der Kanuregatta. @de
note: nessuno
in scheme: Subject Code
created: 2003-11-26T12:00:00+00:00
modified: 2012-07-10T12:00:00+00:00
broader: Canoa, Kayak

Scalata
type: Concept
preferred label: 登山 @ja-jp
preferred label: escalada alpina @es
preferred label: mountaineering @en-gb
preferred label: montanhismo @pt-br
preferred label: Alpinismus @de
preferred label: Alpinisme @fr
definition: Ascenso de una montaña de paredes nevadas o glaciares. @es
definition: Bergsteigen im Hochgebirge. @de
definition: Ascensione di una montagna
definition: Alpine climbing @en-gb
definition: ascension d'une montagne au travers les rochers, sur parois enneigées et sur glaciers @fr
definition: Subir uma montanha com neve ou gelo. @pt-br
definition: (高い)山に登ること @ja-jp
note: nessuno
in scheme: Subject Code
created: 2003-11-26T12:00:00+00:00
modified: 2012-07-10T12:00:00+00:00
broader: Alpinismo

Arrampicata libera
type: Concept
preferred label: escalada @pt-pt
preferred label: スポーツ登山 @ja-jp
preferred label: escalada libre @es
preferred label: Escalade @fr
preferred label: sport climbing @en-gb
preferred label: Sportklettern @de
definition: Escalada esportiva como categoria especial: competição individual, em parede artificial com limite de tempo. @pt-br
definition: sport qui consiste à grimper à mains nues des falaises, rochers ou autres parois verticales @fr
definition: Escalamiento con distintas categorías: competencia individual, en una pared artificial con límite de tiempo. @es
definition: Sportklettern als Spezialdisziplin: Einzelwettbewerb mit Zeitmessung an einer künstlichen Kletterwand. @de
definition: 特別な種類であるスポーツ登山。人工壁を登る時間を競う個人競争 @ja-jp
definition: Escalada desportiva como categoria especial: competição individual, em parede artificial com limite de tempo. @pt-pt
definition: Arrampicata con categorie speciali, Free Climbing
definition: Sport climbing as a special category: individual competition, on an artificial wall with time measurement @en-gb
note: nessuno
in scheme: Subject Code
created: 2003-11-26T12:00:00+00:00
modified: 2012-07-10T12:00:00+00:00
broader: Alpinismo

Icestock sport
type: Concept
preferred label: ice stock sport @pt-pt
preferred label: アイスストック @ja-jp
preferred label: Eisstockschießen @de
preferred label: deporte icestock @es
preferred label: Crosse sur glace @fr
preferred label: icestock sport @en-gb
definition: カーリングと似ていて、氷の上で標的に向かってプレーする。まっすぐなハンドルのついた石とルールが(カーリングとは)異なり、アルプスの国々で行われる @ja-jp
definition: Jogo semelhante ao curling, disputado com pedras de pega direita e regras diferentes, geralmente praticado ao ar livre, nos países alpinos. @pt-pt
definition: Simile al curling, giocato con bersagli sul ghiaccio, ma con pietre diverse con impugnatura diritta e regole diverse
definition: Similar al curling, pero con diferentes fichas (con mango derecho) y reglas distintas, jugado en los países alpinos. @es
definition: Similar to curling, played on targets on ice, different stones with straight handle and different rules, played in alpine countries @en-gb
definition: sport variante du curling généralement pratiquée en pelin air qui consiste à placer des pierres avec une poignée le plus près possible d'une cible en les faisant glisser sur la glace. @fr
definition: Ähnlich dem Curling, wird auf Ziele auf dem Eis gespielt, anderer Spielstein mit geradem Stockgriff und abweichenden Regeln, vornehmlich in Alpenländern gespielt. @de
note: nessuno
in scheme: Subject Code
created: 2003-11-26T12:00:00+00:00
modified: 2012-07-10T12:00:00+00:00
broader: Curling

Pista
type: Concept
preferred label: pista @es
preferred label: piste @fr
preferred label: track @en-gb
preferred label: Bahnradsport @de
preferred label: トラック @ja-jp
definition: Corrida de bicicleta em pista de velódromo. @pt-pt
definition: Ein Rennen auf einer Strecke in einem Velodrom. @de
definition: course se déroulant sur une piste de vélodrome @fr
definition: Una carrera de velocidad en pista de velódromo @es
definition: 競輪場内のトラックで行われるレース @ja-jp
definition: A race staged on a track in a velodrome @en-gb
definition: Una corsa tenuta sulle piste di un velodromo
note: nessuno
in scheme: Subject Code
created: 2000-10-30T12:00:00+00:00
modified: 2010-12-15T17:01:09+00:00
broader: Ciclismo

Inseguimento
type: Concept
preferred label: 個人追い抜き @ja-jp
preferred label: persecución @es
preferred label: pursuit @en-gb
preferred label: perseguição @pt-pt
preferred label: Pursuit @de
preferred label: poursuite @fr
definition: Dos ciclistas o equipos de ciclistas salen de puntos medios distintos de una pista y tratan de reencontrarse en una distancia determinada.. @es
definition: Zwei Radfahrer oder Teams starten von zwei Seiten gegenüber und versuchen die Lücke zwischen sich aufzuholen. @de
definition: Dois ciclistas ou duas equipas partem de pontos médios opostos de uma pista e tentam recuperar a distância entre eles. @pt-pt
definition: deux coureurs ou équipes placés au milieu des lignes droites doivent essayer de se rejoindre sur une distance déterminée @fr
definition: Dois ciclistas ou duas equipes partem de pontos médios opostos de uma pista e tentam recuperar a distância entre eles. @pt-br
definition: Two cyclists or teams set off from midway down opposite straights and try to make up the gap between them. @en-gb
definition: Due ciclisti o squadre partono da punti medi e opposti delle piste cercando di appianare il loro distacco
definition: 2人、若しくは2チームがあい対する直線の真ん中からスタートして、差を競う自転車レース @ja-jp
note: nessuno
in scheme: Subject Code
created: 2000-10-30T12:00:00+00:00
modified: 2010-12-15T17:01:09+00:00
broader: Ciclismo

Sprint olimpico
type: Concept
preferred label: チームスプリント @ja-jp
preferred label: Sprint Olympique @fr
preferred label: Olympischer Sprint @de
preferred label: carrera olímpica @es
preferred label: sprint olímpico @pt-pt
preferred label: Olympic sprint @en-gb
definition: Corrida de classificação de 200m. A partir dos quartos-de-final, dois ciclistas seguem lado a lado. A prova por equipas disputa-se com 3 ciclistas por país. @pt-pt
definition: Un tour de qualification se fait au temps sur 200 m. A partir des quarts de finale, matches à 2 en deux manches gagnantes. Par équipes, l'épreuve se déroule avec 3 sprinteurs par pays qui s'effacent l'un après l'autre à la fin de chaque tour. @fr
definition: Qualifikationsrennen über 200 m. Nach dem Viertel-Finale starten zwei Radfahrer Kopf an Kopf. Bei Mannschaftsrennen bestehend aus drei Radfahrern aus unterschiedlichen Ländern. @de
definition: 予選は200m超で行われる。準々決勝からは2人が並んで行う。チームによっては異なった国からの3人の自転車選手によって競技を行う @ja-jp
definition: Corsa di qualificazione tenuta sui 200 m
definition: Qualifying race held over 200m. From the quarter-finals two cyclists go head-to-heads. By teams races consist of three cyclists from different countries. @en-gb
definition: Corrida de classificação de 200m. A partir das quartas de final, dois ciclistas seguem lado a lado. A prova por equipes se disputa com 3 ciclistas por país. @pt-br
definition: Carrera de clasificación en competencia olímpica sostenida sobre 200 metros. Desde los cuartos de final dos ciclistas van mano a mano, mientras que por equipos la carrera consiste en tres ciclistas de distintos países. @es
note: nessuno
in scheme: Subject Code
created: 2000-10-30T12:00:00+00:00
modified: 2010-12-15T17:01:09+00:00
broader: Ciclismo

Sprint
type: Concept
preferred label: sprint @pt-br
preferred label: vitesse @fr
preferred label: embalaje @es
preferred label: スプリント @ja-jp
definition: épreuve qui se court à 2 et en 2 manches sur 2 ou 3 tours de piste. Le sprint s'effectue sur les derniers 200 mètres qui sont chronométrés @fr
definition: Races between two cyclists over two or three laps, with a timed sprint finish over the last 200m. @en-gb
definition: *Corridas entre dois ciclistas em 2 ou 3 voltas à pista, com um **sprint** final cronometrado nos últimos 200m.* @pt-br
definition: 2または3ラップ以上で2人の自転車選手間で行われるレース。ラスト200mあたりからスプリントが行われる @ja-jp
definition: Carreras entre dos ciclistas sobre dos o tres vueltas, con un sprint final cronometrado en los últimos 200 metros. @es
definition: Rennen zwischen zwei Radfahrern über zwei oder drei Runden, mit einem gestoppten Sprint über die letzten 200 m. @de
definition: Corse tra due ciclisti in due o tre giri di pista, con uno scatto finale cronometrato negli ultimi 200 metri
note: typo fixed in Explanation @en-gb
note: nessuno
in scheme: Subject Code
created: 2000-10-30T12:00:00+00:00
modified: 2010-12-15T17:01:09+00:00
broader: Ciclismo

競輪
type: Concept
preferred label: keirin @es
preferred label: Keirin
definition: Sprint between six cyclists where a pacemaker on a moped gradually increases the pace over the first 1400m. When the pacemaker leaves the track the race develops into a sprint finish over the final 6-700m. @en-gb
definition: Sprint zwischen sechs Radfahrern, bei dem ein Tempomacher auf einem Moped das Tempo über die ersten 1400 m beschleunigt. Wenn der Tempomacher die Bahn verlässt, entwickelt sich das Rennen zu einem Endspurt über die letzten 6-700 Meter. @de
definition: *Corrida de velocidade de 6 ciclistas em pista de velódromo. Os ciclistas seguem atrás de um motociclista que aumenta gradualmente a velocidade nos primeiros 1400 m. Quando ele abandona a pista, ocorre o **sprint** final.* @pt-pt
definition: Gara tra sei ciclisti dove un motociclo aumenta gradualmente la velocità e l'andatura lungo i primi 1400 metri. Quando il motociclo lascia la pista, la corsa prosegue con uno scatto finale negli ultimi 6-700 m
definition: 6選手で行われるスプリントで、最初の1400mで、モペットに乗ったペースメーカーがペースを徐々にあげていく。ペースメーカーが待避した後、最後の600～700メートルで勝負が決まる @ja-jp
definition: Embalaje entre seis ciclistas donde uno marca el paso e incrementa gradualmente la velocidad en los primeros 1.400 metros. Cuando el que marca el paso sale de pista la carrera se desarrolla en un embalaje final de 600 a 700 metros. @es
definition: Sprint à 6 : Lors des premiers 1400 mètres, l'allure des coureurs est réglée par un entraîneur sur un engin à propulsion électrique. Celui-ci accélère progressivement et quitte la piste à 6-700 mètres de l'arrivée. @fr
note: nessuno
in scheme: Subject Code
created: 2000-10-30T12:00:00+00:00
modified: 2010-12-15T17:01:09+00:00
broader: Ciclismo

Corsa a punti
type: Concept
preferred label: corrida por pontos @pt-br
preferred label: Course aux points @fr
preferred label: ポイントレース @ja-jp
preferred label: Punkterennen @de
preferred label: carrera por puntos @es
preferred label: points race @en-gb
definition: Cyclists aim to complete the highest number of laps. Bonus points are picked up in intermediate sprints held every 2500m. @en-gb
definition: Los ciclistas apuntan a completar el mayor número posible de vueltas. Puntos extra son recogidos en embalajes intermedios cada 2.500 metros. @es
definition: *Os ciclistas tentam completar o maior número de voltas. Pontos extra são atribuídos em **sprints** intermédios a cada 2500 m.* @pt-pt
definition: I ciclisti mirano a completare il maggior numero di giri (di pista). Dei punti extra sono assegnati in scatti intermedi ogni 2500 m
definition: Radfahrer die die höchste Anzahl an Runden zu erreichen versuchen. Sonderpunkte sind möglich durch Zwischensprints alle 2500 Meter. @de
definition: 選手はより多く周回することを目指す。ボーナスポイントは2500m毎に加算される @ja-jp
definition: les coureurs doivent parcourir la plus grande distance en nombre de tours complets.Ceux qui terminent dans le même tour obtiennent des points supplémentaires gagnés lors des sprints intermédiaires (tous les 2500m) @fr
note: nessuno
in scheme: Subject Code
created: 2000-10-30T12:00:00+00:00
modified: 2010-12-15T17:01:09+00:00
broader: Ciclismo

course à l'Américaine
type: Concept
preferred label: carrera madison @es
preferred label: Madison
preferred label: Madison Race @de
preferred label: Madison race @en-gb
preferred label: マディソン @ja-jp
definition: Corrida de pontos por equipas compostas por 2 ciclistas que se revezam. @pt-pt
definition: Corsa a punti in squadra di due ciclisti sotto forma di staffetta
definition: Corrida de pontos por equipes compostas por 2 ciclistas que se revezam. @pt-br
definition: Punkterennen mit Teams von zwei Radfahrern als Staffel. @de
definition: course aux points par équipes constituées de deux coureurs qui se relayent. @fr
definition: Carrera de puntos entre equipos que comprenden dos ciclistas en formato de relevos. @es
definition: A points race by teams comprising two cyclists in relay-format. @en-gb
definition: 2人一組のチーム同士がポイントを競い合う自転車リレー競争 @ja-jp
note: nessuno
in scheme: Subject Code
created: 2000-10-30T12:00:00+00:00
modified: 2010-12-15T17:01:09+00:00
broader: Ciclismo

Cronometro 500 m donne
type: Concept
preferred label: 500 m Zeitfahren @de
preferred label: ５００ｍタイムトライアル @ja-jp
preferred label: 500 metros contrarreloj @es
preferred label: 500 m time trial @en-gb
preferred label: 500 m contrarrelógio @pt-pt
preferred label: 500 m contre la montre @fr
preferred label: 500 m contra o relógio @pt-br
definition: Corrida individual contra o relógio de 500m para mulheres. @pt-br
definition: 500mのタイムを測定する女子個人レース @ja-jp
definition: Corsa femminile individuale contro il tempo di 500m
definition: Individual race against the clock over 500m for women. @en-gb
definition: Einzelrennen gegen die Uhr über 500 m für Frauen. @de
definition: Contre-la-montre individuel, départ arrêté sur 500 m pour les dames. Le coureur est seul en piste. @fr
definition: Carrera individual contrarrreloj sobre 500 metros para mujeres. @es
definition: Corrida individual contrarrelógio de 500m para mulheres. @pt-pt
note: nessuno
in scheme: Subject Code
created: 2000-10-30T12:00:00+00:00
modified: 2010-12-15T17:01:09+00:00
broader: Ciclismo
broad match: http://cv.iptc.org/newscodes/mediatopic/20000900

Cronometro 1 km uomini
type: Concept
preferred label: 1km Zeitfahren @de
preferred label: 1.000 metros contrarreloj @es
preferred label: 1 km contre la montre @fr
preferred label: 1 km contra o relógio @pt-br
preferred label: 1 km contrarrelógio @pt-pt
preferred label: １ｋｍタイムトライアル @ja-jp
preferred label: 1 km time trial @en-gb
definition: Contre-la-montre individuel, départ arrêté, de 1000 m pour les messieurs. Le coureur est seul en piste. @fr
definition: Einzelrennen über 1000 m gegen die Uhr für Männer. @de
definition: Corrida individual contra o relógio de 1000m para homens. @pt-br
definition: Corsa maschile individuale contro il tempo di 1000m
definition: 1000mのタイムを測定する男子個人レース @ja-jp
definition: Carrera individual contrarreloj sobre 1.000 metros para hombres. @es
definition: Corrida individual contrarrelógio de 1000m para homens. @pt-pt
definition: Individual race over 1000m against the clock for men. @en-gb
note: nessuno
in scheme: Subject Code
created: 2000-10-30T12:00:00+00:00
modified: 2010-12-15T17:01:09+00:00
broader: Ciclismo
broad match: http://cv.iptc.org/newscodes/mediatopic/20000900

Ora
type: Concept
preferred label: 1 heure @fr
preferred label: una hora en carretera @es
preferred label: hora @pt-pt
preferred label: one hour @en-gb
preferred label: １時間 @ja-jp
preferred label: Stundenrennen @de
definition: Ciclistas tratan de sumar la mayor cantidad posible de kilómetros en ruta durante una hora. @es
definition: parcourir les plus de kilomètres possibles en une heure @fr
definition: 選手は1時間でできる限り多くの距離を目標とする @ja-jp
definition: Competitors aim to complete as many kilometres as possible in one hour. @en-gb
definition: Wettkämpfer versuchen in einer Stunde so viele Kilometer zurückzulegen wie möglich. @de
definition: Os ciclistas tentam completar o maior número de quilômetros em uma hora. @pt-br
definition: I concorrenti mirano a percorrere più km possibili nell'arco di un'ora
definition: Os ciclistas tentam completar o maior número de quilómetros em uma hora. @pt-pt
note: nessuno
in scheme: Subject Code
created: 2000-10-30T12:00:00+00:00
modified: 2010-12-15T17:01:09+00:00
broader: Ciclismo
broad match: http://cv.iptc.org/newscodes/mediatopic/20000892

Strada
type: Concept
preferred label: ロードレース @ja-jp
preferred label: ciclismo de estrada @pt-br
preferred label: prueba de ruta @es
preferred label: Course en ligne @fr
preferred label: road race @en-gb
preferred label: Straßenrennen @de
definition: Road race with all the competitor starting en masse. @en-gb
definition: course sur route avec les coureurs partant tous ensemble @fr
definition: Corrida de estrada em que os ciclistas partem todos ao mesmo tempo. @pt-pt
definition: Corsa su strada con tutti i concorrenti fatti partire insieme
definition: 全選手が一斉にスタートするレース @ja-jp
definition: Straßenrennen bei dem alle Wettkämpfer in der Masse starten. @de
definition: Todos los ciclistas largan en masa (pelotón) a la ruta. @es
note: nessuno
in scheme: Subject Code
created: 2000-10-30T12:00:00+00:00
modified: 2010-12-15T17:01:09+00:00
broader: Ciclismo

Cronometro su strada
type: Concept
preferred label: contra o relógio @pt-br
preferred label: contrarrelógio @pt-pt
preferred label: Contre la montre @fr
preferred label: carrera contrarreloj @es
preferred label: ロードタイムトライアル @ja-jp
preferred label: Einzelzeitfahren @de
preferred label: road time trial @en-gb
definition: Carrera contrarreloj donde cada ciclista larga individualmente. @es
definition: Rennen oder Etappe gegen die Uhr, bei dem jeder Radfahrer einzeln startet. @de
definition: レースまたはある区間で、個々にスタートし、選手それぞれの所要時間を競う @ja-jp
definition: Corrida ou etapa contra o relógio em que cada ciclista parte individualmente. @pt-br
definition: Corsa o tappa contro il tempo con ogni ciclista fatto partire individualmente
definition: A race or stage against the clock with each cyclist setting off individually. @en-gb
definition: course ou étape où chaque coureur part séparément avec un classement au temps @fr
definition: Corrida ou etapa contrarrelógio em que cada ciclista parte individualmente. @pt-pt
note: nessuno
in scheme: Subject Code
created: 2000-10-30T12:00:00+00:00
modified: 2010-12-15T17:01:09+00:00
broader: Ciclismo

Corsa a tappe
type: Concept
preferred label: carrera por etapas @es
preferred label: Course à étapes @fr
preferred label: ステージレース @ja-jp
preferred label: Etappenrennen @de
preferred label: corrida por etapas @pt-br
preferred label: staging race @en-gb
definition: Carrera disputada por equipos con las clasificaciones de los equipos determinadas por los resultados combinados de cada día. @es
definition: Rennen, was in Teams stattfindet, die sich qualifizieren über die Kombination der Zeiten eines Tages. @de
definition: Corrida disputada por equipas em que as classificações são determinadas pelos resultados combinados de cada dia. @pt-pt
definition: Corrida disputada por equipes em que as classificações são determinadas pelos resultados combinados de cada dia. @pt-br
definition: 数日間をかけて競い合うレース @ja-jp
definition: A race disputed by teams with the classifications determined by the combined times over a day. @en-gb
definition: Una corsa disputata in squadre con la classifica determinata dai tempi combinati di ogni giorno; Giro, Tour ecc.
definition: course disputée par équipes avec classement établi par addition de temps sur une journée @fr
note: nessuno
in scheme: Subject Code
created: 2000-10-30T12:00:00+00:00
modified: 2010-12-15T17:01:09+00:00
broader: Ciclismo

Ciclocross
type: Concept
preferred label: ciclocrosse @pt-br
preferred label: cyclo-cross @en-gb
preferred label: ciclocross @es
preferred label: シクロクロス @ja-jp
preferred label: Querfeldein/Cross @de
definition: 土、草地、砂地、舗装道路等の様々な路面状況が舞台の競技 @ja-jp
definition: Ciclismo praticado por etapas em várias superfícies (terra, lama, areia e estrada), com obstáculos naturais ou artificiais. @pt-pt
definition: Ausgetragen auf unterschiedlichen Oerflächen - Erde, Grass, Sand oder Asphalt. @de
definition: Ciclismo por etapas sobre varias superficies: tierra, pasto, arena o sintético. @es
definition: Staged on various surfaces - earth, grass, sand or tarmac. @en-gb
definition: Corsa disputata su un suolo accidentato e su superfici diverse
definition: Le cyclo-cross se pratique sur un sol accidenté et des surfaces diverses (terre, herbe, sable, macadam). @fr
note: nessuno
in scheme: Subject Code
created: 2000-10-30T12:00:00+00:00
modified: 2010-12-15T17:01:09+00:00
broader: Ciclismo

Mountain bike
type: Concept
preferred label: Mountainbike @de
preferred label: BTT @pt-pt
preferred label: Vtt @en-gb
preferred label: vtt @es
preferred label: MTB @pt-br
preferred label: マウンテンバイク @ja-jp
preferred label: Le VTT @fr
definition: Competizione con bicicletta da montagna
definition: Competencia de bicicletas de montaña @es
definition: マウンテンバイク @ja-jp
definition: Mountain bikes @en-gb
definition: Competição de bicicleta todo o terreno, própria para percursos irregulares e com obstáculos. @pt-pt
definition: compétition de vélo tout terrain @fr
definition: Mountain Bikes @de
definition: Competição de bicicleta de montanha, própria para percursos irregulares e com obstáculos. @pt-br
note: nessuno
in scheme: Subject Code
created: 2000-10-30T12:00:00+00:00
modified: 2010-12-15T17:01:09+00:00
broader: Ciclismo

Mountain bike cross
type: Concept
preferred label: vtt-cross @es
preferred label: BTT-cross @pt-pt
preferred label: クロスカントリー @ja-jp
preferred label: Vtt-cross @en-gb
preferred label: MTB-cross @pt-br
preferred label: Vtt cross @fr
preferred label: Mountainbike-Cross @de
definition: Una corsa di resistenza su biciclette da montagna con un circuito di 10 km su vari terreni e con vari gradi di pendenze.
definition: discipline d'endurance sur circuits d'une longueur par boucle de près de 10 km avec un dénivelée allant jusqu'à 400 m aux 10 km. Le coureur effectue le parcours sans aucune aide extérieure @fr
definition: An endurance race on mountain bikes around a 10km circuit over various terrain and with different degrees of slopes. Competitors are not allowed any exterior help. @en-gb
definition: Una carrera de resistencia en bicicletas montaña en un circuito de 10 km sobre superficies varias y con subidas con distintos grados. Los competidores no tienen permitida ayuda externa. @es
definition: Corrida de resistência em bicicletas de montanha em circuito de 10 km, sobre superfícies variadas, com descidas e subidas de diferentes graus de inclinação e de dificuldade. Os participantes não podem ter ajuda externa. @pt-br
definition: 一周10ｋｍ以上の変化に富んだ傾斜と起伏のサーキットをまわるマウンテンバイクの耐久レース。出場者は一切の支援を受けられない @ja-jp
definition: Ausdauerrennen auf Mountainbikes über eine 10 km Strecke in unterschiedlichem Gelände und verschiedenen Steigungsgraden. Wettkämpfer dürfen keine Hilfe von außen annehmen. @de
definition: Corrida de resistência em bicicletas todo o terreno num circuito de 10 km, sobre superfícies variadas, com descidas e subidas de diferentes graus de inclinação e de dificuldade. Os participantes não podem ter ajuda externa. @pt-pt
note: nessuno
note: typo fixed in Explanation @en-gb
in scheme: Subject Code
created: 2000-10-30T12:00:00+00:00
modified: 2010-12-15T17:01:09+00:00
broader: Ciclismo
broad match: http://cv.iptc.org/newscodes/mediatopic/20000903

Mountain bike fondovalle
type: Concept
preferred label: Mountainbike-Abfahrt @de
preferred label: ダウンヒル @ja-jp
preferred label: vtt-colina abajo @es
preferred label: Vtt-downhill @en-gb
preferred label: MTB-downhill @pt-br
preferred label: Vtt descente @fr
preferred label: BTT-downhill @pt-pt
definition: Descenso colina abajo y de carácter individual con bicicletas montaña, contrarreloj y esquivando distintos obstáculos. @es
definition: Individual mountain bike race against the clock staged on a downhill circuit featuring obstacles. @en-gb
definition: Corsa a cronometro individuale su bicicletta da montagna su un circuito a fondovalle con ostacoli
definition: Corrida individual contra o relógio de bicicleta de montanha realizada em circuito de descida com alguns obstáculos. @pt-br
definition: Einzelrennen auf dem Mountainbike gegen die Uhr, ausgetragen auf einer Strecke bergab mit Hindernissen. @de
definition: épreuve individuelle contre la montre sur un profil descendant parsemé d'obstacles @fr
definition: Corrida individual contrarrelógio de bicicleta todo o terreno realizada em circuito de descida com alguns obstáculos. @pt-pt
definition: 障害物が特徴の下り坂サーキットを使用したマウンテンバイクレースで、個々にタイムを競う @ja-jp
note: nessuno
in scheme: Subject Code
created: 2000-10-30T12:00:00+00:00
modified: 2010-12-15T17:01:09+00:00
broader: Ciclismo
broad match: http://cv.iptc.org/newscodes/mediatopic/20000903

Bicrossing
type: Concept
preferred label: Bicross @fr
preferred label: bi-crossing @en-gb
preferred label: バイクロス @ja-jp
preferred label: bicross @pt-pt
preferred label: bicicross @es
preferred label: BMX @de
definition: 出来るだけ早くサーキット上の障害物を乗り越えるレース @ja-jp
definition: Carrera en la que los participantes deben cubrir un circuito con obstáculos, tan rápido le sean posible. @es
definition: A race where competitors have to cover a circuit with obstacles as quickly as possible. @en-gb
definition: Corsa in cui i concorrenti devono coprire il più velocemente possibile un circuito con ostacoli
definition: Corrida em que os participantes têm de percorrer em bicicleta um circuito com obstáculos o mais rápido possível. @pt-pt
definition: Rennen, bei dem die Wettkämpfer eine Strecke mit Hindernissen so schnell wie möglich zurücklegen müssen. @de
definition: Discipline qui se déroule sur une piste parsemée d'obstacles que les pilotes doivent franchir le plus rapidement possible. @fr
definition: Corrida em que os participantes têm de percorrer um circuito com obstáculos o mais rápido possível. @pt-br
note: nessuno
note: typo fixed in Explanation @en-gb
in scheme: Subject Code
created: 2000-10-30T12:00:00+00:00
modified: 2010-12-15T17:01:09+00:00
broader: Ciclismo

Trial
type: Concept
preferred label: trial @pt-pt
preferred label: トライアル @ja-jp
preferred label: VTT trial @fr
definition: Corsa cronometrata durante la quale i concorrenti su mountain bikes devono superare un terreno rischioso e degli ostacoli senza appoggiare i piedi a terra
definition: Corrida de bicicletas de montanha em que os participantes devem transpor percursos acidentados e obstáculos sem colocar os pés no chão, perdendo pontos se isso acontecer. @pt-br
definition: トリッキーな地形と障害物を、地面に足をつけずにマウンテンバイクで時間内に越えなければならないレース @ja-jp
definition: Una carrera donde los competidores en sus bicicletas montaña deben sortear complejos obstáculos, sin apoyar sus pies en el terreno. @es
definition: A timed race in which competitors on mountain bikes must negotiate tricky terrain and obstacles without putting their feet down. @en-gb
definition: Corrida de bicicletas todo o terreno em que os participantes devem transpor percursos acidentados e obstáculos sem colocar os pés no chão, perdendo pontos se isso acontecer. @pt-pt
definition: L'épreuve trial consiste à franchir des zones (naturelles ou artificielles) qui font appel à des notions d'équilibre et de maîtrise du vélo sans avoir d'appuis autres que les pneus. @fr
definition: Eine gestoppte Strecke auf der die Wettkämpfer schwieriges Gelände und Hindernisse auf Mountainbikes bewältigen müssen, ohne dass die Füße den Boden berühren dürfen. @de
note: nessuno
note: typo fixed in Explanation @en-gb
in scheme: Subject Code
created: 2000-10-30T12:00:00+00:00
modified: 2010-12-15T17:01:09+00:00
broader: Ciclismo
broad match: http://cv.iptc.org/newscodes/mediatopic/20000903

Ciclismo acrobatico
type: Concept
preferred label: ciclismo artístico @pt-br
preferred label: Cyclisme artistique @fr
preferred label: artistic cycling @en-gb
preferred label: サイクルフィギュア @ja-jp
preferred label: Kunstfahren @de
definition: Disciplina nella quale i concorrenti devono fare delle figure artistiche su una bicicletta appositamente costruita per questo sport
definition: Individual or teams on one or two bicycles in an arena. Points are awarded by a jury. @en-gb
definition: Competição, individual ou por equipes, que consiste em fazer manobras e acrobacias em bicicletas especiais, adaptadas para o efeito. Os pontos são atribuídos por um júri. @pt-br
definition: アリーナ内にて、1台あるいは2台の自転車を使用し個人かチームで行う。ポイントは審判員によって与えられる @ja-jp
definition: discipline en salle qui consiste à faire des figures acrobatiques sur un vélo spécialement construit pour ce sport @fr
definition: Einzelne oder Mannschaften auf einem oder zwei Fahrrädern in einer Arena. Punkte werden durch eine Jury vergeben. @de
definition: Competição, individual ou por equipas, que consiste em fazer manobras e acrobacias em bicicletas especiais, adaptadas para o efeito. Os pontos são atribuídos por um júri. @pt-pt
definition: Competencia individual o en equipos, en bicicletas especiales con las que deben practicar acrobacias o maniobras planificadas. Un jurado otorga puntos. @es
note: nessuno
in scheme: Subject Code
created: 2003-11-26T12:00:00+00:00
modified: 2012-07-10T12:00:00+00:00
broader: Ciclismo

Ciclopalla
type: Concept
preferred label: Radball @de
preferred label: Cycle balle @fr
preferred label: ciclobol @pt-br
preferred label: サイクルサッカー @ja-jp
preferred label: cycle ball @en-gb
preferred label: bicibol (fútbol en bicicleta) @es
definition: 自転車を使用する団体競技。1つのチームあたり2人で、チーム同士で対戦する。やり方は、競技者が足を地面につけずに前後の車輪を使ってボールを動かす。 @ja-jp
definition: Desporto de equipe com bicicletas. O objetivo de cada equipe de dois jogadores é mover a bola usando a roda de trás e da frente sem deixar os pés tocar o chão. @pt-br
definition: Jeu de ballon se pratiquant à vélo à deux contre deux. Les joueurs utilisent les roues avant et arrière du vélo pour déplacer la balle sans poser le pied par terre @fr
definition: Competitive team sport using bicycles. One team against another with two persons per team. The aim is for competitors to move the ball using the front and rear wheels without letting their feet touch the ground. @en-gb
definition: Mannschaftswettbewerb auf Kunsträdern. Ein Radballteam spielt gegen ein anderes, bestehend aus jeweils zwei Spielern. Das Ziel der Wettkämpfer ist den Ball mit den Vorder- und Hinterrädern zu bewegen ohne mit den Füßen den Boden zu berühren. @de
definition: Sport di pallone nel quale i due concorrenti che si fronteggiano devono muovere la palla usando la ruota posteriore e anteriore della bicicletta senza appoggiare i piedi a terra
definition: Deporte competitivo con bicicletas. El objetivo de cada equipo de dos jugadores es mover la pelota hacia la valla rival utilizando ambas ruedas sin que sus pies toquen el suelo. @es
definition: Desporto de equipa com bicicletas. O objetivo de cada equipa de dois jogadores é mover a bola usando a roda de trás e da frente sem deixar os pés tocar o chão. @pt-pt
note: nessuno
in scheme: Subject Code
created: 2003-11-26T12:00:00+00:00
modified: 2012-07-10T12:00:00+00:00
broader: Ciclismo

Piattaforma 10m
type: Concept
preferred label: 10 m plataforma @pt-br
preferred label: Haut vol 10 m @fr
preferred label: 10m Plattform @de
preferred label: 10 metros plataforma @es
preferred label: 高飛び込み @ja-jp
preferred label: 10 m platform @en-gb
definition: I concorrenti si tuffano da una piattaforma a dieci metri d'altezza
definition: ダイバーは高さ10メートルのプラットフォームから飛び込みを行う @ja-jp
definition: Os atletas mergulham de uma plataforma a 10 m de altura. @pt-pt
definition: Springer starten von einer 10 m hohen Plattform. @de
definition: Les sauts sont réalisés à partir d'une plate-forme haute de 10 mètres @fr
definition: Divers take off from a ten metre high platform. @en-gb
definition: Competidores se lanzan al agua desde una plataforma fija de 10 metros de altura. @es
note: nessuno
in scheme: Subject Code
created: 2000-10-30T12:00:00+00:00
modified: 2010-12-15T17:01:09+00:00
broader: Tuffi
broad match: http://cv.iptc.org/newscodes/mediatopic/20000914

Piattaforma 10m sincro
type: Concept
preferred label: シンクロナイズド高飛び込み @ja-jp
preferred label: 10 m platform synchronised @en-gb
preferred label: 10 metros plataforma sincronizada @es
preferred label: 10 m plataforma sincronizado @pt-br
preferred label: Haut vol synchronisé @fr
preferred label: 10m Synchronspringen Plattform @de
definition: Dos competidores del mismo equipo se lanzan desde distintas plataformas al mismo tiempo. Son juzgados tanto por sus figuras ejecutadas en el agua según estándares comunes y por el grado de sincronización entre ambos. @es
definition: sauts réalisés par 2 plongeurs d'une même équipe. Ils exécutent leurs figures à partir d'une plate-forme distincte et, outre les critères traditionnels de jugement, ils sont également notés sur leur synchronisme. @fr
definition: Due concorrenti della stessa squadra si tuffano contemporaneamente da piattaforme diverse e sono giudicati per i criteri standard e anche per la sincronia
definition: Zwei Wettkämpfer des gleichen Teams starten von der gleichen oder unterschiedlichen Plattformen. Sie werden zusätzlich zu den Standard-Kriterien auch noch in Synchronisation bewertet. @de
definition: 同じチームの2選手が同時に別の台から飛び込む。標準の評価基準で判定されることはもちろん、その同調性に得点を与えられる @ja-jp
definition: Two competitors from the same team dive off at the same time from separate platforms. As well as being judged on the standard criteria they are also awarded marks for synchronisation. @en-gb
definition: Dois atletas da mesma equipe mergulham ao mesmo tempo de plataformas separadas. São avaliados pelos critérios técnicos e pela sincronização entre ambos. @pt-br
definition: Dois atletas da mesma equipa mergulham ao mesmo tempo de plataformas separadas. São avaliados pelos critérios técnicos e pela sincronização entre ambos. @pt-pt
note: nessuno
in scheme: Subject Code
created: 2000-10-30T12:00:00+00:00
modified: 2010-12-15T17:01:09+00:00
broader: Tuffi
broad match: http://cv.iptc.org/newscodes/mediatopic/20000916

Trampolino 3m
type: Concept
preferred label: 3 m springboard @en-gb
preferred label: Tremplin 3 m @fr
preferred label: 板飛び込み @ja-jp
preferred label: 3 m trampolim @pt-br
preferred label: 3 metros trampolín @es
preferred label: 3 m prancha @pt-pt
preferred label: 3m Sprungbrett @de
definition: 飛び込み者は3mの飛板から飛び込む @ja-jp
definition: I concorrenti si tuffano da un trampolino di tre metri d'altezza
definition: Competidores se lanzan desde un trampolín ubicado a tres metros sobre el nivel del agua. @es
definition: Les sauts sont réalisés à partir d'un tremplin de 3 mètres @fr
definition: Os atletas mergulham de um trampolim a 3 m de altura. @pt-pt
definition: Divers dive from a three-metre high springboard. @en-gb
definition: Springer starten von einem 3 m hohen Sprungbrett. @de
note: nessuno
in scheme: Subject Code
created: 2000-10-30T12:00:00+00:00
modified: 2010-12-15T17:01:09+00:00
broader: Tuffi
broad match: http://cv.iptc.org/newscodes/mediatopic/20000915

Trampolino 3m sincro
type: Concept
preferred label: 3 m trampolim sincronizado @pt-br
preferred label: 3m Synchron Sprungbrett @de
preferred label: シンクロナイズド板飛び込み @ja-jp
preferred label: Tremplin synchronisé 3 m @fr
preferred label: 3 m springboard synchronised @en-gb
preferred label: 3 m prancha sincronizado @pt-pt
preferred label: 3 metros trampolín sincronizado @es
definition: Due concorrenti si tuffano contemporaneamente da due trampolini diversi a tre metri d'altezza e sono giudicati in base ai criteri standard e anche per la sincronia
definition: Two competitors from the same team dive off at the same time from separate three-metre high springboards. As well as being judged on the standard criteria they are also awarded marks for synchronisation. @en-gb
definition: Dois atletas da mesma equipa mergulham ao mesmo tempo de trampolins separados. São avaliados pelos critérios técnicos e pela sincronização entre ambos. @pt-pt
definition: Dos competidores del mismo equipo se lanzan desde distintos trampolines de tres metros de altura, al mismo tiempo. Son juzgados por las figuras exhibidas y por el grado de sincronización entre ambos. @es
definition: Dois atletas da mesma equipe mergulham ao mesmo tempo de trampolins separados. São avaliados pelos critérios técnicos e pela sincronização entre ambos. @pt-br
definition: Zwei Wettkämpfer des gleichen Teams starten von der gleichen oder unterschiedlichen 3 m hohen Plattformen. Sie werden zusätzlich zu den Standard-Kriterien auch noch in Synchronisation bewertet. @de
definition: sauts réalisés par 2 plongeurs d'une même équipe. Ils exécutent leurs figures à partir d'un tremplin distinct et, outre les critères traditionnels de jugement, ils sont également notés sur leur synchronisme. @fr
definition: 同じチームの2人の選手が同時に分割された3mの高さの板飛び込み台から飛び込む。 標準の評価基準で判定されることはもちろん、その同調性に得点を与えられる @ja-jp
note: nessuno
in scheme: Subject Code
created: 2000-10-30T12:00:00+00:00
modified: 2010-12-15T17:01:09+00:00
broader: Tuffi
broad match: http://cv.iptc.org/newscodes/mediatopic/20000916

Sport subacquei
type: Concept
preferred label: subaquatics @en-gb
preferred label: subaquático @pt-br
preferred label: サブアクアティクス @ja-jp
preferred label: Unterwassersport @de
preferred label: Subaquatique @fr
preferred label: subacuáticos @es
definition: Deporte como el hockey pero sostenido debajo del agua @es
definition: Sports like hockey held under water @en-gb
definition: Competizioni o prove fatte sott'acqua
definition: Desportos (como o hóquei) que se realizam debaixo de água. @pt-pt
definition: Sport wie Hockey, der unter Wasser ausgeübt wird. @de
definition: 水中で行なわれるホッケーのようなスポーツ @ja-jp
definition: compétition dont les épreuves se déroulent sous l'eau (Hockey, tir, orientation) @fr
definition: Esportes (como o hóquei) que se realizam debaixo de água. @pt-br
note: typo fixed in Explanation @en-gb
note: nessuno
in scheme: Subject Code
created: 2000-10-30T12:00:00+00:00
modified: 2010-12-15T17:01:09+00:00
broader: Tuffi

Immersioni subacquee
type: Concept
preferred label: mergulho @pt-br
preferred label: スキューバ @ja-jp
preferred label: Sporttauchen @de
preferred label: Plongée sous-marine @fr
preferred label: buceo 'scuba' @es
preferred label: scuba diving @en-gb
definition: Immersioni a diverse profondità sottomarine, Record apnee, ecc.
definition: Tauchen in unterschiedlichen Tiefen unter Zeitmessung. @de
definition: Mergulhar a diferentes profundidades com medição do tempo. @pt-br
definition: 時間計測とともに、異なる深さに飛び込むこと @ja-jp
definition: Diving into different depths, with time measurement @en-gb
definition: Plongée à différentes profondeurs avec des bouteilles d'air @fr
definition: Bucear con escafandra a distintas profundidades con control de tiempo. @es
note: nessuno
in scheme: Subject Code
created: 2003-11-26T12:00:00+00:00
modified: 2012-07-10T12:00:00+00:00
broader: Tuffi

Tre Giorni
type: Concept
preferred label: 総合馬術 @ja-jp
preferred label: Concours complet @fr
preferred label: concurso completo de equitação (CCE) @pt-br
preferred label: Vielseitigkeit @de
preferred label: three-day event @en-gb
preferred label: evento de tres días-completo @es
definition: Deporte ecuestre que incluye tres disciplinas: adiestramiento, salto y cross-country (como prueba de fondo). @es
definition: Evento equestre envolvendo três disciplinas: adestramento, cross-country e concurso de saltos. @pt-br
definition: 馬場馬術、クロスカントリー、および障害飛越の3つの規律にかかわる馬術競技 @ja-jp
definition: Competizione equestre con tre discipline nell'arco di tre giorni
definition: compétition qui combine 3 épreuves se déroulant sur 3 jours (Dressage, endurance et concours hippique) @fr
definition: Evento equestre envolvendo três disciplinas: dressage, cross-country e concurso de saltos. @pt-pt
definition: Equestrian event involving three disciplines - Dressage, cross-country and show jumping. @en-gb
definition: Pferdesport-Ereignis mit drei Disziplinen - Dressur, Geländeritt und Springen. @de
note: nessuno
in scheme: Subject Code
created: 2000-10-30T12:00:00+00:00
modified: 2010-12-15T17:01:09+00:00
broader: Equitazione

Dressage
type: Concept
preferred label: dressage @pt-pt
preferred label: adiestramiento de caballos @es
preferred label: 馬場馬術 @ja-jp
preferred label: adestramento @pt-br
preferred label: Dressur @de
definition: Prova di concorso completo in cui il fantino è giudicato in base a tre diverse andature: passo, trotto e galoppo
definition: A rider is judged on a series of moves at three different paces - walk, trot and gallop. @en-gb
definition: Prova do concurso completo. O cavaleiro é avaliado por uma série de figuras ou movimentos que o cavalo tem de executar em três velocidades: passo, trote e galope. @pt-br
definition: El jockey debe hacer que su caballo ejecute una serie de movimientos y figuras y es juzgado según tres pasos diferentes: caminar, trotar y galopar. @es
definition: Der Reiter wird bewertet in einer Reihe von Figuren in drei verschiedenen Gangarten - Schritt, Trab und Galopp. @de
definition: 歩き、早足、襲歩と異なった3つのペースの一連の動きで乗り手は判定される @ja-jp
definition: épreuve du concours complet; Le cavalier doit faire exécuter par son cheval une série de figures ou mouvements. Le cavalier doit mettre en valeur sa monture aux trois allures, pas, trot et galop. @fr
note: nessuno
in scheme: Subject Code
created: 2000-10-30T12:00:00+00:00
modified: 2010-12-15T17:01:09+00:00
broader: Equitazione

Salto
type: Concept
preferred label: Springen @de
preferred label: jumping @en-gb
preferred label: Saut d'obstacles @fr
preferred label: saltos @pt-br
preferred label: salto de obstáculos @es
preferred label: 障害飛越 @ja-jp
definition: 騎手と馬は制限時間以内に、囲われた競技場の一連の障害を跳ぶのを試みる @ja-jp
definition: A rider and horse attempt to jump a series of obstacles in an enclosed arena against the clock. @en-gb
definition: Reiter und Pferd versuchen auf Zeit verschiedene Hindernisse zu überspringen in einer geschlossenen Arena. @de
definition: Prova do concurso completo. Cavaleiro e cavalo têm de saltar uma série de obstáculos, no menor tempo possível, em área delimitada. @pt-br
definition: Prova nella quale fantino e cavallo tentano il salto di una serie di ostacoli all'interno di un'arena entro un tempo stabilito
definition: épreuve du concours complet. Le saut d'obstacles consiste à franchir en un minimum de temps une série d'obstacles divers (rivière, barres, mur) sans les faire tomber @fr
definition: El jinete intenta junto a su caballo saltar en el menor tiempo posible una serie de obstáculos (muro, agua, valla) en una superficie delimitada. @es
note: nessuno
in scheme: Subject Code
created: 2000-10-30T12:00:00+00:00
modified: 2010-12-15T17:01:09+00:00
broader: Equitazione

Cross-Country
type: Concept
preferred label: cross country (campo traviesa) @es
preferred label: クロスカントリー @ja-jp
preferred label: Cross-country @fr
preferred label: Geländeritt @de
preferred label: cross country @pt-br
definition: 人工物や自然の障害物を利用した地方のサーキットで行われる馬術競技 @ja-jp
definition: épreuve du concours complet. Parcours tracé à travers la campagne comportant des obstacles fixes et naturels @fr
definition: Equestrian event held on a designated circuit in the countryside featuring artificial and natural obstacles. @en-gb
definition: Prova do concurso completo. Evento equestre realizado em circuito de campo, com obstáculos naturais e artificiais. @pt-pt
definition: Evento ecuestre sostenido sobre un circuito con obstáculos naturales y artificiales. @es
definition: Prova su un circuito tracciato in campagna con ostacoli artificiali e naturali
definition: Pferdesport-Ereignis in einem markierten Gelände im Freien mit natürlichen und künstlichen Hindernissen. @de
note: nessuno
note: typo fixed in Explanation @en-gb
in scheme: Subject Code
created: 2000-10-30T12:00:00+00:00
modified: 2010-12-15T17:01:09+00:00
broader: Equitazione

Spada
type: Concept
preferred label: Degen @de
preferred label: epee @en-gb
preferred label: エペ @ja-jp
preferred label: espada @pt-pt
preferred label: Epée @fr
definition: category of fencing using a weapon with a triangular cross-section blade and a large bell guard. @en-gb
definition: catégorie d'arme pour pratiquer l'escrime : lame rigide et triangulaire emmanchée dans une poignée munie d'une garde @fr
definition: Categoria de esgrima que usa uma arma com lâmina rígida e triangular, dotada de empunhadura com guarda-mão grande. @pt-br
definition: Arma con lama di sezione triangolare che viene usata di punta e che può colpire tutto il corpo
definition: 三角形の断面を持つ刃と大きな釣り鐘状のガードがついている武器を使用するフェンシング競技のひとつ @ja-jp
definition: Kategorie des Fechtens mit einer Waffe, die aus einer dreieckigen Querschnittklinge und einem großen Korbschutz (Glocke) besteht. @de
definition: Categoría de esgrima usando un arma con hoja rígida y de forma triangular, con empuñadura que consta de una protección en forma de campana. @es
note: nessuno
in scheme: Subject Code
created: 2000-10-30T12:00:00+00:00
modified: 2010-12-15T17:01:09+00:00
broader: Scherma

Fioretto
type: Concept
preferred label: florete @pt-pt
preferred label: foil @en-gb
preferred label: Florett @de
preferred label: フルーレ @ja-jp
preferred label: Fleuret @fr
definition: Kategorie des Fechtens mit einer Waffe, die aus einer rechteckigen Querschnittklinge besteht und einem kleinen Korbschutz (Glocke) besteht. @de
definition: catégorie d'arme pour pratiquer l'escrime : lame lame flexible et rectangulaire au bout garni de peau @fr
definition: Categoria de esgrima que usa uma arma com lâmina flexível e quadrangular, dotada de empunhadura com pequeno guarda-mão. @pt-pt
definition: Arma con una lama rettangolare che può colpire solo di punta, il cui bersaglio valido è tutto il tronco
definition: 四角形の断面を持つ刃と小さな釣り鐘状のガードがついている武器を使用するフェンシング競技のひとつ @ja-jp
definition: Categoría de esgrima usando un arma blanca con hoja flexible y rectangular, adosada de una pequeña protección en forma de campana para la mano. @es
definition: category of fencing using a weapon with a rectangular cross-section blade and a small bell guard. @en-gb
note: nessuno
in scheme: Subject Code
created: 2000-10-30T12:00:00+00:00
modified: 2010-12-15T17:01:09+00:00
broader: Scherma

Sciabola
type: Concept
preferred label: sabre @pt-pt
preferred label: sable @es
preferred label: Sabre @fr
preferred label: サーブル @ja-jp
preferred label: Säbel @de
definition: a fencing weapon with a flat blade and knuckle guard used with cutting or thrusting moves. @en-gb
definition: Categoria de esgrima que usa uma arma com lâmina muito flexível e triangular, ligeiramente curva, dotada de empunhadura com pequeno guarda-mão semicircular. @pt-pt
definition: Arma con una lama piatta usata con movimenti sferzanti che può colpire con tutta la lama tutta la metà superiore del corpo
definition: Categoría de esgrima usando un arma de filo chato con área de protección para los nudillos, empleada con movimientos de corte ante el contrincante. @es
definition: catégorie d'arme pour pratiquer l'escrime: arme à pointe et à tranchant à lame lame flexible et triangulaire @fr
definition: フェンシングの武器は拳を守る平らな剣を使用し、斬ったり突いたりする @ja-jp
definition: Eine Fechtwaffe mit einem Handschutz und einer flachen Klinge mit schneidenden und stoßenden Bewegungen. @de
note: nessuno
in scheme: Subject Code
created: 2000-10-30T12:00:00+00:00
modified: 2010-12-15T17:01:09+00:00
broader: Scherma

Hockey a rotelle
type: Concept
preferred label: Roll hockey @fr
preferred label: ローラーホッケー @ja-jp
preferred label: hockey sobre patines @es
preferred label: hóquei em patins @pt-pt
preferred label: Rollhockey @de
preferred label: roll hockey @en-gb
definition: Parecido al hockey hielo, ejecutado sobre patines de cuatro ruedas con bastones y una bocha. @es
definition: *Esporte de equipe semelhante ao hóquei no gelo, executado sobre patins de 4 rodas, com tacos (**sticks**) e uma bola.*** @pt-br
definition: Sport di squadra simile all'hockey sul ghiaccio ma con pattini a quattro ruote, bastoni e una palla
definition: *Desporto de equipa semelhante ao hóquei no gelo, executado sobre patins de 4 rodas, com tacos (**sticks**) e uma bola.* @pt-pt
definition: Team sport similar to ice hockey, executed on 4 wheel roller skates with sticks and a ball @en-gb
definition: jeu de balle et de crossse sur patin à roulettes (roller) @fr
definition: Mannschaftssport ähnlich dem Eishockey, gespielt auf vierrädrigen Rollschuhen mit Schlägern und einem Ball. @de
definition: アイスホッケー同様のチームスポーツ、4輪のローラースケートとスティックとボールで競技する @ja-jp
note: nessuno
in scheme: Subject Code
created: 2003-11-26T12:00:00+00:00
modified: 2012-07-10T12:00:00+00:00
broader: Hockey su prato

Individuale
type: Concept
preferred label: singulares @pt-pt
preferred label: Einzellauf @de
preferred label: シングル @ja-jp
preferred label: individual @es
preferred label: Individuel @fr
preferred label: singles @en-gb
definition: Dieser Einzelwettbewerb beinhaltet ein kurzes Programm, welches zu 33,3% aus Pflicht und zu 66,7% aus freier Kür besteht. @de
definition: 個人競技の得点はショートプログラムが33.3%でフリースケートが66.7%からなる @ja-jp
definition: La prova individuale di pattinaggio artistico
definition: catégorie du patinage artistique @fr
definition: A competição individual inclui um programa curto que vale 33.3% da pontuação e um programa livre (ou programa longo) que vale 66.7%. @pt-pt
definition: The individual events comprise a short program which counts for 33.3% of the score, and the free skate which is worth 66.7%. @en-gb
definition: El evento individual comprende un programa corto que cuenta en un 33,3% del puntaje y el patinaje libre que vale el restante 66,7%. @es
note: nessuno
in scheme: Subject Code
created: 2000-10-30T12:00:00+00:00
modified: 2010-12-15T17:01:09+00:00
broader: Pattinaggio artistico
broad match: http://cv.iptc.org/newscodes/mediatopic/20000934

In coppia
type: Concept
preferred label: pares @es
preferred label: duplas @pt-br
preferred label: Couple @fr
preferred label: pairs @en-gb
preferred label: Paarlauf @de
preferred label: ペア @ja-jp
definition: Igual que el individual (824) pero en parejas parejas . @es
definition: The pairs event comprise a short program which counts for 33.3% of the score, and the free skate which is worth 66.7%. @en-gb
definition: A competição por pares inclui um programa curto que vale 33.3% do resultado e um programa livre (ou programa longo) que vale 66.7%. @pt-pt
definition: La prova in coppia di pattinaggio artistico
definition: Dieser Paarwettbewerb beinhaltet ein kurzes Programm, welches zu 33,3% aus Pflicht und zu 66,7% aus freier Kür besteht. @de
definition: ペア競技の得点はショートプログラムが33.3%でフリースケートが66.7%からなる @ja-jp
definition: A competição de duplas inclui um programa curto que vale 33.3% do resultado e um programa livre (ou programa longo) que vale 66.7%. @pt-br
definition: catégorie du patinage artistique @fr
note: nessuno
in scheme: Subject Code
created: 2000-10-30T12:00:00+00:00
modified: 2010-12-15T17:01:09+00:00
broader: Pattinaggio artistico
broad match: http://cv.iptc.org/newscodes/mediatopic/20000934

Danza sul ghiaccio
type: Concept
preferred label: Danse @fr
preferred label: dança no gelo @pt-pt
preferred label: ice dance @en-gb
preferred label: Eistanz @de
preferred label: アイスダンス @ja-jp
preferred label: danza sobre hielo @es
definition: 3日間でオリジナルダンス(2分30秒)および自由ダンス(4分)の2つのコンパルソリーフィギュアダンスを順番に行う @ja-jp
definition: Takes place over three days with, in order, two compulsory dances, the original dance (2min 30sec) and the free dance (4min). @en-gb
definition: Si svolge in tre giorni con, in ordine, due danze obbligatorie, quella originale (2 minuti e 30 secondi) e quella libera (4 minuti)
definition: catégorie du patinage artistique @fr
definition: Prova que decorre durante 3 dias, com duas danças obrigatórias, uma dança original (2min 30s) e uma dança livre (4min). @pt-br
definition: Findet über drei Tage statt in folgender Reihenfolge, zwei obligatorische Tänze, ein origineller Tanz (2,30 min) und ein freier Tanz (4 min). @de
definition: Categoría de patinaje artístico, prueba que tiene lugar en tres días, con dos danzas obligatorias, la original (2 minutos 30 segundos) y la ejecución libre (4 minutos). @es
note: nessuno
in scheme: Subject Code
created: 2000-10-30T12:00:00+00:00
modified: 2010-12-15T17:01:09+00:00
broader: Pattinaggio artistico

Gobbe
type: Concept
preferred label: moguls @en-gb
preferred label: descenso en esquí @es
preferred label: Trickski @de
preferred label: Ski de bosses @fr
preferred label: モーグル @ja-jp
definition: Os esquiadores deslizam ao longo de uma descida muito inclinada e ondulada, com bossas ou lombas de neve, realizando saltos e curvas tecnicamente difíceis, tentando manter uma linha reta do início ao fim. @pt-pt
definition: Los competidores abordan una bajada empinada y ondulada, procurando realizar curvas y saltos, aunque tratando de mantener la línea más recta posible en su descenso desde la cima hasta la parte inferior de la colina. @es
definition: Contestants attack a heavily moguled slope, performing technically challenging turns and jumps, while maintaining the most direct line from the top to the bottom of the hill. @en-gb
definition: Wettkämpfer bewältigen eine stark kurvenreiche Steigung, indem sie technische Drehungen und Sprünge zeigen und auf der direkten Linie die Piste herunterfahren. @de
definition: I concorrenti scendono per una pista di gobbe realizzando rotazioni e salti cercando di mantenere la linea diretta da cima a fondo
definition: Les concurrents descendent à skis une piste bosselée tout en ponctuant leur descente de sauts techniques et de vrilles @fr
definition: 難易度の高い回転やジャンプをして、厳しいこぶ斜面を丘の上から下へ直線的に滑り、ゴールを目指す競技 @ja-jp
note: typo fixed in Explanation @en-gb
note: nessuno
in scheme: Subject Code
created: 2000-10-30T12:00:00+00:00
modified: 2010-12-15T17:01:09+00:00
broader: Sci Freestyle
broad match: http://cv.iptc.org/newscodes/mediatopic/20001058

Aereo
type: Concept
preferred label: aerials @en-gb
preferred label: Schanzenspringen @de
preferred label: エアリアル @ja-jp
preferred label: Saut acrobatique @fr
preferred label: salto acrobático @es
definition: I concorrenti realizzano una serie di torsioni e rotazioni partendo da una rampa preparata
definition: Los esquiadores realizan una serie de acrobacias aéreas y giros a partir de un salto preparado por rampa. @es
definition: ジャンプ台からの一連の動作で空中でのひねりや回転動作を競う競技 @ja-jp
definition: Os esquiadores realizam uma série de acrobacias e piruetas aéreas após um salto com rampa. @pt-pt
definition: le skieur doit effectuer une série de figures en s'élançant sur des tremplins @fr
definition: Wettkämpfer zeigen eine Reihe von Luftsprüngen und Drehungen von einer präparierten Schanze. @de
definition: Competitors perform a series of aerial twists and turns from a prepared jump. @en-gb
note: nessuno
in scheme: Subject Code
created: 2000-10-30T12:00:00+00:00
modified: 2010-12-15T17:01:09+00:00
broader: Sci Freestyle
broad match: http://cv.iptc.org/newscodes/mediatopic/20001058

Sci artistico
type: Concept
preferred label: esqui artístico @pt-br
preferred label: artistic skiing @en-gb
preferred label: acroski @fr
preferred label: esquí artístico @es
preferred label: Skiakrobatik @de
preferred label: アーティスティックスキー @ja-jp
definition: 音楽に合わせてジャンプやひねりといった芸術的な一連の動作を競い合う競技。ストックの使用は許されている @ja-jp
definition: Wettkämpfer zeigen eine Reihe artistischer Figuren (Sprünge und Drehungen) zu Musik. Die Benutzung von Skistöcken ist verboten. @de
definition: exécution sur un rythme musical d' un programme de figures libres (sauts et vrilles) au cours duquel l'appui sur les bâtons est permis @fr
definition: Los competidores realizan una serie de movimientos artísticos al compás de la música. El uso de palos de esquí está permitido para realizar los saltos y figuras. @es
definition: Os esquiadores realizam uma série de movimentos artísticos coreografados (saltos, piruetas, etc.) ao som de música. É permitido usar bastões de esqui. @pt-br
definition: I concorrenti realizzano una serie di movimenti artistici (salti e rotazioni) su base musicale. E'permesso l'uso delle racchette da sci
definition: Competitors perform a series of artistic moves (jumps and twists) all set to music. The use of ski poles is permitted. @en-gb
note: nessuno
in scheme: Subject Code
created: 2000-10-30T12:00:00+00:00
modified: 2010-12-15T17:01:09+00:00
broader: Sci Freestyle
broad match: http://cv.iptc.org/newscodes/mediatopic/20001058

Esercizio a terra
type: Concept
preferred label: solo @pt-pt
preferred label: floor exercise @en-gb
preferred label: ejercicios en el suelo @es
preferred label: Bodenturnen @de
preferred label: 床運動 @ja-jp
preferred label: Sol @fr
definition: 12m四方のマット上で行う体操床運動 @ja-jp
definition: Exercício de ginástica no solo, em estrado de 12m x 12m. @pt-br
definition: Eine gymnastische Bodenübung auf einer 12 m Matte. @de
definition: A gymnastics floor exercise on a 12m/sq matt. @en-gb
definition: Esercizio praticato a terra su un tappeto di 12mq.
definition: Ejercicios de gimnasia en el suelo, sobre un tapete de 12 metros cuadrados de superficie. @es
definition: exercice de gymnastique pratiquée sur un tapis carré de 12m de coté @fr
definition: Exercício de ginástica no solo, em tapete de 12m x 12m. @pt-pt
note: nessuno
in scheme: Subject Code
created: 2000-10-30T12:00:00+00:00
modified: 2010-12-15T17:01:09+00:00
broader: Ginnastica
broad match: http://cv.iptc.org/newscodes/mediatopic/20001152

Volteggio
type: Concept
preferred label: salto con apoyo (potro) @es
preferred label: 跳馬 @ja-jp
preferred label: salto @pt-br
preferred label: Pferdsprung @de
preferred label: Saut de cheval @fr
preferred label: salto de cavalo @pt-pt
preferred label: vault @en-gb
definition: Le gymnaste prend son appel sur un petit tremplin disposé devant l'appareil (disposé dans le sens de la longueur) au terme d'une course de 25 m. @fr
definition: gymnasts propel themselves by jumping on a trampoline after running quickly down a 25m lane @en-gb
definition: Volteggio dopo aver saltato sull'attrezzo dopo aver preso una rincorsa lungo una corsia di 25m e aver preso slancio su di un piccolo trampolino
definition: 体操選手は25mの助走後に踏み切り台を使いジャンプして前に行く @ja-jp
definition: Os ginastas ganham impulso saltando sobre um trampolim e uma espécie de mesa após corrida acelerada em pista de 25m. @pt-pt
definition: Turner bringt sich selbst in die Luft durch Abspringen von einem Brett nach einem schellen Lauf von 25 Metern. @de
definition: Los gimnastas toman impulso con un salto de un trampolín dispuesto delante del aparato (ubicado en el sentido de su longitud) luego de correr 25 metros. @es
note: nessuno
in scheme: Subject Code
created: 2000-10-30T12:00:00+00:00
modified: 2010-12-15T17:01:09+00:00
broader: Ginnastica
broad match: http://cv.iptc.org/newscodes/mediatopic/20001152

Cavallo
type: Concept
preferred label: pommel horse @en-gb
preferred label: Cheval d'arçon @fr
preferred label: potro con arcos @es
preferred label: あん馬 @ja-jp
preferred label: Seitpferd @de
preferred label: cavalo com alças @pt-br
preferred label: cavalo de arções @pt-pt
definition: Turner zeigen einen nicht unterbrochenen Schwung über ein Pferd mit Handgriffen unter Einsatz von Balance und Kraft. @de
definition: Prova masculina em que os ginastas executam uma sequência ininterrupta de movimentos, balançando o corpo sobre um cavalo com alças, combinando equilíbrio e força. @pt-br
definition: 取っ手の付いた鞍馬上をバランスと力で絶え間なく揺れ動く競技 @ja-jp
definition: excercice de gymnastique qui consiste à effectuer mouvements ininterrompus sur un cheval muni d'arçons en bois @fr
definition: Movimenti ininterrotti oscillando su un cavallo dotato di maniglie, usando equilibrio e forza
definition: Gymnasts perform an uninterrupted swing motion over a handled horse using balance and strength. @en-gb
definition: Prova masculina em que os ginastas executam uma sequência ininterrupta de movimentos, balançando o corpo sobre um cavalo de arções, combinando equilíbrio e força. @pt-pt
definition: Gimnastas interpretan una sesión de movimientos ininterrrumpidos sobre un potro con anillas, combinando balance y fuerza. @es
note: nessuno
in scheme: Subject Code
created: 2000-10-30T12:00:00+00:00
modified: 2010-12-15T17:01:09+00:00
broader: Ginnastica
broad match: http://cv.iptc.org/newscodes/mediatopic/20001152

Parallele asimmetriche
type: Concept
preferred label: Stufenbarren @de
preferred label: barras assimétricas @pt-pt
preferred label: 段違い平行棒 @ja-jp
preferred label: uneven bars @en-gb
preferred label: paralelas assimétricas @pt-br
preferred label: Barres asymétriques @fr
preferred label: barras asimétricas @es
definition: Prova feminina em que as ginastas executam uma série de movimentos de impulso, de transição e estáticos em redor de duas barras paralelas colocadas a diferentes alturas. @pt-br
definition: exercice de gymnastique qui consiste réaliser des enchaînements aux barres asymétriques @fr
definition: Gymnasts run through an airborne routine swinging around and between the uneven bars. @en-gb
definition: Turner zeigt eine routinierte Schwungfolge zwischen und um die ungleichen Barren herum. @de
definition: Oscillazione intorno e tra le parallele asimmetriche
definition: 体操選手は、段違い平行棒の周りやその空間で演技を行う @ja-jp
definition: Gimnasta ejecutan una rutina alrededor y entre las barras asimétricas. @es
note: nessuno
note: typo fixed in Explanation @en-gb
in scheme: Subject Code
created: 2000-10-30T12:00:00+00:00
modified: 2010-12-15T17:01:09+00:00
broader: Ginnastica
broad match: http://cv.iptc.org/newscodes/mediatopic/20001152

Parallele
type: Concept
preferred label: barras paralelas @es
preferred label: Barren @de
preferred label: 平行棒 @ja-jp
preferred label: Barres parallèles @fr
preferred label: parallel bars @en-gb
definition: Turner schwingt und kreist mit Leichtigkeit und Grazie an den parallelen Barren. @de
definition: Prova masculina em que os ginastas executam uma sequência de movimentos ao longo de duas barras dispostas paralelamente à mesma altura. @pt-pt
definition: 体操選手は、平行棒をうまく優美にスイングしたり回ったりする @ja-jp
definition: exercice de gymnastique qui consiste à travailler en suspension à l'établissement d'équilibre sur des barres parallèles @fr
definition: Gimnastas ejecutan una rutina en suspensión, procurando movimientos equilibrados entre las barras paralelas. @es
definition: Gymnasts swing and turn with guile and grace around the parallel bars. @en-gb
definition: Oscillazione e rotazione tenendosi alle parallele
note: nessuno
in scheme: Subject Code
created: 2000-10-30T12:00:00+00:00
modified: 2010-12-15T17:01:09+00:00
broader: Ginnastica
broad match: http://cv.iptc.org/newscodes/mediatopic/20001152

Barra
type: Concept
preferred label: Reck @de
preferred label: horizontal bar @en-gb
preferred label: barra fija @es
preferred label: 鉄棒 @ja-jp
preferred label: barra @pt-pt
preferred label: Barre fixe @fr
definition: Prova masculina em que os ginastas executam uma sequência de movimentos giratórios e acrobacias suspenso de uma barra horizontal fixa. @pt-br
definition: Rotazioni, giravolte e piroette intorno alla barra orizzontale
definition: Turner dreht, schwingt und zeigt Pirouetten an dem horizontalen Reck. @de
definition: Gimnastas ejecutan rutina de giros, balanceos y piruetas alrededor de la barra horizontal fija. @es
definition: 体操選手は、水平な鉄棒の周りで回転、急回転、旋回を行う @ja-jp
definition: exercice de gymnastique qui consiste à réaliser des tours, bascules et pirouettes et lacher d'une barre fixe @fr
definition: Gymnasts turn, spin and perform pirouettes around the horizontal bar. @en-gb
note: nessuno
in scheme: Subject Code
created: 2000-10-30T12:00:00+00:00
modified: 2010-12-15T17:01:09+00:00
broader: Ginnastica
broad match: http://cv.iptc.org/newscodes/mediatopic/20001152

Anelli
type: Concept
preferred label: anillas @es
preferred label: Anneaux @fr
preferred label: rings @en-gb
preferred label: argolas @pt-br
preferred label: つり輪 @ja-jp
preferred label: Ringe @de
definition: Prova masculina em que os ginastas demonstram sua capacidade de força e equilíbrio executando movimentos e acrobacias suspensos de duas argolas paralelas. @pt-br
definition: Gymnasts perform feats of balance and strength from two suspended rings. @en-gb
definition: 体操選手は、2つの吊り輪からバランスと強さの妙技を行う @ja-jp
definition: Turner zeigt Figuren mit Balance und Kraft an den schwingenden Ringen. @de
definition: Los gimnastas demuestran su capacidad de fuerza y equilibrio utilizando dos argollas suspendidas por cintas de cuero. @es
definition: Prova masculina em que os ginastas demonstram a sua capacidade de força e equilíbrio executando movimentos e acrobacias suspensos de duas argolas paralelas. @pt-pt
definition: exercice de gymnastique réalisé au bout d'anneaux suspendus à un portique @fr
definition: Esercizi di equilibrio e forza da due anelli sospesi
note: nessuno
in scheme: Subject Code
created: 2000-10-30T12:00:00+00:00
modified: 2010-12-15T17:01:09+00:00
broader: Ginnastica
broad match: http://cv.iptc.org/newscodes/mediatopic/20001152

Trave
type: Concept
preferred label: trave @pt-pt
preferred label: Schwebebalken @de
preferred label: Poutre @fr
preferred label: 平均台 @ja-jp
preferred label: barra de equilibrio fija (o sueca) @es
preferred label: beam @en-gb
definition: Salti e piccoli giri sulla trave di equilibrio larga appena 10 cm
definition: Gymnasts perform leaps and flips from the much feared balance beam just 10 cm wide. @en-gb
definition: Gimnastas ejecutan su rutina de volteretas y saltos en una barra fija de tan sólo 10 centímetros de ancho y a 1,2 m del suelo. @es
definition: exercice d'équilibre et de souplesse et de sauts réalisés sur une poutre de 10 cm de largeur à 1,20m du sol @fr
definition: Prova feminina em que as ginastas executam uma série de movimentos e saltos em cima de uma trave fixa de 10 cm de largura a 1.20m do chão. @pt-pt
definition: 体操選手は、10cm幅ちょうどの恐怖感あふれる平均台から跳躍と宙返りを行う @ja-jp
definition: Turner zeigt Sprünge und Drehungen auf dem meist gefürchteten Schwebebalken mit 10 cm Breite. @de
note: nessuno
note: typo fixed in Explanation @en-gb
in scheme: Subject Code
created: 2000-10-30T12:00:00+00:00
modified: 2010-12-15T17:01:09+00:00
broader: Ginnastica
broad match: http://cv.iptc.org/newscodes/mediatopic/20001152

Ritmica
type: Concept
preferred label: 新体操 @ja-jp
preferred label: rítmica @pt-br
preferred label: gimnasia rítmica @es
preferred label: Rhythmische Gymnastik @de
preferred label: Gymnastique rythmique @fr
preferred label: rhythmic @en-gb
definition: Modalidade desportiva que alia a dança a movimentos de ginástica. @pt-pt
definition: Insieme di movimenti di danza e ginnastica
definition: ダンスと体操動作を織り交ぜた競技 @ja-jp
definition: Eine Mischung aus Tanz und turnerischen Figuren. @de
definition: A mixture of dance and gymnastic moves. @en-gb
definition: Modalidade esportiva que alia a dança a movimentos de ginástica. @pt-br
definition: Práctica que mezcla la danza con movimientos de gimnasia. @es
definition: sport alliant la gymnastique à la danse @fr
note: nessuno
note: typo fixed in Name @en-gb
in scheme: Subject Code
created: 2000-10-30T12:00:00+00:00
modified: 2010-12-15T17:01:09+00:00
broader: Ginnastica

Clave
type: Concept
preferred label: maças @pt-br
preferred label: massues @fr
preferred label: clavas @es
preferred label: クラブ @ja-jp
preferred label: Keulen @de
preferred label: clubs @en-gb
definition: Esercizio basato sulla coreografia ed il ritmo utilizzando le clave
definition: Dance and gymnastic moves whilst juggling clubs. @en-gb
definition: Exercício de ginástica rítmica em que as ginastas realizam uma coreografia no solo usando maças. @pt-pt
definition: Tanz und gymnastische Figuren mit langen kreuzenden Keulen. @de
definition: クラブ(こん棒)を空中で操る間にダンスと体操動作を行う @ja-jp
definition: Ejercicio de gimnasia rítmica en el que se realiza una coreografía utilizando clavas. @es
definition: exercice basé sur la chorégraphie et le rythme en utilisant des massues @fr
note: nessuno
in scheme: Subject Code
created: 2000-10-30T12:00:00+00:00
modified: 2010-12-15T17:01:09+00:00
broader: Ginnastica
broad match: http://cv.iptc.org/newscodes/mediatopic/20000951

Cerchio
type: Concept
preferred label: フープ @ja-jp
preferred label: arco @pt-pt
preferred label: aro @es
preferred label: Reifen @de
preferred label: hoop @en-gb
preferred label: cerceau @fr
definition: Si fa rotolare e si lancia un cerchio mentre si realizza un passo di danza
definition: Exercício de ginástica rítmica em que as ginastas realizam uma coreografia no solo usando um arco. @pt-pt
definition: Ein Reifen wird lange gerollt und geworfen in einer Tanzperformance. @de
definition: La gimnasta lanza y hace rodar un aro para cumplir una rutina de danza. @es
definition: ダンス演技をしている間、フープ(輪)を転がしたり、放り投げたりする @ja-jp
definition: exercices utilisant un cerceau en le roulant et en le lançant @fr
definition: A hoop is rolled and thrown whilst performing a dance routine. @en-gb
note: nessuno
in scheme: Subject Code
created: 2000-10-30T12:00:00+00:00
modified: 2010-12-15T17:01:09+00:00
broader: Ginnastica
broad match: http://cv.iptc.org/newscodes/mediatopic/20000951

Nastro
type: Concept
preferred label: cinta @es
preferred label: ribbon @en-gb
preferred label: ruban @fr
preferred label: fita @pt-pt
preferred label: Bänder @de
preferred label: リボン @ja-jp
definition: Gimnastas ejecutan su rutina artística acompañados de una cinta que debe permanecer en movimiento durante la misma. @es
definition: Turner arbeiten mit spektakulären, langen Bändern eine vorbereitete Bewegungsfolge ab. @de
definition: 体操選手は、長いリボンを操る間、あらかじめ決められた動きをする @ja-jp
definition: Esercizio utilizzando un nastro particolarmente lungo che deve rimanere in movimento secondo una certa coreografia
definition: Gymnasts work through a pre-arranged routine whilst manipulating a spectacular length of ribbon. @en-gb
definition: Exercício de ginástica rítmica em que as ginastas realizam uma coreografia no solo usando uma fita. @pt-br
definition: exercice utilisant un ruban qui doit rester en mouvement selon des dessins programmés à l'avance @fr
note: typo fixed in Explanation @en-gb
note: nessuno
in scheme: Subject Code
created: 2000-10-30T12:00:00+00:00
modified: 2010-12-15T17:01:09+00:00
broader: Ginnastica
broad match: http://cv.iptc.org/newscodes/mediatopic/20000951

Corda
type: Concept
preferred label: cuerda @es
preferred label: corda @pt-br
preferred label: corde @fr
preferred label: Seil @de
preferred label: rope @en-gb
preferred label: ロープ @ja-jp
definition: ロープを操りながら、ジャンプや旋回運動をする @ja-jp
definition: Exercício de ginástica rítmica em que as ginastas realizam uma coreografia no solo usando uma corda. @pt-br
definition: Jump and figure movements are performed while a rope is manipulated. @en-gb
definition: Idem Cinta (844) pero con cuerda. @es
definition: Salti e figure utilizzando una corda
definition: exercice ulisant une corde. Le gymnaste effectue des figures en sautant @fr
definition: Sprünge und Figuren werden gezeigt durch die Bewegung eines Seiles. @de
note: nessuno
in scheme: Subject Code
created: 2000-10-30T12:00:00+00:00
modified: 2010-12-15T17:01:09+00:00
broader: Ginnastica
broad match: http://cv.iptc.org/newscodes/mediatopic/20000951

Palla
type: Concept
preferred label: pelota @es
preferred label: ボール @ja-jp
preferred label: bola @pt-pt
preferred label: ball @en-gb
preferred label: Ball @de
preferred label: ballon @fr
definition: Ejercicio de expresión corporal utilizando como complemento una gran pelota de goma. @es
definition: Eine Übung, die unter Benutzung eines Balles auf Beweglichkeit des Körpers beruht. @de
definition: ボールを使って体の柔軟性を表現する @ja-jp
definition: An exercise based on suppleness of the body using a ball. @en-gb
definition: Exercício de ginástica rítmica em que as ginastas realizam uma coreografia no solo usando uma bola. @pt-pt
definition: Un esercizio basato sull'agilità del corpo mentre si usa una palla
definition: exercice basé sur la souplesse et l'expression corporelle en utilisant un ballon @fr
note: nessuno
in scheme: Subject Code
created: 2000-10-30T12:00:00+00:00
modified: 2010-12-15T17:01:09+00:00
broader: Ginnastica
broad match: http://cv.iptc.org/newscodes/mediatopic/20000951

Trampolino
type: Concept
preferred label: trampoline @fr
preferred label: trampolim @pt-pt
preferred label: トランポリン @ja-jp
preferred label: trampolín @es
preferred label: Trampolin @de
definition: Wettkämpfer zeigen komplizierte Drehungen und Sprünge während sie auf dem Trampolin springen. @de
definition: Evoluzioni acrobatiche stando in equilibrio e rimbalzando sul trampolino
definition: Rutina artística de saltos y vueltas utilizando como trampolín una lona elástica. @es
definition: Os ginastas executam movimentos e acrobacias saltando sobre um trampolim. @pt-pt
definition: Competitors perform complicated twists and turns whilst bouncing on the trampoline. @en-gb
definition: sport où les concurrents effectuent des figures en sautant et rebondissant sur un trampoline @fr
definition: 競技者がトランポリンで弾んでいる間に複雑に体をひねったり回転したりする @ja-jp
note: nessuno
in scheme: Subject Code
created: 2000-10-30T12:00:00+00:00
modified: 2010-12-15T17:01:09+00:00
broader: Ginnastica

Corsa senza ostacoli
type: Concept
preferred label: flat racing @pt-br
preferred label: Galopprennen @de
preferred label: carrera llana @es
preferred label: Course de plat @fr
preferred label: 平地 レース @ja-jp
definition: 平坦なコースで行う馬のレース @ja-jp
definition: Una corsa di cavalli lungo un percorso privo di ostacoli
definition: Course sur piste sans obstacle @fr
definition: Pferderennen in einem flachen Gelände. @de
definition: Corrida de cavalos em pista plana sem obstáculos. @pt-pt
definition: A horse race over a flat course. @en-gb
definition: Carrera de caballos sobre una superficie recta y sin obstáculos. @es
note: nessuno
in scheme: Subject Code
created: 2000-10-30T12:00:00+00:00
modified: 2010-12-15T17:01:09+00:00
broader: Ippica

Corsa ad ostacoli
type: Concept
preferred label: carrera de obstáculos @es
preferred label: steeplechase @pt-pt
preferred label: Course d'obstacles @fr
preferred label: スティープルチェイス @ja-jp
preferred label: steeple chase @en-gb
preferred label: Hindernissrennen @de
definition: Rennen mit Pferd und Reiter über acht Hindernisse, wovon vier unterschiedlich sein müssen, wie Sprung über Wasser, Sprossenzäune, Schlammwände etc. @de
definition: A mounted horse race over at least eight classic obstacles, four of which must be different, such as the water jump, spruce fences, mud walls etc. @en-gb
definition: Una corsa di cavalli montati con almeno otto ostacoli, quattro dei quali devono essere diversi, come il salto dell'acqua, steccati, pareti, ecc...
definition: Prueba de jinete y caballo sobre al menos ocho obstáculos clásicos, cuatro de los cuales pueden ser elegidos y deben ser distintos, tales como el salto de agua, vallas de madera y muros. @es
definition: course qui comporte au moins huit obstacles dont quatre sont différents et choisis parmi les obstacles classiques (mur en terre, rivière, etc.). @fr
definition: 人が騎乗する馬レースで、少なくとも8つ以上の典型的な障害があり、水越え、エゾマツフェンス、泥壁など、4つは違うようにしなければならない @ja-jp
definition: Corrida de cavalo montado com pelo menos 8 obstáculos clássicos, quatro dos quais são diferentes, como salto sobre água, cerca, vala, etc. @pt-pt
note: nessuno
in scheme: Subject Code
created: 2000-10-30T12:00:00+00:00
modified: 2010-12-15T17:01:09+00:00
broader: Ippica

Trotto
type: Concept
preferred label: Course de trot @fr
preferred label: Trabrennen @de
preferred label: トロッティング @ja-jp
preferred label: trote @pt-pt
preferred label: trotting @en-gb
definition: *Corrida de cavalos atrelados a um **buggy** em pista plana sem obstáculos.* @pt-pt
definition: Pferdewagenrennen mit Jokey im Trab auf einer flachen Bahn. @de
definition: Cavalli lanciati in una corsa al trotto con carretto guidato lungo un percorso senza ostacoli
definition: Course pratiquée au trot @fr
definition: Horses pitched to a jockeyed buggy race in a trot round a flat course. @en-gb
definition: Carrera de caballos al trote alrededor de un camino llano. @es
definition: 2輪車を引いた馬が平らなコースを速足で周回するレース @ja-jp
note: nessuno
in scheme: Subject Code
created: 2000-10-30T12:00:00+00:00
modified: 2010-12-15T17:01:09+00:00
broader: Ippica

Campestre
type: Concept
preferred label: Cross-country @fr
preferred label: クロスカントリー @ja-jp
preferred label: cross country @pt-br
preferred label: Querfeldein @de
preferred label: cross country (campo traviesa) @es
definition: 長い距離のレースで、本物のフェンス、水流、倒木などの粗野な障害がある @ja-jp
definition: A long distance race including rustic obstacles such as real fences, streams and fallen trees. @en-gb
definition: Una lunga corsa che comprende ostacoli come steccati naturali, ruscelli e alberi caduti
definition: Corrida de fundo que inclui obstáculos rústicos como cercas, ribeiros ou árvores caídas. @pt-br
definition: Langstreckenrennen mit natürlichen Hindernisen wie Zäune, Wände und gefallene Bäume. @de
definition: Course d'endurance dont le trajet dans la campagne utilise les obstacles naturels @fr
definition: Carrera de larga distancia que incluye obstáculos naturales tales como árboles caídos y corrientes de agua. @es
note: nessuno
in scheme: Subject Code
created: 2000-10-30T12:00:00+00:00
modified: 2010-12-15T17:01:09+00:00
broader: Ippica
broad match: http://cv.iptc.org/newscodes/mediatopic/20000960

NHL, National Hockey League
type: Concept
preferred label: ＮＨＬ @ja-jp
preferred label: National Hockey League @pt-pt
preferred label: NHL @fr
preferred label: liga nacional de hockey (nhl, estados unidos). @es
preferred label: National Hockey League (North American) @en-gb
preferred label: Nationale Hockey Liga (Nordamerika) @de
definition: A principal liga norte-americana de hóquei no gelo, que integra equipes dos Estados Unidos e do Canadá. @pt-br
definition: La principal liga de Norteamérica integrada por equipos de los Estados Unidos y Canadá. @es
definition: 合衆国とカナダのチームで編成する北米大陸トップリーグ @ja-jp
definition: Squadre degli Stati Uniti d'America e del Canada che formano la lega principale del continente nord-americano
definition: Mannschaften der USA und Kanada, die die Topliga des nordamerikanischen Kontinents ausmachen. @de
definition: Teams from the US and Canada make up the North American continents top league. @en-gb
definition: La plus importante ligue professionnelle de hockey sur glace en Amérique du Nord. @fr
definition: A principal liga norte-americana de hóquei no gelo, que integra equipas dos Estados Unidos e do Canadá. @pt-pt
note: nessuno
in scheme: Subject Code
created: 2000-10-30T12:00:00+00:00
modified: 2010-12-15T17:01:09+00:00
broader: Hockey su ghiaccio
broad match: http://cv.iptc.org/newscodes/mediatopic/20000965

Hockey su slitta
type: Concept
preferred label: スレッジホッケー @ja-jp
preferred label: hóquei em trenó @pt-br
preferred label: sledge hockey @en-gb
preferred label: hockey en trineo @es
preferred label: Sledge hockey @fr
preferred label: Eisschlittenhockey @de
definition: Modalidade semelhante ao hóquei no gelo mas praticada com pequenos trenós que os patinadores empurram com os braços. @pt-pt
definition: Hockey sur glace pratiqué sur luge. Les déplacements se faisant à la force des bras @fr
definition: Ähnlich wie Eishockey, aber auf kleinen Schlitten. Die Wettkämpfer bewegen sich mit Hilfe der Arme fort. @de
definition: Como el hockey sobre hielo pero en lugar de usar patines, los competidores emplean pequeños trineos y se deslizan empujándose con sus brazos. @es
definition: アイスホッケーに似ているが、スケートの代わりに小さなソリ(スレッジ)を使用するもの。競技者は両腕で漕ぎながら移動する @ja-jp
definition: Like ice hockey but instead of skates small sledges are used. Competitors move by pushing with the arms @en-gb
definition: Simile all'hockey su ghiaccio ma al posto dei pattini si usano delle piccole slitte. I concorrenti si muovono spingendosi con le braccia
note: nessuno
in scheme: Subject Code
created: 2000-10-30T12:00:00+00:00
modified: 2010-12-15T17:01:09+00:00
broader: Hockey su ghiaccio

Fronton (muro)
type: Concept
preferred label: Fronton @de
preferred label: frontão @pt-pt
preferred label: Place libre @fr
preferred label: frontón @es
preferred label: fronton @en-gb
preferred label: フロントン @ja-jp
definition: Le fronton, ou place libre : en plein air, il est constitué d'un mur de frappe muni d'une barre métallique, au dessus de laquelle la pelote doit être envoyée, et d'un marquage au sol délimitant l'aire de jeux. @fr
definition: The *fronton* known as *Fronton Place Libre* consists of a rectangular outdoor court plus a large pink shaped wall at one end. The two sides and the other end are left opened. @en-gb
definition: Das Pelotaspielfeld, als *Fronton Place Libre* bezeichnet, besteht aus einem rechteckigen Spielfeld im Freien und der Pelotawand an der Stirnseite. Die anderen Seiten sind offen. @de
definition: O frontão é disputado ao ar livre, em campo retangular com uma grande parede numa das extremidades, onde a bola deve ser batida. @pt-br
definition: El frontón se juega en una cancha al aire libre, rectangular, haciendo rebotar una pelota de goma contra una gran pared en uno de sus extremos menores. Las bandas laterales y el extremo detrás de los jugadores se dejan abiertos. @es
definition: Campo all'aperto di forma rettangolare con una grande parete ad un'estremità del campo, l'altra invece, insieme ai due lati, è lasciata aperta
definition: *Fronton Place Libre*として知られているフロントン(訳注：競技場)は、端に大きいピンクの壁を持った長方形の屋外コート。2つの横ともう一方の端は開いている @ja-jp
note: nessuno
in scheme: Subject Code
created: 2000-10-30T12:00:00+00:00
modified: 2010-12-15T17:01:09+00:00
broader: Pelota
broad match: http://cv.iptc.org/newscodes/mediatopic/20000968

Jai alai
type: Concept
preferred label: jai-alai @en-gb
preferred label: cesta punta @pt-pt
preferred label: Jai Alai @de
preferred label: Jai-alai @fr
preferred label: ハイアライ @ja-jp
definition: El Jai-Alai es una modalidad de frontón, de origen español, disputada bajo techo con una cancha de 56 metros de largo, que se usa exclusivamente para jugar *chistera ancha*. En el juego se utilizan tres paredes: la frontal, la posterior y la izquierda. @es
definition: Eine *Jai-Alai* ist das 56 m lange Pelotaspielfeld in der Halle ausschließlich für das Spiel *Chistera ancha*. Drei Wände werden ins Spiel einbezogen, Stirnseite, Rückwand und die linksseitige Wand. @de
definition: *Jaï-Alai*は、もっぱら*chistera-ancha*を行うために使われる56メートルのロングコートを持つ屋内フロントン。ゲームでは、前、後ろ、左の3つの壁を使います @ja-jp
definition: A *Jaï-Alai* is an indoor fronton with a 56 meters long court which is used exclusively to play *chistera-ancha*. Three walls are used in the game: the front, the back and the left hand wall. @en-gb
definition: Le Jaï-Alaï est un fronton couvert d'origine espagnole, composé d'un mur de face, d'un mur latéral gauche et d'un mur de fond. Le jaï-alaï est le lieu de pratique de la cesta punta. @fr
definition: Modalidade de frontão jogada em recintos interiores, em campo de 56 m de comprimento e que utiliza três paredes para bater a bola: a frontal, a posterior e a esquerda. @pt-pt
definition: E'un fronton al coperto con un campo lungo 56 metri usato esclusivamente per giocare a *chistera ancha*. Nel gioco si usano tre pareti: frontale, dorsale e a sinistra
note: nessuno
in scheme: Subject Code
created: 2000-10-30T12:00:00+00:00
modified: 2010-12-15T17:01:09+00:00
broader: Pelota
broad match: http://cv.iptc.org/newscodes/mediatopic/20000968

Fronton a sinistra
type: Concept
preferred label: parede esquerda @pt-pt
preferred label: pared izquierda @es
preferred label: Mur gauche @fr
preferred label: left wall @en-gb
preferred label: Linke Wand @de
preferred label: レフトウォール @ja-jp
definition: A *fronton with left hand wall* is an indoor fronton with a 36 meters long court where Pala or Main Nue are played. Three walls are used in the game: the front, the back and the left hand wall. @en-gb
definition: In einer 36 m langen Halle wird mit der Pala oder mit bloßer Hand gespielt. Drei Wandseiten des Spielfeldes werden benutzt: Stirnseite, Rückwand und die linksseitige Wand. @de
definition: fronton avec un autre mur à gauche de celui-ci. @fr
definition: Modalidade de frontão jogada em recintos interiores, em campo de 36 m de comprimento e que utiliza três paredes para bater a bola: a frontal, a posterior e a esquerda. @pt-br
definition: Un fronton con parete a sinistra è un fronton al coperto con un campo lungo 36 metri dove si gioca la Pala (racchetta) o Main Nue. Nel gioco si usano tre pareti : frontale, dorsale e sinistra
definition: *fronton with left hand wall*は、PalaやMain Nueを行う36メートルのロングコートを持つ屋内フロントン。ゲームでは、前、後ろ、左の3つの壁を使う @ja-jp
definition: Un frontón con pared izquierda, disputado en cancha techada de 36 metros de largo, donde se juega Pala o Main Nue. En el juego se utilizan tres paredes: la frontal, la posterior y la izquierda. @es
note: nessuno
in scheme: Subject Code
created: 2000-10-30T12:00:00+00:00
modified: 2010-12-15T17:01:09+00:00
broader: Pelota
broad match: http://cv.iptc.org/newscodes/mediatopic/20000968

Trinquet
type: Concept
preferred label: trinquete @pt-pt
preferred label: トゥリンケテ @ja-jp
preferred label: trinquet @fr
definition: Modalidade de frontão jogada em recintos interiores, em campo de 28.5 m de comprimento rodeado de 4 paredes onde se pode bater a bola. @pt-br
definition: Es una modalidad de frontón que se juega en una cancha techada de 28.5 metros de largo rodeada de cuatro paredes, todas las cuales se utilizan en el juego. @es
definition: E'un fronton al coperto con un campo lungo 28,5 metri circondato da quattro pareti, tutte usate nel gioco.
definition: A *Trinquet* is an indoor fronton with a 28.5 meters long court surrounded by four walls. The four walls are used in the game. @en-gb
definition: Ein *Trinquet* ist ein 28,5 m langes Spielfeld in der Halle mit vier Seitenwänden. Alle Seitenwände werden im Spiel benutzt. @de
definition: *Trinquet*は、4つの壁に囲まれている28.5メートルロングコートを持っている屋内フロントン。ゲームでは、4つの壁を使う @ja-jp
definition: salle totalement fermée, composée de 4 murs dont un de frappe muni d'un trou (xilo) et d'un pan coupé (angle à 45° entre le mur de frappe et le mur de droite). Le trinquet est muni d'une galerie latérale à gauche avec un toit en pente et un filet. @fr
note: nessuno
in scheme: Subject Code
created: 2000-10-30T12:00:00+00:00
modified: 2010-12-15T17:01:09+00:00
broader: Pelota
broad match: http://cv.iptc.org/newscodes/mediatopic/20000968

Rebot
type: Concept
preferred label: rebote @pt-br
preferred label: rebot @fr
preferred label: レボット @ja-jp
definition: Se joue en place libre comme le tennis, sans filet. @fr
definition: Si gioca in un fronton *place libre* con 5 giocatori per squadra i quali usano una *chistera* (lunga 56 cm e larga 12 cm) o le mani nude
definition: *Modalidade de frontão jogada com 5 jogadores em cada equipe. A bola é batida com as próprias mãos ou com uma **chistera** (espécie de pá com 56 cm de comprimento e 12 cm de largura).* @pt-br
definition: *rebot*は、各チーム5人のプレーヤーが、*Place libre*フロントンで行うゲーム。プレーヤーは、セスタ(長さ56センチ、幅12センチの大きさ)か素手を使う @ja-jp
definition: *Modalidade de frontão jogada com 5 jogadores em cada equipa. A bola é batida com as próprias mãos ou com uma **chistera** (56 cm de comprimento e 12 cm de largura).* @pt-pt
definition: Juego similar al tenis pero sin red, que se practica en un frontón al aire libre con equipos de 5 jugadores, que utilizan una chistera (56 cm de largo y 12 cm de ancho) o las manos descubiertas para lanzar la pelota. @es
definition: The *rebot* is the game played in a fronton *place libre* with 5 players in each team. They use a *chistera* (56 cm long and 12 cm large) or bare hands. @en-gb
definition: *Rebot* wird auf einem Spielfeld, dem *place libre* mit fünf Spielern pro Team durchgeführt. Benutzt wird die *Chistera* (Korbschafel 56 cm lang und 12 cm breit) oder es wird mit der bloßen Hand gespielt. @de
note: nessuno
in scheme: Subject Code
created: 2000-10-30T12:00:00+00:00
modified: 2010-12-15T17:01:09+00:00
broader: Pelota
broad match: http://cv.iptc.org/newscodes/mediatopic/20000968

Chistera ancha
type: Concept
preferred label: chistera ancha @pt-pt
preferred label: システラカンチャ @ja-jp
definition: The *chistera-ancha* also called the *cesta punta* is the game played in a *jaï alai* with 1 or 2 players in each team. The players use a long curved basket called the *chistera* (68 cm long and 13 cm wide). @en-gb
definition: Die *Chistera ancha*, auch *Cesta punta* genannt, ist eine Spielvariante mit ein bis zwei Spielern pro Team in der *Jai-Alai*. Die Spieler benutzen einen langen gebogenen Korbschläger, *Chistera* (68 cm lang und 13 cm breit) bezeichnet. @de
definition: Chiamata anche *cesta punta*, si gioca in un *jai alai* con 1 o 2 giocatori per squadra, i quali, usano una lunga cesta chiamata *chistera* (lunga 68 cm e larga 13 cm)
definition: También llamada *cesta punta*, es el juego que se realiza en un *jai alai* con 1 o 2 jugadores en cada equipo. Los mismos utilizan un canasto largo y curvo llamado chistera (68cm de largo por 13 de ancho). @es
definition: *A **chistera ancha**, também chamada **cesta punta**, é uma modalidade disputada com uma **chistera** grande (68 cm de comprimento e 13 cm de largura) por 1 ou 2 jogadores em cada equipe.* @pt-br
definition: *A **chistera ancha**, também chamada **cesta punta**, é uma modalidade disputada com uma **chistera** grande (68 cm de comprimento e 13 cm de largura) por 1 ou 2 jogadores em cada equipa.* @pt-pt
definition: chistera-anchaは*cesta punta*とも呼ばれ、各チーム1～2名で行われるハイアライ。プレーヤーは*chistera*(長さ68cm、幅13cm)と呼ばれる長く湾曲した籠を使用する @ja-jp
definition: Ou cesta-punta se joue en jaï-alaï à l'aide de grands chisteras et avec 1 ou 2 joueurs dans chaque équipe. @fr
note: nessuno
in scheme: Subject Code
created: 2000-10-30T12:00:00+00:00
modified: 2010-12-15T17:01:09+00:00
broader: Pelota
broad match: http://cv.iptc.org/newscodes/mediatopic/20000968

chistera corta
type: Concept
preferred label: Chistera corta
preferred label: システラコータ @ja-jp
definition: *A **chistera corta** é uma modalidade de frontão de parede esquerda disputada com uma **chistera** (56 cm de comprimento e 12 cm de largura) por 3 jogadores em cada equipe.* @pt-br
definition: The *chistera-corta* is the game played in a fronton *place libre* with left hand wall and 3 players in each team. The players use a long curved basket called the *chistera* (56 cm long and 12 cm wide). @en-gb
definition: *A **chistera corta** é uma modalidade de frontão de parede esquerda disputada com uma **chistera** (56 cm de comprimento e 12 cm de largura) por 3 jogadores em cada equipa.* @pt-pt
definition: Se joue en place libre avec un mur gauche et 3 joueurs dans chaque équipe. Le joueurs utilisent un long gant d'osier la chistera @fr
definition: Si gioca in un fronton *place libre* con la parete sinistra e 3 giocatori per squadra, i quali, usano una lunga cesta chiamata *chistera* (lunga 56 cm e larga 12 cm)
definition: Juego que se practica en un frontón al descubierto, con pared de mano izquierda y tres jugadores en cada equipo. Los mismos utilizan un canasto largo y curvo llamado chistera (56 x 12cm) @es
definition: Bei der *Chistera corta* wird mit drei Spielern pro Team auf einem Spielfeld dem *place libre* mit einer linksseitigen Wand gespielt. Die Spieler verwenden einen langen gebogenen Schläger,*Chistera* (56 cm lang und 12 cm breit) bezeichnet. @de
definition: *chistera-corta*は、各チーム3人のプレーヤーが*Place libre*フロントンの左手の壁で行うゲーム。 プレーヤーはセスタと呼ばれる長いカーブしたバスケット(長さ56センチと幅12センチ)を使う @ja-jp
note: nessuno
in scheme: Subject Code
created: 2000-10-30T12:00:00+00:00
modified: 2010-12-15T17:01:09+00:00
broader: Pelota
broad match: http://cv.iptc.org/newscodes/mediatopic/20000968

Mani nude
type: Concept
preferred label: mano desnuda o descubierta @es
preferred label: bare hand @en-gb
preferred label: mão nua @pt-br
preferred label: ベアハンド @ja-jp
preferred label: Freihand @de
preferred label: main nue @fr
definition: The *Main Nue*(bare hand)は、すべてのバスクのスポーツの起源 @ja-jp
definition: *O **main nue** (mão nua), jogo em que a bola é batida com a própria mão contra a parede, é o antecessor de todos os desportos bascos de pelota. Pode ser jogado em trinquete ou em parede esquerda. * @pt-pt
definition: *O **main nue** (mão nua), jogo em que a bola é batida com a própria mão contra a parede, é o antecessor de todos esportes bascos de pelota. Pode ser jogado em trinquete ou em parede esquerda. * @pt-br
definition: El denominado *Main Nue* (mano desnuda) es el antecesor de todos los deportes vascos de pelota, se golpea la pelota con la mano y se puede jugar en trinquete o muro izquierdo. @es
definition: E'l'antenato di tutti gli sport baschi con la palla
definition: The *Main Nue* (bare hand) is the ancestor of all Basque sports. @en-gb
definition: Die *Main Nue*-Variante (bloße Hand) ist der Vorläufer des baskischen Nationalsports. @de
definition: on frappe la balle à la main. La main nue se pratique en mur à gauche et trinquet. @fr
note: nessuno
in scheme: Subject Code
created: 2000-10-30T12:00:00+00:00
modified: 2010-12-15T17:01:09+00:00
broader: Pelota
broad match: http://cv.iptc.org/newscodes/mediatopic/20000968

Pala ancha
type: Concept
preferred label: パラカンチャ @ja-jp
preferred label: pala-ancha @pt-pt
preferred label: Pala-ancha @de
preferred label: pala ancha @es
definition: Die *Pala ancha*-Variante wird auf einem Spielfeld dem *place libre* mit zwei Spielern pro Team gespielt. Die Spieler benutzen ein schweres hölzernes Brett als Schläger die, *Pala* (50 cm lang und 20 cm breit). @de
definition: *A **pala-ancha** é uma modalidade de frontão disputada com uma **pala** (pesado bastão de madeira de 50 cm de comprimento e 20 cm de largura) por 2 jogadores em cada equipa.* @pt-pt
definition: The *pala-ancha* is the game played in a fronton *place libre* with 2 players in each team. The players use a heavy wooden bat *the pala* (50 cm long and 20 cm wide). @en-gb
definition: Se joue en place libre avec 2 joueurs dans chaque équipe. Les joueurs utilise une sorte de raquette en bois large et lourde appelée *pala* @fr
definition: Juego que se practica en un frontón al descubierto con dos jugadores por equipo, que utilizan una pesada paleta de madera (la pala), de 50 cm de largo y 20 cm de ancho. @es
definition: Si gioca in un fronton *place libre* con 2 giocatori per squadra, i quali, usano una pesante mazza di legno *la pala* (lunga 50 cm e larga 20 cm)
definition: *pala-ancha*は各チーム2人のプレーヤーが、*place libre*フロントンで行うゲーム。プレーヤーは重い木製のバットの*the pala*(長さ50センチと幅20センチ)を使う @ja-jp
definition: *A **pala-ancha** é uma modalidade de frontão disputada com uma **pala** (pesado bastão de madeira de 50 cm de comprimento e 20 cm de largura) por 2 jogadores em cada equipe.* @pt-br
note: nessuno
in scheme: Subject Code
created: 2000-10-30T12:00:00+00:00
modified: 2010-12-15T17:01:09+00:00
broader: Pelota
broad match: http://cv.iptc.org/newscodes/mediatopic/20000968

Pala corta
type: Concept
preferred label: Pala-corta @de
preferred label: pala-corta @pt-pt
preferred label: パラコータ @ja-jp
preferred label: pala corta @es
definition: Si gioca in un fronton con parete a sinistra e 2 giocatori per squadra, i quali, usano una mazza di legno chiamata *pala corta* (50 cm lunga e 10 cm larga). La *pala* è il nome di una pesante mazza di legno usata in diversi giochi
definition: *A **pala-corta** é uma modalidade de frontão de parede esquerda disputada com uma **pala** (pesado bastão de madeira de 50 cm de comprimento e 20 cm de largura) por 2 jogadores em cada equipe.* @pt-br
definition: The *pala-corta* is the game played in a fronton with left hand wall and 2 players in each team. The players use a heavy wooden bat the *pala-corta* (50 cm long and 10 cm wide). The *pala* is the name for a heavy wooden bat. @en-gb
definition: Die *Pala corta*-Variante mit zwei Spielern pro Team wird auf einem Spielfeld mit einer linksseitigen Wand gespielt. Die Spieler benutzen ein schweres hölzernes Brett als Schläger die *Pala corta* (50 cm lang und 10 cm breit). @de
definition: Juego que se practica en un frontón con pared izquierda y dos jugadores en cada equipo, quienes utilizan una pesada paleta de madera (pala corta), de 50 cm de largo y 20 cm de ancho. @es
definition: Se joue sur un fronton mur à gauche. *Pala* raquette en bois courte et légère. Équipes de 2 joueurs @fr
definition: pala-cortaは各チーム2人のプレーヤーが、フロントンの左手の壁で行うゲーム。プレーヤーは重い木製のバット、*pala-corta*、(長さ50センチと幅10センチ)を使う。*pala*は重い木製バットの名前を表す @ja-jp
definition: *A **pala-corta** é uma modalidade de frontão de parede esquerda disputada com uma **pala** (pesado bastão de madeira de 50 cm de comprimento e 20 cm de largura) por 2 jogadores em cada equipa.* @pt-pt
note: Explanation shortened @en-gb
note: nessuno
in scheme: Subject Code
created: 2000-10-30T12:00:00+00:00
modified: 2010-12-15T17:01:09+00:00
broader: Pelota
broad match: http://cv.iptc.org/newscodes/mediatopic/20000968

Pasaka
type: Concept
preferred label: pasaka @en-gb
preferred label: パサカ @ja-jp
definition: The *pasaka* is the name of the game played in a trinquet by teams of 2 players facing each other on each side of a net where the pelota is hit between opponents. @en-gb
definition: *Pasaka* es el nombre que recibe el juego que se practica en un trinquete, en equipos de dos jugadores, que se enfrentan a cada lado de la red y los contrincantes le pegan a la pelota para anotar. @es
definition: *pasaka*は各チーム2人のプレーヤーが、trinquetの中でネットを挟み対峙している対抗者にポロタを打ちあうゲーム @ja-jp
definition: Si gioca in trinquet con due giocatori per squadra, i quali, si affrontano stando ciascuno da un lato della rete colpendo la pelota verso la parte avversaria
definition: *Pasaka* ist der Name einer Spielvariante auf dem Spielfeld *Trinquet*, bei dem sich zwei Spieler pro Mannschaft gegenüberstehen und die Pelota über ein Netz schlagen. @de
definition: Jeu ancestral dérivé de la paume. Il se pratique en trinquet avec un filet médian à 1,20 mètre de hauteur. La pelote est envoyée par un coup *glissé* instantané. @fr
definition: Jogo de trinquete com rede disputado por equipas de 2 jogadores que se defrontam de cada lado da rede. @pt-pt
definition: Jogo de trinquete com rede disputado por equipes de 2 jogadores que se defrontam de cada lado da rede. @pt-br
note: nessuno
in scheme: Subject Code
created: 2000-10-30T12:00:00+00:00
modified: 2010-12-15T17:01:09+00:00
broader: Pelota
broad match: http://cv.iptc.org/newscodes/mediatopic/20000968

Xare
type: Concept
preferred label: ザール @ja-jp
preferred label: xare @pt-br
definition: Si gioca in trinquet con due giocatori per squadra, i quali, usano uno *xare* (o mazza argentina) lungo 55 cm e largo 16 cm
definition: The *xare*, is the name of the game played in a trinquet by teams of 2 players. The players use a *xare* (or the Argentina bat) 55 cm long and 16 cm wide. @en-gb
definition: *Xare* es el nombre del juego que se practica en un trinquete, por equipos de dos jugadores. Los mismos usan un *xare* (o paleta argentina), de 55 cm de largo y 16 cm de ancho. @es
definition: *Jogo de trinquete disputado com um **xare** (bastão de 55 cm de comprimento e 16 cm de largura) por equipes de 2 jogadores.* @pt-br
definition: Le xare du nom du filet cordé de l'instrument - appelé aussi raquette argentine. On y joue essentiellement en trinquet @fr
definition: *xare*はtrinquetの中でプレーする2人プレーヤーのチームで行なうゲームで、プレーヤーは長さ55センチ、幅16センチの*xare*(あるいはアルゼンチンバット)を使用する @ja-jp
definition: *Xare* ist der Name einer Spielvariante auf dem Spielfeld *Trinquet* mit zwei Spielern pro Team. Die Spieler benutzen eine *Xare* (oder argentinischer Schläger), von 55 cm Länge und 16 cm Breite. @de
definition: *Jogo de trinquete disputado com um **xare** (bastão de 55 cm de comprimento e 16 cm de largura) por equipas de 2 jogadores.* @pt-pt
note: nessuno
in scheme: Subject Code
created: 2000-10-30T12:00:00+00:00
modified: 2010-12-15T17:01:09+00:00
broader: Pelota
broad match: http://cv.iptc.org/newscodes/mediatopic/20000968

Massimi
type: Concept
preferred label: peso pesado @pt-pt
preferred label: Lourds @fr
preferred label: 重量級 @ja-jp
preferred label: Schwergewicht @de
preferred label: heavyweight @en-gb
definition: Categoria aberta, geralmente acima de 100kg para homens e acima de 78kg para mulheres. @pt-br
definition: Uomini oltre 100 kg, donne oltre 78 kg
definition: catégorie de poids variant dans le temps et entre hommes et femmes. Généralement plus de 100 kg pour les hommes et plus de 78 kg pour les femmes @fr
definition: Weight categoriy in Judo: open but usually over 100kg for men and over 78kg for women @en-gb
definition: Categoría abierta de judo que generalmente maneja pesos de 100 kg para hombres y 78 kg. para mujeres. @es
definition: 無差別だが、通常男子は100kg超、女子は78kg超 @ja-jp
definition: Gewichtsklasse in Judo: gewöhnlich über 100 kg bei Männern und über 78 kg bei Frauen. @de
note: nessuno
in scheme: Subject Code
created: 2000-10-30T12:00:00+00:00
modified: 2010-12-15T17:01:09+00:00
broader: Judo
broad match: http://cv.iptc.org/newscodes/mediatopic/20000974

Mediomassimi
type: Concept
preferred label: 軽重量級 @ja-jp
preferred label: peso mediopesado @es
preferred label: half-heavyweight @en-gb
preferred label: peso meio pesado @pt-br
preferred label: Mi-lourds @fr
preferred label: Halb-Schwergewicht @de
definition: Gewichtsklasse in Judo: bis zu 100 kg bei Männern und 78 kg bei Frauen. @de
definition: catégorie de poids variant dans le temps et entre hommes et femmes. Jusqu'à 100 kg pour les hommes et 78 kg pour les femmes @fr
definition: Uomini fino a 100 kg, donne fino a 78 kg
definition: Weight categoriy in Judo: up to 100kg for men and 78kg for women. @en-gb
definition: 男子最高100kg、女子最高78kg @ja-jp
definition: Categoria até 100kg para homens e até 78kg para mulheres. @pt-pt
definition: Hasta 100 kg. para hombres y 78 kg. para mujeres. @es
note: nessuno
in scheme: Subject Code
created: 2000-10-30T12:00:00+00:00
modified: 2010-12-15T17:01:09+00:00
broader: Judo
broad match: http://cv.iptc.org/newscodes/mediatopic/20000971

Medi
type: Concept
preferred label: 中量級 @ja-jp
preferred label: Moyens @fr
preferred label: peso mediano @es
preferred label: Mittelgewicht @de
preferred label: peso médio @pt-pt
preferred label: middleweight @en-gb
definition: Categoria até 90kg para homens e até 70kg para mulheres. @pt-br
definition: Gewichtsklasse in Judo: bis zu 90 kg bei Männern und 70 kg bei Frauen. @de
definition: Uomini fino a a 90 kg, donne fino a 70 kg
definition: 男子最高90kg、女子最高70kg @ja-jp
definition: catégorie de poids variant dans le temps et entre hommes et femmes. Jusqu'à 90 kg pour les hommes et 70 kg pour les femmes @fr
definition: Weight categoriy in Judo: up to 90kg for men and 70kg for women. @en-gb
definition: Hasta 90 kg. para hombres y 70 kg. para mujeres. @es
note: nessuno
in scheme: Subject Code
created: 2000-10-30T12:00:00+00:00
modified: 2010-12-15T17:01:09+00:00
broader: Judo
broad match: http://cv.iptc.org/newscodes/mediatopic/20000976

Medi mediani
type: Concept
preferred label: 軽中量級 @ja-jp
preferred label: peso meio médio @pt-br
preferred label: half-middleweight @en-gb
preferred label: peso medio mediano @es
preferred label: Mi-moyens @fr
preferred label: Halb-Mittelgewicht @de
definition: Weight categoriy in Judo: up to 81kg for men and 63kg for women. @en-gb
definition: catégorie de poids variant dans le temps et entre hommes et femmes. Jusqu'à 81 kg pour les hommes et 63 kg pour les femmes @fr
definition: Hasta 81 kg. para hombres y 63 kg. para mujeres. @es
definition: Gewichtsklasse in Judo: bis zu 81 kg bei Männern und 63 kg bei Frauen. @de
definition: Categoria até 81kg para homens e até 63kg para mulheres. @pt-br
definition: 男子最高81kg、女子最高63kg @ja-jp
definition: Uomini fino a 81 kg, donne fino a 63 kg
note: nessuno
in scheme: Subject Code
created: 2000-10-30T12:00:00+00:00
modified: 2010-12-15T17:01:09+00:00
broader: Judo
broad match: http://cv.iptc.org/newscodes/mediatopic/20000973

Medioleggeri
type: Concept
preferred label: Mi-légers @fr
preferred label: half-lightweight @en-gb
preferred label: Halb-Leichtgewicht @de
preferred label: peso meio ligeiro @pt-pt
preferred label: peso meio leve @pt-br
preferred label: peso medio liviano @es
preferred label: 軽軽量級 @ja-jp
definition: Uomini fino a 73 kg, donne fino a 57 kg
definition: 男子最高73kg、女子最高57kg @ja-jp
definition: Weight categoriy in Judo: up to 73kg for men and 57kg for women. @en-gb
definition: Categoria até 73kg para homens e até 57kg para mulheres. @pt-br
definition: Hasta 73 kg. para hombres y 57 kg. para mujeres. @es
definition: catégorie de poids variant dans le temps et entre hommes et femmes. Jusqu'à 73 kg pour les hommes et 57 kg pour les femmes @fr
definition: Gewichtsklasse in Judo: bis zu 73 kg bei Männern und 57 kg bei Frauen. @de
note: nessuno
in scheme: Subject Code
created: 2000-10-30T12:00:00+00:00
modified: 2010-12-15T17:01:09+00:00
broader: Judo
broad match: http://cv.iptc.org/newscodes/mediatopic/20000972

Peso leggero
type: Concept
preferred label: lightweight @en-gb
preferred label: Leichtgewicht @de
preferred label: Légers @fr
preferred label: 軽量級 @ja-jp
preferred label: peso ligeiro @pt-pt
preferred label: peso leve @pt-br
preferred label: peso liviano @es
definition: Hasta 66 kg. para hombres y 52 kg. para mujeres. @es
definition: catégorie de poids variant dans le temps et entre hommes et femmes. Jusqu'à 66 kg pour les hommes et 52 kg pour les femmes @fr
definition: Weight categoriy in Judo: up to 66kg for men and 52kg for women. @en-gb
definition: Uomini fino a 66 kg, donne fino a 52 kg
definition: Categoria até 66kg para homens e até 52kg para mulheres. @pt-pt
definition: 男子最高66kg、女子最高52kg @ja-jp
definition: Gewichtsklasse in Judo: bis zu 66 kg bei Männern und 52 kg bei Frauen. @de
note: nessuno
in scheme: Subject Code
created: 2000-10-30T12:00:00+00:00
modified: 2010-12-15T17:01:09+00:00
broader: Judo
broad match: http://cv.iptc.org/newscodes/mediatopic/20000975

Extraleggeri
type: Concept
preferred label: 超軽量級 @ja-jp
preferred label: Super-légers @fr
preferred label: peso superligeiro @pt-br
preferred label: extra lightweight @en-gb
preferred label: Extra Leichtgewicht @de
preferred label: peso extra ligero @es
definition: Weight categoriy in Judo: up to 60kg for men and 48kg for women. @en-gb
definition: Categoria até 60kg para homens e até 48kg para mulheres. @pt-br
definition: Hasta 60 kg. para hombres y 48 kg. para mujeres. @es
definition: catégorie de poids variant dans le temps et entre hommes et femmes. Jusqu'à 60 kg pour les hommes et 48 kg pour les femmes @fr
definition: 男子最高60kg、女子最高48kg @ja-jp
definition: Gewichtsklasse in Judo: bis zu 60 kg bei Männern und 48 kg bei Frauen. @de
definition: Uomini fino a 60 kg, donne fino a 48 kg
note: nessuno
in scheme: Subject Code
created: 2000-10-30T12:00:00+00:00
modified: 2010-12-15T17:01:09+00:00
broader: Judo
broad match: http://cv.iptc.org/newscodes/mediatopic/20000970

Sparring Boxe
type: Concept
preferred label: sparring @pt-pt
preferred label: rival de entrenamiento @es
preferred label: Entraînement @fr
preferred label: Sparring @de
preferred label: スパーリング @ja-jp
definition: Entrenamiento de boxeo con cascos @es
definition: クッション入りヘルメットを着用し、試合と関係なく行うボクシング @ja-jp
definition: Boxe sans compétition avec des casques de protection @fr
definition: Pugilato senza attività competitiva, praticato con appositi caschi imbottiti
definition: Treino de boxe com capacetes de proteção. @pt-pt
definition: Boxing without competition, with padded helmets @en-gb
definition: Treinamento de boxe com capacetes de proteção. @pt-br
definition: Boxen ohne Wettkampf mit gepolsterten Helmen. @de
note: nessuno
in scheme: Subject Code
created: 2000-10-30T12:00:00+00:00
modified: 2010-12-15T17:01:09+00:00
broader: Karate
broad match: http://cv.iptc.org/newscodes/mediatopic/20000983

Esercizio Formale - ANNULLATO
type: Concept
preferred label: Combat @fr
preferred label: formal exercise-DEPRECATED @en-gb
preferred label: exercício formal-INATIVO @pt-br
preferred label: 公式試合-使用不可 @ja-jp
preferred label: ejercicio formal @es
preferred label: Formal Exercise-GELÖSCHT @de
definition: NA @pt-pt
definition: NESSUNA INDICAZIONE
definition: --- @de
note: ANNULLATO in V 16
note: DEPRECATED in V 16 @en-gb
in scheme: Subject Code
created: 2000-10-30T12:00:00+00:00
retired: 2005-08-26T00:00:00+00:00
modified: 2010-12-15T17:01:09+00:00
broader: Karate
broad match: http://cv.iptc.org/newscodes/mediatopic/20000983

Individuale
type: Concept
preferred label: individual @es
preferred label: singles @en-gb
preferred label: １人乗り @ja-jp
preferred label: singulares @pt-br
preferred label: Einsitzer @de
preferred label: monoplace @fr
definition: compétition dans une luge à une place @fr
definition: Gara di velocità con slittino monoposto
definition: Prueba de trineo (luge) individual. @es
definition: Prova individual em trenó de 1 lugar. @pt-pt
definition: individual time trial event in a one seater luge @en-gb
definition: 1人乗りリュージュでの個人タイムトライアル競技 @ja-jp
definition: Zeitrennen für einen Einer-Schlitten. @de
note: nessuno
in scheme: Subject Code
created: 2000-10-30T12:00:00+00:00
modified: 2010-12-15T17:01:09+00:00
broader: Slittino
broad match: http://cv.iptc.org/newscodes/mediatopic/20000987

Doppio
type: Concept
preferred label: duplas @pt-br
preferred label: dobles @es
preferred label: ２人乗り @ja-jp
preferred label: Doppelsitzer @de
preferred label: pares @pt-pt
preferred label: doubles @en-gb
preferred label: biplace @fr
definition: Zeitrennen für einen Zweierschlitten. @de
definition: time trial for a twin berth luge @en-gb
definition: compétition dans une luge à deux places @fr
definition: Prova de duplas em trenó de 2 lugares. @pt-br
definition: Prova de pares em trenó de 2 lugares. @pt-pt
definition: Prueba de trineo (luge) que se disputa en duplas. @es
definition: 2人乗りリュージュのタイムトライアル @ja-jp
definition: Gara di velocità con slittino biposto
note: nessuno
in scheme: Subject Code
created: 2000-10-30T12:00:00+00:00
modified: 2010-12-15T17:01:09+00:00
broader: Slittino
broad match: http://cv.iptc.org/newscodes/mediatopic/20000987

Corsa
type: Concept
preferred label: ランニング @ja-jp
preferred label: Laufen @de
preferred label: carrera a pié @es
preferred label: Course à pied @fr
preferred label: running @en-gb
preferred label: corrida @pt-br
definition: Disziplin im modernen Fünfkampf. @de
definition: Evento de pentatlo. @pt-pt
definition: Gara di pentathlon
definition: épreuve du pentathlon @fr
definition: Pentathlon event @en-gb
definition: Prueba de pentatlón @es
definition: (近代)五種競技 @ja-jp
note: nessuno
in scheme: Subject Code
created: 2000-10-30T12:00:00+00:00
modified: 2010-12-15T17:01:09+00:00
broader: Pentathlon moderno
broad match: http://cv.iptc.org/newscodes/mediatopic/20000989

Tiro a segno
type: Concept
preferred label: tir @fr
preferred label: tiro @es
preferred label: Schießen @de
preferred label: shooting @en-gb
preferred label: 射撃 @ja-jp
definition: Pentathlon event @en-gb
definition: (近代)五種競技 @ja-jp
definition: Gara di pentathlon
definition: Prueba de pentatlón @es
definition: Evento de pentatlo. @pt-pt
definition: épreuve du pentathlon @fr
definition: Disziplin im modernen Fünfkampf. @de
note: nessuno
in scheme: Subject Code
created: 2000-10-30T12:00:00+00:00
modified: 2010-12-15T17:01:09+00:00
broader: Pentathlon moderno
broad match: http://cv.iptc.org/newscodes/mediatopic/20000989

Nuoto
type: Concept
preferred label: natação @pt-pt
preferred label: Schwimmen @de
preferred label: Natation @fr
preferred label: 水泳 @ja-jp
preferred label: natación @es
preferred label: swimming @en-gb
definition: Evento de pentatlo. @pt-br
definition: Disziplin im modernen Fünfkampf. @de
definition: Pentathlon event @en-gb
definition: Gara di pentathlon
definition: Prueba de pentatlón @es
definition: épreuve du pentathlon @fr
definition: (近代)五種競技 @ja-jp
note: nessuno
in scheme: Subject Code
created: 2000-10-30T12:00:00+00:00
modified: 2010-12-15T17:01:09+00:00
broader: Pentathlon moderno
broad match: http://cv.iptc.org/newscodes/mediatopic/20000989

Scherma
type: Concept
preferred label: esgrima @pt-pt
preferred label: Fechten @de
preferred label: フェンシング @ja-jp
preferred label: fencing @en-gb
preferred label: escrime @fr
definition: Prueba de pentatlón @es
definition: Disziplin im modernen Fünfkampf @de
definition: Gara di pentathlon
definition: Evento de pentatlo. @pt-pt
definition: Pentathlon event @en-gb
definition: épreuve du pentathlon @fr
definition: (近代)五種競技 @ja-jp
note: nessuno
in scheme: Subject Code
created: 2000-10-30T12:00:00+00:00
modified: 2010-12-15T17:01:09+00:00
broader: Pentathlon moderno
broad match: http://cv.iptc.org/newscodes/mediatopic/20000989

Salto ad ostacoli
type: Concept
preferred label: concurso de saltos @pt-pt
preferred label: Equitation @fr
preferred label: 馬術 @ja-jp
preferred label: showjumping @en-gb
preferred label: saltos hípicos @es
preferred label: Springreiten @de
definition: Disziplin im modernen Fünfkampf. @de
definition: Pentathlon event @en-gb
definition: Prueba de pentatlón @es
definition: épreuve du pentathlon @fr
definition: Evento de pentatlo. @pt-pt
definition: Gara di pentathlon
definition: (近代)五種競技 @ja-jp
note: nessuno
in scheme: Subject Code
created: 2000-10-30T12:00:00+00:00
modified: 2010-12-15T17:01:09+00:00
broader: Pentathlon moderno
broad match: http://cv.iptc.org/newscodes/mediatopic/20000989

F1
type: Concept
preferred label: Ｆ１ @ja-jp
preferred label: Formula One @en-gb
preferred label: Fórmula 1 @pt-pt
preferred label: Formel 1 @de
preferred label: fórmula uno (f1) @es
definition: Corrida de velocidade de monolugares em que 20 ou mais pilotos competem lado a lado em vários circuitos mundiais para ganhar pontos em cada Grande Prémio, do campeonato individual e de construtores. @pt-pt
definition: course de voitures monoplace uniquement conçues pour les courses de vitesse sur circuit @fr
definition: 20人程度の競争者が個人別、製造者別で争う選手権で、グランプリ・ポイントを勝ち取るために世界中のさまざまなサーキットで先着競争する一人用運転席の自動車レース @ja-jp
definition: Single cockpit car racing where 20 or so competitors race head to head over varied circuits around the world to win Grand Prix points in an individual and constructors championship @en-gb
definition: Corsa automobilistica su monoposto su vari circuiti in tutto il mondo per i vincere punti nel campionato piloti e in quello costruttori
definition: Corrida de velocidade de monopostos em que 20 ou mais pilotos competem lado a lado em vários circuitos mundiais para ganhar pontos em cada Grande Prêmio, do campeonato individual e de construtores. @pt-br
definition: Carrera de velocidad entre autos monoplazas, donde 20 o más pilotos compiten cabeza a cabeza en variados circuitos alrededor del mundo, para ganar puntos en cada Gran Premio, que conforman el campeonato individual y de constructores. @es
definition: Einzelfahrer Autorennen bei dem 20 oder mehr Wettkämpfer ein Kopf-an-Kopf-Rennen über verschiedene Runden weltweit, um Grand Prix Punkte zu gewinnen in einem Einzel- und Konstrukteur-Wettbewerb. @de
note: nessuno
in scheme: Subject Code
created: 2000-10-30T12:00:00+00:00
modified: 2010-12-15T17:01:09+00:00
broader: Automobilismo

F3000
type: Concept
preferred label: fórmula 3000 @es
preferred label: Fórmula 3000 @pt-pt
preferred label: Ｆ３０００ @ja-jp
definition: Corrida de velocidade de monopostos, com motores menos potentes que os de F1. Os pilotos competem individualmente e por equipes em vários circuitos mundiais, segundo especificações da Federação Internacional do Automóvel (FIA). @pt-br
definition: Using less powerful motors than the Formula One, designated construction teams race over varied circuits the world over in speed races for individual and team honours over a season. @en-gb
definition: F1ほど強力ではないエンジンを使い、指定されたコンストラクション･チームは、シーズンを通して世界中のさまざまなスピードレースのサーキットで個人とチームの名誉のためにレースを行う @ja-jp
definition: course de voitures monoplace uniquement conçues pour les courses de vitesse sur circuit et construites par le constructeur désigné par la FIA selon une spécicfication établie par le FIA @fr
definition: Corrida de velocidade de monolugares, com motores menos potentes que os de F1. Os pilotos competem individualmente e por equipas em vários circuitos mundiais, segundo especificações da Federação Internacional do Automóvel (FIA). @pt-pt
definition: Mit weniger starken Motoren als bei der Formel 1, fahren ausgewählte Konstrukteur-Teams über verschiedene Runden weltweit Geschwindigkeitsrennen im Einzel- und Teamwettbewerb über eine Saison. @de
definition: Carrera de autos monoplaza, con motores de menor poder que los de F1. Compiten en forme individual y por equipos, en variados circuitos alrededor del mundo según especificaciones de la organización FIA. @es
definition: Corsa automobilistica su monoposto su vari circuiti, si usano motori meno potenti della F1
note: nessuno
in scheme: Subject Code
created: 2000-10-30T12:00:00+00:00
modified: 2010-12-15T17:01:09+00:00
broader: Automobilismo

Endurance
type: Concept
preferred label: resistência @pt-pt
preferred label: resistencia @es
preferred label: 耐久 @ja-jp
preferred label: endurance @en-gb
preferred label: Ausdauer @de
preferred label: Course d'endurance @fr
definition: Ausdauer Rennen mit einem Fahrer und einem Beifahrer mit speziell ausgebauten Autos. @de
definition: Corrida de longa distância para piloto e copiloto, em carros especialmente preparados para testar a resistência. @pt-pt
definition: Endurance races for a driver and co-pilot using specially built cars. @en-gb
definition: Corse di resistenza con un pilota e un copilota con auto speciali
definition: Carrera de resistencia para el conductor y copiloto, usando autos especialmente preparados. @es
definition: course de longue distance disputée par des voitures bi-places construites spécialement pour la compétition @fr
definition: 特別に組み立てられた車を使用した正・副ドライバーによる耐久レース @ja-jp
note: nessuno
in scheme: Subject Code
created: 2000-10-30T12:00:00+00:00
modified: 2010-12-15T17:01:09+00:00
broader: Automobilismo

Indy
type: Concept
preferred label: Formule Indy @fr
preferred label: Fórmula Indy @pt-br
preferred label: インディカー @ja-jp
preferred label: fórmula indy @es
definition: Rango más alto de la Liga Profesional estadounidense de carreras de velocidad en distintos circuitos. @es
definition: Nordamerikanische professionelle Topliga der Geschwindigkeitsrennen über Runden. @de
definition: サーキットでのスピードレースにおける北米トップクラスのプロリーグ @ja-jp
definition: Competição organizada pela liga profissional norte-americana de corridas de velocidade. @pt-pt
definition: North American top range professional league speed racing over circuits. @en-gb
definition: competition se déroulant sur des circuits organisé par une ligue professsionnelle américaine @fr
definition: Gara di velocità sui circuiti organizzati in Nord America.
note: nessuno
in scheme: Subject Code
created: 2000-10-30T12:00:00+00:00
modified: 2010-12-15T17:01:09+00:00
broader: Automobilismo

CART
type: Concept
preferred label: カート @ja-jp
preferred label: fórmula cart @es
definition: Corrida de velocidade da liga profissional norte-americana. @pt-pt
definition: Nordamerikanische professionelle Liga der Geschwindigkeitsrennen über Runden. @de
definition: North American professional league speed racing. @en-gb
definition: Competencia organizada por una de las ligas profesionales estadounidenses de carreras de velocidad. @es
definition: Gara di velocità sui circuiti organizzati in Nord America.
definition: スピードレースの北米プロリーグ Championship Auto Racing Teams @ja-jp
definition: competition se déroulant sur des circuits organisé par une ligue professsionnelle américaine @fr
note: nessuno
in scheme: Subject Code
created: 2000-10-30T12:00:00+00:00
modified: 2010-12-15T17:01:09+00:00
broader: Automobilismo
broad match: http://cv.iptc.org/newscodes/mediatopic/20000991

NHRA
type: Concept
preferred label: ＮＨＲＡ @ja-jp
preferred label: nhra @es
definition: Corrida de velocidade da liga profissional norte-americana. @pt-pt
definition: Nordamerikanische professionelle Liga der Geschwindigkeitsrennen über Runden. @de
definition: Competencia organizada por una de las ligas profesionales estadounidenses de carreras de velocidad. @es
definition: Gara di velocità sui circuiti organizzati in Nord America.
definition: スピードレースの北米プロリーグ National Hot Rod Association @ja-jp
definition: North American professional league speed racing. @en-gb
definition: competition se déroulant sur des circuits organisé par une ligue professsionnelle américaine @fr
note: nessuno
in scheme: Subject Code
created: 2000-10-30T12:00:00+00:00
modified: 2010-12-15T17:01:09+00:00
broader: Automobilismo
broad match: http://cv.iptc.org/newscodes/mediatopic/20000991

NASCAR
type: Concept
preferred label: nascar @es
preferred label: ナスカー @ja-jp
definition: competition se déroulant sur des circuits organisé par une ligue professsionnelle américaine @fr
definition: Corrida de velocidade da liga profissional norte-americana. @pt-pt
definition: North American professional league speed racing. @en-gb
definition: Nordamerikanische professionelle Liga der Geschwindigkeitsrennen über Runden. @de
definition: Competencia organizada por una de las liga profesionales estadounidenses de carreras de velocidad. @es
definition: Gara di velocità sui circuiti organizzati in Nord America.
definition: スピードレースの北米プロリーグ National Association for Stock Car Auto Racing @ja-jp
note: nessuno
in scheme: Subject Code
created: 2000-10-30T12:00:00+00:00
modified: 2010-12-15T17:01:09+00:00
broader: Automobilismo
broad match: http://cv.iptc.org/newscodes/mediatopic/20000991

TRUCKI
type: Concept
preferred label: trucki (camiones) @es
preferred label: ＴＲＵＣＫＩ @ja-jp
definition: Nordamerikanische professionelle Liga der Geschwindigkeitsrennen über Runden. @de
definition: Gara di velocità sui circuiti organizzati in Nord America.
definition: competition se déroulant sur des circuits organisé par une ligue professsionnelle américaine @fr
definition: スピードレースの北米プロリーグ北米プロリーグ TRACKI @ja-jp
definition: Corrida de velocidade da liga profissional norte-americana. @pt-pt
definition: North American professional league speed racing. @en-gb
definition: Competencia entre camiones organizada por una de las ligas profesionales estadounidenses de velocidad. @es
note: nessuno
in scheme: Subject Code
created: 2000-10-30T12:00:00+00:00
modified: 2010-12-15T17:01:09+00:00
broader: Automobilismo
broad match: http://cv.iptc.org/newscodes/mediatopic/20000991

Rally
type: Concept
preferred label: rally por etapas @es
preferred label: Rallye @de
preferred label: étape @fr
preferred label: rali por etapas @pt-pt
preferred label: rallying @en-gb
preferred label: ラリー @ja-jp
definition: Carrera automovilística de Rally por etapas. @es
definition: Corridas de rali por etapas. @pt-pt
definition: Rennen im Stadion. @de
definition: Stage races @en-gb
definition: ステージレース @ja-jp
definition: courses à étape @fr
definition: Singola prova di Rally
note: nessuno
in scheme: Subject Code
created: 2000-10-30T12:00:00+00:00
modified: 2010-12-15T17:01:09+00:00
broader: Campionato Rally
broad match: http://cv.iptc.org/newscodes/mediatopic/20000997

Inseguimento
type: Concept
preferred label: perseguição @pt-br
preferred label: Angriff @de
preferred label: Rallyes-raid @fr
preferred label: raid @es
preferred label: pursuit @en-gb
preferred label: パーシュート @ja-jp
definition: courses à étapes où la notion d'aventures s'joutent à la performance sportive @fr
definition: Carrera por etapas donde el cárater de aventura se suma al desempeño deportivo. @es
definition: 前半はクラッシック、後半はフリースタイルとなる一斉スタートのクロスカントリー競技 @ja-jp
definition: Querfeldein-Rennen im Massenstart, erste Hälfte der Distanz im klassischen Stil und die andere Hälfte im Freistil. @de
definition: Corrida de fundo em que o caráter de aventura se soma ao desempenho esportivo. @pt-br
definition: Corrida de fundo em que o caráter de aventura se soma ao desempenho desportivo. @pt-pt
definition: Gara con partenza in gruppo, la prima metà della distanza prevista si percorre in modo classico, la seconda in stile libero
definition: Cross-country race with mass start, first half of the distance in classic and the other half in free style. @en-gb
note: nessuno
note: changed name and added explanation in V15 @es
in scheme: Subject Code
created: 2000-10-30T12:00:00+00:00
modified: 2010-12-15T17:01:09+00:00
broader: Campionato Rally
broad match: http://cv.iptc.org/newscodes/mediatopic/20000997

Rallycross
type: Concept
preferred label: rallycross @en-gb
preferred label: Crossrallye @de
preferred label: ラリークロス @ja-jp
preferred label: ralicrosse @pt-pt
definition: Corridas de rali por etapas em circuitos de terra. @pt-pt
definition: Corse a tappe su piste battute
definition: Rennen im Stadion über schmutzige Straßen. @de
definition: courses à étapes se déroulant en tout terrain @fr
definition: Carrera por etapas sobre caminos todo terreno. @es
definition: ダートトラックによるステージレース @ja-jp
definition: Stage races over dirt tracks @en-gb
note: nessuno
in scheme: Subject Code
created: 2000-10-30T12:00:00+00:00
modified: 2010-12-15T17:01:09+00:00
broader: Campionato Rally

Gran Premio
type: Concept
preferred label: Speed Grand Prix @de
preferred label: gran premio de velocidad @es
preferred label: velocidade @pt-br
preferred label: Grand-Prix de vitesse @fr
preferred label: speed-Grand-Prix @en-gb
preferred label: グランプリ @ja-jp
definition: Corrida de velocidade em que cada segundo conta. @pt-pt
definition: Corsa di moto di velocità
definition: Ein schnelles Rennen bei dem jede Sekunde gezählt wird. @de
definition: 1秒も無駄に出来ないような、速くて猛烈なレース @ja-jp
definition: A fast and furious race where every second counts @en-gb
definition: compétition où la vitesse est le seul facteur de compétition @fr
definition: Exigente carrera donde la velocidad es fundamental y cada segundo cuenta. @es
note: nessuno
in scheme: Subject Code
created: 2000-10-30T12:00:00+00:00
modified: 2010-12-15T17:01:09+00:00
broader: Motociclismo
broad match: http://cv.iptc.org/newscodes/mediatopic/20000998

Enduro
type: Concept
preferred label: enduro @en-gb
preferred label: エンデューロ @ja-jp
definition: épreuve de vitesse, de régularité et d'endurance qui se déroule sur terrain variés tels que sentiers forestiers ou chemins de terre @fr
definition: A race of speed, endurance and regularity over varied surfaces such as through forests and on dirt tracks @en-gb
definition: 森林を抜けたりダートトラックなどの多彩な路面を走行して、スピード、耐久性および正確さを競う @ja-jp
definition: Corrida de velocidade, resistência e regularidade sobre várias superfícies como florestas e estradas de terra. @pt-br
definition: Corsa di velocità, resistenza e regolarità su varie superfici come ad esempio attraverso foreste e su piste battute
definition: Carrera de velocidad, resistencia y regularidad sobre variadas superficies, tales como bosques y caminos de tierra. @es
definition: Geschwindigkeitsrennen, Ausdauer und Regeln über verschiedene Oberflächen, z.B durch den Wald und auf schmutzigen Straßen. @de
note: nessuno
in scheme: Subject Code
created: 2000-10-30T12:00:00+00:00
modified: 2010-12-15T17:01:09+00:00
broader: Motociclismo

Pista erbosa
type: Concept
preferred label: grass-track @pt-br
preferred label: Grasbahn @de
preferred label: Course sur herbe @fr
preferred label: グラストラック @ja-jp
preferred label: carrera sobre césped @es
definition: A race competed on turf @en-gb
definition: Carrera de moto sobre césped. @es
definition: 芝生で競技するレース @ja-jp
definition: Corrida de motos na erva. @pt-pt
definition: Corrida de motos na grama. @pt-br
definition: épreuve se déroulant sur herbe @fr
definition: Rennen, was auf Gras ausgetragen wird. @de
definition: Una corsa disputata su prati
note: nessuno
in scheme: Subject Code
created: 2000-10-30T12:00:00+00:00
modified: 2010-12-15T17:01:09+00:00
broader: Motociclismo

Motopalla
type: Concept
preferred label: モトボール @ja-jp
preferred label: moto-ball @fr
preferred label: Motoball @de
definition: Uno sport di squadra in cui i piloti giocano a palla
definition: Deporte de equipo sobre motos, donde los competidores juegan con una pelota para anotar en valla contraria. @es
definition: Desporto de equipa em que os pilotos jogam bola. @pt-pt
definition: compétition par équipes dans laquelle les pilotes manœuvrent un ballon @fr
definition: Mannschaftssport bei dem die Fahrer mit einem Ball spielen. @de
definition: Team sport where drivers play a ball @en-gb
definition: Desporto de equipe em que os pilotos jogam bola. @pt-br
definition: ドライバーがボールを競うチームスポーツ @ja-jp
note: nessuno
note: changed name and added explanation in V15 @fr
in scheme: Subject Code
created: 2000-10-30T12:00:00+00:00
modified: 2010-12-15T17:01:09+00:00
broader: Motociclismo

motocross
type: Concept
preferred label: モトクロス @ja-jp
preferred label: moto-cross @en-gb
preferred label: Motocross
preferred label: motocrosse @pt-pt
definition: Carrera de motos todoterreno en area con fuertes y variables desniveles. @es
definition: Corrida de motos em piso de terra com grandes desníveis. @pt-pt
definition: Corsa su un fondo battuto di vario tipo e che presenta dei forti dislivelli
definition: Rennen über schmutzige Straßen und enge Dämme. @de
definition: course en terrain varié qui présente de fortes dénivellations @fr
definition: 過酷な盛り土が特徴であるダートトラックのレース @ja-jp
definition: Raced over dirt tracks featuring severe mounds @en-gb
note: nessuno
in scheme: Subject Code
created: 2000-10-30T12:00:00+00:00
modified: 2010-12-15T17:01:09+00:00
broader: Motociclismo

Rallying
type: Concept
preferred label: rallying @en-gb
preferred label: Rallyes @fr
preferred label: ラリー @ja-jp
preferred label: Rallye @de
preferred label: rally @es
definition: épreuves disputées sur routes libres @fr
definition: Carrera de moto sobre rutas regulares. @es
definition: Rennen über reguläre Straßen. @de
definition: Corridas de motos em estrada. @pt-pt
definition: Prove disputate su strade normali
definition: 公道を走るレース @ja-jp
definition: Races run over regular roads @en-gb
note: nessuno
in scheme: Subject Code
created: 2000-10-30T12:00:00+00:00
modified: 2010-12-15T17:01:09+00:00
broader: Motociclismo

trial
type: Concept
preferred label: Trial
preferred label: トライアル @ja-jp
definition: Carrera de resistencia y regularidad en todo terreno. @es
definition: Rennen mit Belastung und Ausdauer durch unterschiedliches Gelände. @de
definition: 変化に富んだ地形を通って一貫性と耐久性を競う @ja-jp
definition: A race of consistency and endurance over varied terrain @en-gb
definition: Corrida de resistência e regularidade, realizada em percursos acidentados, e em que os pilotos devem ultrapassar vários obstáculos, naturais ou artificiais. @pt-pt
definition: épreuve de régularité et d'endurance organisée en terrain varié @fr
definition: Prova di regolarità ed equilibrio disputata su terreni di vario tipo
note: nessuno
in scheme: Subject Code
created: 2000-10-30T12:00:00+00:00
modified: 2010-12-15T17:01:09+00:00
broader: Motociclismo

Endurance
type: Concept
preferred label: resistência @pt-br
preferred label: 耐久 @ja-jp
preferred label: endurance @en-gb
preferred label: resistencia @es
definition: épreuve de régularité et d'endurance organisée sur piste @fr
definition: 耐久ロードレース @ja-jp
definition: Corrida de estrada de resistência e regularidade. @pt-br
definition: Prova di regolarità e resistenza disputata su strada
definition: A road race of consistency and endurance @en-gb
definition: Carrera de resistencia y regularidad pero en ruta. @es
definition: Straßenrennen mit Belastung und Ausdauer. @de
note: nessuno
in scheme: Subject Code
created: 2000-10-30T12:00:00+00:00
modified: 2010-12-15T17:01:09+00:00
broader: Motociclismo

Superbike
type: Concept
preferred label: superbikes @pt-pt
preferred label: スーパーバイク @ja-jp
preferred label: superbike @en-gb
definition: Tamanho de motor. @pt-pt
definition: Motorenstärke @de
definition: Engine size @en-gb
definition: catégorie d'engins @fr
definition: Categoria di motori in base alla quale si disputa il campionato
definition: Categoría de Moto por potencia de la máquina o motor. @es
definition: エンジン容量 @ja-jp
note: nessuno
in scheme: Subject Code
created: 2000-10-30T12:00:00+00:00
modified: 2010-12-15T17:01:09+00:00
broader: Motociclismo
broad match: http://cv.iptc.org/newscodes/mediatopic/20000998

125
type: Concept
preferred label: 125 cm3 @pt-br
preferred label: １２５ｃｃ @ja-jp
preferred label: 125ccm @de
preferred label: 125cm3 @fr
definition: Motorenstärke @de
definition: Tamaño del motor. @es
definition: Tamanho de motor. @pt-br
definition: エンジン容量 @ja-jp
definition: Categoria di motori in base alla quale si disputa il campionato
definition: catégorie d'engins @fr
definition: Engine size @en-gb
note: nessuno
in scheme: Subject Code
created: 2000-10-30T12:00:00+00:00
modified: 2010-12-15T17:01:09+00:00
broader: Motociclismo
broad match: http://cv.iptc.org/newscodes/mediatopic/20000998

250
type: Concept
preferred label: 250 cm3 @es
preferred label: ２５０ｃｃ @ja-jp
preferred label: 250ccm @de
preferred label: 250cm3 @fr
definition: catégorie d'engins @fr
definition: Categoria di motori in base alla quale si disputa il campionato
definition: エンジン容量 @ja-jp
definition: Engine size @en-gb
definition: Tamanho de motor. @pt-pt
definition: Tamaño del motor. @es
definition: Motorenstärke @de
note: nessuno
in scheme: Subject Code
created: 2000-10-30T12:00:00+00:00
modified: 2010-12-15T17:01:09+00:00
broader: Motociclismo
broad match: http://cv.iptc.org/newscodes/mediatopic/20000998

500
type: Concept
preferred label: 500 cm3 @en-gb
preferred label: ５００ｃｃ @ja-jp
preferred label: 500ccm @de
preferred label: 500cm3 @fr
definition: catégorie d'engins @fr
definition: エンジン容量 @ja-jp
definition: Categoria di motori in base alla quale si disputa il campionato
definition: Motorenstärke @de
definition: Tamanho de motor. @pt-pt
definition: Tamaño del motor. @es
definition: Engine size @en-gb
note: nessuno
in scheme: Subject Code
created: 2000-10-30T12:00:00+00:00
modified: 2010-12-15T17:01:09+00:00
broader: Motociclismo
broad match: http://cv.iptc.org/newscodes/mediatopic/20000998

Sidecar
type: Concept
preferred label: サイドカー @ja-jp
preferred label: sidecar @pt-br
preferred label: side-cars @fr
preferred label: Beiwagen @de
preferred label: carrera de sidecars @es
definition: Mit verschiedenen Motorenstärken aber an der Seite mit einer Sitzmöglichkeit für einen Beifahrer. @de
definition: Of different engine sizes but attached to a side car featuring a passenger @en-gb
definition: Categoria de veículos com diferentes tamanhos de motor, mas com a característica comum de ter um pequeno carro fixo do lado, para transporte de outro passageiro. @pt-pt
definition: catégorie d'engins où la moto est lié à un habitable à une roue pour un passager @fr
definition: 様々なエンジン容量があるが、人を乗せるためのサイドカーが付いている @ja-jp
definition: Motoveicolo che su un lato ha attaccato un altro veicolo per portare un passeggero
definition: Con diferentes tamaños de motor, pero con la característica de llevar adherido en su costado otra sección con un acompañante. @es
note: nessuno
in scheme: Subject Code
created: 2000-10-30T12:00:00+00:00
modified: 2010-12-15T17:01:09+00:00
broader: Motociclismo

Moto GP
type: Concept
preferred label: MotoGP @fr
preferred label: motoGP @pt-br
preferred label: モトＧＰ @ja-jp
preferred label: 1000 cm3 @es
definition: Hubraumklasse 1000 Kubikzentimeter. @de
definition: Categoria di motori in base alla quale si disputa il campionato
definition: Categoria de 1000cc. @pt-br
definition: 1000ccの容量のクラス @ja-jp
definition: Tamaño del motor. @es
definition: Capacity class 1000ccm @en-gb
definition: Catégorie des 1000 cm3 @fr
note: nessuno
in scheme: Subject Code
created: 2004-04-22T12:00:00+00:00
modified: 2012-07-10T12:00:00+00:00
broader: Motociclismo

Sci di fondo
type: Concept
preferred label: esqui de fundo @pt-br
preferred label: Langlauf @de
preferred label: cross-country @en-gb
preferred label: Course de fond @fr
preferred label: クロスカントリー @ja-jp
preferred label: cross country (campo traviesa) @es
definition: Corrida de esqui nórdico. @pt-pt
definition: Corsa di sci nordico
definition: Langlaufrennen Ski nordisch. @de
definition: course de ski nordique @fr
definition: Nordic ski race @en-gb
definition: ノルディック・スキーレース @ja-jp
definition: Carrera de esquí nórdico. @es
note: nessuno
in scheme: Subject Code
created: 2000-10-30T12:00:00+00:00
modified: 2010-12-15T17:01:09+00:00
broader: Sci nordico

5 km tecnica classica
type: Concept
preferred label: 5 km Style classique @fr
preferred label: 5 km classical time @en-gb
preferred label: estilo clásico 5 km. @es
preferred label: 5 km clássico @pt-pt
preferred label: ５ｋｍクラシカル @ja-jp
preferred label: 5 km klassisch @de
definition: course de 5km style classique : le skieur garde les skis parallèles, sauf dans les montées à fort pourcentage, où il utilise le pas de ciseaux @fr
definition: A 5km classic race in that the competitor keeps his skis parallel except on steep inclines where the scissor move is used @en-gb
definition: Corsa di 5 km durante la quale i concorrenti gareggiano con gli sci che scorrono paralleli eccetto su pendii scoscesi dove possono procedere con movimento a forbice
definition: Carrera clásica de 5 km. en la que los competidores mantienen sus esquís paralelos, excepto en pendientes pronunciadas, las que se usa el movimiento de tijera. @es
definition: Corrida clássica de 5km em que o esquiador mantém os esquis paralelos, exceto nas descidas pronunciadas, onde utiliza o movimento de tesoura. @pt-br
definition: 5 km Rennen im klassichen Stil bei dem der Wettkämpfer seine Skier parallel führen muss außer in der freien Technik (Skating) bei Benutzung des *scissor move*. @de
definition: 5Kmのクラシック・スタイルレース。競技者は、逆ハの字が使われるような急勾配を除くと、スキー板を並行に保つ @ja-jp
note: nessuno
in scheme: Subject Code
created: 2000-10-30T12:00:00+00:00
modified: 2010-12-15T17:01:09+00:00
broader: Sci nordico
broad match: http://cv.iptc.org/newscodes/mediatopic/20001060

10 km tecnica classica
type: Concept
preferred label: 10 km style classique @fr
preferred label: 10 km klassisch @de
preferred label: 10 km estilo clássico @pt-pt
preferred label: 10 km classical style @en-gb
preferred label: １０ｋｍクラシカル @ja-jp
preferred label: 10 km. estilo clásico @es
definition: Corsa tipica di 10 km in cui i concorrenti gareggiano tenendo i loro sci paralleli eccetto nei pendii scoscesi dove possono muoversi con gli sci a forbice
definition: 10Kmのクラシックスタイル・レース。競技者は、逆ハの字にするような急勾配を除くと、スキー板を並行に保つ @ja-jp
definition: Corrida clássica de 10km em que o esquiador mantém os esquis paralelos, exceto nas descidas pronunciadas, onde utiliza o movimento de tesoura. @pt-pt
definition: A 10km classic race in that the competitor keeps his skis parallel except on steep inclines where the scissor move is used @en-gb
definition: 10 km Rennen im klassichen Stil bei dem der Wettkämpfer seine Skier parallel führen muss außer bei Benutzung des *scissor move*. @de
definition: course de 10 km de style classique : le skieur garde les skis parallèles, sauf dans les montées à fort pourcentage, où il utilise le pas de ciseaux @fr
definition: Clásica carrera de 10 km. en la que los competidores mantienen sus esquís paralelos, excepto en pendientes, donde es usado el movimiento de tijera. @es
note: nessuno
in scheme: Subject Code
created: 2000-10-30T12:00:00+00:00
modified: 2010-12-15T17:01:09+00:00
broader: Sci nordico
broad match: http://cv.iptc.org/newscodes/mediatopic/20001060

10 km inseguimento in stile libero
type: Concept
preferred label: 10 km poursuite libre @fr
preferred label: 10 km pursuit free style @en-gb
preferred label: 10 km perseguição estilo livre @pt-pt
preferred label: 10 km. persecución estilo libre @es
preferred label: 10 km Freistil @de
preferred label: １０ｋｍフリースタイル追い抜き @ja-jp
definition: 競技者間の位置に依存する時間差でスタートし、スキーでスケーティングのようなテクニックを使う @ja-jp
definition: Partenza a scaglioni in base alle posizioni dei concorrenti, i quali, possono usare la tecnica di pattinaggio sugli sci
definition: 10 km Rennen im Freistil mit Verfolgungsstart abhängig von Positionen, bei der die Wettkämpfer eine eislaufähnliche Technik auf Skiern (Skating) benutzen. @de
definition: Course de 10 km à départ échelonné où les concurrents utilisent une technique semblable à du patinage @fr
definition: Corrida de 10 km de largada escalonada em que os esquiadores utilizam uma técnica semelhante à patinação. @pt-br
definition: Competencia en dos mangas en 10km, una estilo clásico contra reloj y partida escalonada, la otra estilo libre y con salida de acuerdo al tiempo de la primera fase. El que atraviesa primero la línea de meta gana. @es
definition: Staggered start depending on positions with competitors using a skating like technique on skis @en-gb
definition: Corrida de 10 km de largada escalonada em que os esquiadores utilizam uma técnica semelhante à patinagem. @pt-pt
note: nessuno
in scheme: Subject Code
created: 2000-10-30T12:00:00+00:00
modified: 2010-12-15T17:01:09+00:00
broader: Sci nordico
broad match: http://cv.iptc.org/newscodes/mediatopic/20001060

15 km tecnica classica
type: Concept
preferred label: 15 km style classique @fr
preferred label: １５ｋｍクラシカル @ja-jp
preferred label: 15 km klassisch @de
preferred label: 15 km. estilo clásico @es
preferred label: 15 km estilo clássico @pt-pt
preferred label: 15 km classical style @en-gb
definition: Corrida clássica de 15km em que o esquiador mantém os esquis paralelos, exceto nas descidas pronunciadas, onde utiliza o movimento de tesoura. @pt-pt
definition: 15kmのクラシックスタイル+W1097レース。スキーを平行に保つ @ja-jp
definition: 15 km Rennen im klassischen Stil, bei dem die Skier parallel geführt werden. @de
definition: Carrera de 15 km., usando el clásico estilo de mantener los esquís paralelos, salvo en pendientes pronunciadas, donde se usa movimiento de tijera. @es
definition: A 15km race using the classical style of keeping skies parallel @en-gb
definition: course de 15km style classique : le skieur garde les skis parallèles, sauf dans les montées à fort pourcentage, où il utilise le pas de ciseaux @fr
definition: Corsa di 15 km nella quale si usa lo stile classico di tenere gli sci paralleli
note: nessuno
in scheme: Subject Code
created: 2000-10-30T12:00:00+00:00
modified: 2010-12-15T17:01:09+00:00
broader: Sci nordico
broad match: http://cv.iptc.org/newscodes/mediatopic/20001060

15 km inseguimento in stile libero
type: Concept
preferred label: 15 km poursuite libre @fr
preferred label: １５ｋｍフリースタイル追い抜き @ja-jp
preferred label: 15 km perseguição estilo livre @pt-pt
preferred label: 15 km Freistil @de
preferred label: 15 km pursuit free style @en-gb
preferred label: 15 km. persecución estilo libre @es
definition: 15km race with staggered start using free style technique similar to a skating motion @en-gb
definition: Corsa di 15 km con partenza in scaglioni e nella quale si usa la tecnica dello stile libero, un moto simile a quello del pattinaggio
definition: Corrida de 10 km de largada escalonada em que os esquiadores utilizam uma técnica semelhante à patinação. @pt-br
definition: 15Kmのフリースタイル・レースで、時間差でスタートする。スケーティング動作のようなテクニックを使う @ja-jp
definition: Carrera de 15 km. Con dos mangas en un día (estilo clásico contrarreloj y libre). @es
definition: Corrida de 15 km de largada escalonada em que os esquiadores utilizam uma técnica semelhante à patinagem. @pt-pt
definition: Course de 15 km à départ échelonné où les concurrents utilisent une technique semblable à du patinage @fr
definition: 15 km Rennen im Freistil mit Verfolgungsstart abhängig von Positionen, bei der die Wettkämpfer eine eislaufähnliche Technik auf Skiern (Skating) benutzen. @de
note: nessuno
in scheme: Subject Code
created: 2000-10-30T12:00:00+00:00
modified: 2010-12-15T17:01:09+00:00
broader: Sci nordico
broad match: http://cv.iptc.org/newscodes/mediatopic/20001060

10 km + 15 km combinata
type: Concept
preferred label: 10 km + 15 km combinado @pt-br
preferred label: 10 km + 15 km combiné @fr
preferred label: １０＋１５ｋｍ複合 @ja-jp
preferred label: 10 km + 15 km combined @en-gb
preferred label: 10 km+15 km Kombination @de
preferred label: 10km + 15km combinado @es
definition: les 2 manches le même jour sur 10km, la manche classique en contre-la-montre avec départ échelonné, la manche libre disputée en fonction des temps de la 1re (le meilleur temps en 1er, suivi du 2e temps, etc), le premier à franchir la ligne a gagné. @fr
definition: 10 km Rennen im klasssichen Stil gefolgt von 15 km im Freistil. @de
definition: Corrida clássica de 10km seguida de corrida de 15km de estilo livre. @pt-br
definition: 10kmクラシック。15kmフリースタイル・レースに準拠 @ja-jp
definition: 10 km clasicos seguidos de 15km de estilo combinado @es
definition: 10km classic followed by 15km free-style race @en-gb
definition: Corsa classica di 10 km seguita da una corsa di 15 km in stile libero
note: nessuno
in scheme: Subject Code
created: 2000-10-30T12:00:00+00:00
modified: 2010-12-15T17:01:09+00:00
broader: Sci nordico
broad match: http://cv.iptc.org/newscodes/mediatopic/20001060

30 km tecnica classica
type: Concept
preferred label: ３０ｋｍクラシカル @ja-jp
preferred label: 30 km classical style @en-gb
preferred label: 30 km klassisch @de
preferred label: 30 km estilo clássico @pt-pt
preferred label: 30 km. estilo clásico @es
preferred label: 30 km style classique @fr
definition: Corsa di 30 km in cui gli sciatori tengono i loro sci paralleli eccetto sui pendii scoscesi dove possono usare il moto a forbice
definition: Corrida clássica de 30km em que o esquiador mantém os esquis paralelos, exceto nas descidas pronunciadas, onde utiliza o movimento de tesoura. @pt-pt
definition: 30kmのクラシック・レース。急勾配ではスキー逆ハの字に開くが、それ以外はスキーを平行に保つ @ja-jp
definition: A 30km classic race in that the competitor keeps his skis parallel except on steep inclines where the scissor move is used @en-gb
definition: course de 30km style classique : le skieur garde les skis parallèles, sauf dans les montées à fort pourcentage, où il utilise le pas de ciseaux @fr
definition: 30 km Rennen im klassichen Stil bei dem der Wettkämpfer seine Skier parallel führen muss außer bei Benutzung des *scissor move*. @de
definition: Carrera clásica de 30 km. donde los competidores dejan sus esquís paralelos, excepto en pendientes donde se utiliza el movimiento tijera. @es
note: nessuno
in scheme: Subject Code
created: 2000-10-30T12:00:00+00:00
modified: 2010-12-15T17:01:09+00:00
broader: Sci nordico
broad match: http://cv.iptc.org/newscodes/mediatopic/20001060

30 km stile libero
type: Concept
preferred label: 30 km estilo livre @pt-pt
preferred label: 30 km libre @fr
preferred label: 30 km Freistil @de
preferred label: ３０ｋｍフリースタイル @ja-jp
preferred label: 30 km estilo libre @es
preferred label: 30km free style @en-gb
definition: 30kmのフリースタイル・レース。最も一般的なスタイルで、競技者が滑走するスケートスタイル。スキー板を平行にする必要はない @ja-jp
definition: Corrida de 30km de estilo livre em que o estilo mais comum é o de patinagem (os esquiadores deslizam e os esquis não precisam de estar paralelos). @pt-pt
definition: 30 km Rennen im Freistil, bei dem der meist verwendete Stil das Skating ist, bei dem die Wettkämpfer gleiten und die Skier nicht parallel führen müssen. @de
definition: course de 30km style libre : tous les pas sont permis, le plus utilisé étant le pas du patineur dans lequel le skieur se laisse glisser sur ses skis qui ne sont plus parallèles @fr
definition: Corsa di 30 km in stile libero in cui lo stile più comune è quello del pattinaggio, gli sciatori procedono scivolando e non obbligatoriamente con gli sci paralleli
definition: A 30km free-style race where the most common style is the skate style where competitors slide and the skis do not need to be parallel @en-gb
definition: Corrida de 30km de estilo livre em que o estilo mais comum é o de patinação (os esquiadores deslizam e os esquis não precisam de estar paralelos). @pt-br
definition: Carrera de 30 Km. de estilo libre, donde se permiten todos los pasos y en la cual se emplea comúnmente el estilo de patinaje, con el que los competidores se dejan deslizar en el descenso sin necesidad de mantener los esquíes paralelos. @es
note: nessuno
in scheme: Subject Code
created: 2000-10-30T12:00:00+00:00
modified: 2010-12-15T17:01:09+00:00
broader: Sci nordico
broad match: http://cv.iptc.org/newscodes/mediatopic/20001060

50 km stile libero
type: Concept
preferred label: 50 km estilo livre @pt-br
preferred label: 50 km Freistil @de
preferred label: 50 km libre @fr
preferred label: 50 km free style @en-gb
preferred label: 50 km estilo libre @es
preferred label: ５０ｋｍフリースタイル @ja-jp
definition: Corrida de 50km de estilo livre em que o estilo mais comum é o de patinagem (os esquiadores deslizam e os esquis não precisam de estar paralelos). @pt-pt
definition: course de 50km style libre : tous les pas sont permis, le plus utilisé étant le pas du patineur dans lequel le skieur se laisse glisser sur ses skis qui ne sont plus parallèles @fr
definition: 50kmのフリースタイル･レース。最も一般的なスタイルで、競技者が滑走するスケートスタイル。スキー板を平行にする必要はない @ja-jp
definition: Corsa di 50 km in stile libero dove lo stile più comune è quello del pattinaggio e gli sciatori procedono scivolando e non obbligatoriamente con gli sci paralleli
definition: Igual que anterior, pero en carrera de 50 Km. de estilo libre. @es
definition: 30 km Rennen im Freistil, bei dem der meist verwendete der eiskunstlaufähnliche Stil ist, bei dem die Wettkämpfer gleiten und die Skier nicht parallel führen müssen. @de
definition: Corrida de 50km de estilo livre em que o estilo mais comum é o de patinação (os esquiadores deslizam e os esquis não precisam de estar paralelos). @pt-br
definition: A 50km free style race where the most common style is the skate style where competitors slide and the skis do not need to be parallel @en-gb
note: nessuno
in scheme: Subject Code
created: 2000-10-30T12:00:00+00:00
modified: 2010-12-15T17:01:09+00:00
broader: Sci nordico
broad match: http://cv.iptc.org/newscodes/mediatopic/20001060

Staffetta 4 x 5 km
type: Concept
preferred label: ２０ｋｍリレー @ja-jp
preferred label: 4x5 km estafetas @pt-pt
preferred label: 4x5 km relais @fr
preferred label: 4x5 km Staffel @de
preferred label: 4x5 km revezamento @pt-br
preferred label: 4x5 km relay @en-gb
preferred label: 4x5km relevos @es
definition: チームは４名で、それぞれ5kmをリレー方式で滑る @ja-jp
definition: quatre fois 5 km. Les 2 premiers relayeurs skient en style classique, les 2 derniers en style libre @fr
definition: Corrida de equipe em que 4 esquiadores fazem 5km cada um. @pt-br
definition: Teams of four competitors ski 5km each in relay fashion @en-gb
definition: Equipos de cuatro esquiadores corren 5 Km. cada uno, en la modalidad de relevos, los dos primeros en estilo clásico y los últimos en estilo libre. @es
definition: Corrida de equipa em que 4 esquiadores fazem 5km cada um. @pt-pt
definition: Teams mit jeweils vier Skifahrern, die jeweils 5 km in gestaffelter Form zurücklegen müssen. @de
definition: Le squadre, ciascuna di quattro sciatori, portano a termine una corsa di staffetta di 5 km
note: nessuno
in scheme: Subject Code
created: 2000-10-30T12:00:00+00:00
modified: 2010-12-15T17:01:09+00:00
broader: Sci nordico
broad match: http://cv.iptc.org/newscodes/mediatopic/20001060

Staffetta 4 x 10 km
type: Concept
preferred label: 4x10km relevos @es
preferred label: 4x10 km relay @en-gb
preferred label: ４０ｋｍリレー @ja-jp
preferred label: 4x10 km relais @fr
preferred label: 4x10 km Staffel @de
preferred label: 4x10 km estafetas @pt-pt
preferred label: 4x10 km revezamento @pt-br
definition: Corrida de equipe em que 4 esquiadores fazem 10km cada um. @pt-br
definition: Corrida de equipa em que 4 esquiadores fazem 10km cada um. @pt-pt
definition: チームは４名で、それぞれ10kmをリレー方式で滑る @ja-jp
definition: Teams mit jeweils vier Skifahrern, die jeweils 10 km in gestaffelter Form zurücklegen müssen. @de
definition: Le squadre, composta ciascuna da quattro sciatori, portano a termine una corsa di staffetta di 10 km
definition: Igual que anterior pero 10 km. @es
definition: quatre fois 10km. Les 2 premiers relayeurs skient en style classique, les 2 derniers en style libre @fr
definition: Teams of four competitors ski 10km each in relay fashion @en-gb
note: typo fixed in Explanation @en-gb
note: nessuno
in scheme: Subject Code
created: 2000-10-30T12:00:00+00:00
modified: 2010-12-15T17:01:09+00:00
broader: Sci nordico
broad match: http://cv.iptc.org/newscodes/mediatopic/20001060

Combinata nordica
type: Concept
preferred label: nórdico combinado @es
preferred label: ノルディック複合 @ja-jp
preferred label: Combiné nordique @fr
preferred label: Nordische Kombination @de
preferred label: combinado nórdico @pt-br
preferred label: nordic combined @en-gb
definition: Competencia reservada a los hombres, con combinación de salto de esquí y carreras a campo traviesa, durante dos días. @es
definition: Competição de dois dias que combina saltos de esqui e esqui de fundo. @pt-br
definition: Competizione che dura due giorni e combina salto con gli sci e sci di fondo
definition: Wettkampf über 2 Tage, der das Skispringen und das Langlaufrennen kombiniert. @de
definition: A two day competition combining the ski jump and a cross-country race. @en-gb
definition: discipline réservée aux hommes allie le saut et le ski de fond et se déroule sur 2 jours. @fr
definition: スキージャンプとクロスカントリーレースを組み合わせて、2日間競う @ja-jp
note: typo fixed in Explanation @en-gb
note: nessuno
in scheme: Subject Code
created: 2000-10-30T12:00:00+00:00
modified: 2010-12-15T17:01:09+00:00
broader: Sci nordico

Raid
type: Concept
preferred label: レイド @ja-jp
preferred label: raid @en-gb
preferred label: Angriff @de
definition: NA
definition: --- @de
note: nessuno
in scheme: Subject Code
created: 2000-10-30T12:00:00+00:00
modified: 2010-12-15T17:01:09+00:00
broader: Sci nordico
broad match: http://cv.iptc.org/newscodes/mediatopic/20001060

5 km inseguimento in stile libero
type: Concept
preferred label: 5 km poursuite libre @fr
preferred label: campo traviesa 5 km. persecución libre @es
preferred label: 5 km perseguição estilo livre @pt-br
preferred label: 5 km pursuit free style @en-gb
preferred label: 5 km Freistil @de
preferred label: ５ｋｍフリースタイル @ja-jp
definition: Gara di sci su un percorso di 5 km in stile da inseguimento
definition: Esquí de fondo a lo largo de una pista de 5 Km. en formato de persecución. @es
definition: Langlauf über 5 km im Verfolgungsstart. @de
definition: Course de 5 km à départ échelonné où les concurrents utilisent une technique semblable à du patinage @fr
definition: Cross-country skiing over a 5km course in a pursuit format @en-gb
definition: Corrida de 5km de esqui de fundo em formato de perseguição. @pt-br
definition: 追い抜き形式の5Kコースのクロスカントリースキー @ja-jp
note: nessuno
in scheme: Subject Code
created: 2000-10-30T12:00:00+00:00
modified: 2010-12-15T17:01:09+00:00
broader: Sci nordico
broad match: http://cv.iptc.org/newscodes/mediatopic/20001060

1,5 km sprint
type: Concept
preferred label: 1.5 km sprint @pt-br
preferred label: 1.5 km sprint free @en-gb
preferred label: 1.5 km style libre @fr
preferred label: １．５ｋｍスプリント @ja-jp
preferred label: campo traviesa 1,5 km. embalaje libre @es
preferred label: 1.5 km Sprint Freistil @de
definition: Cross-country skiing over a 1.5km course in a sprint format @en-gb
definition: course de 1,5km style libre tous les pas sont permis @fr
definition: Esquí de fondo a lo largo de una pista de 1,5 Km. en formato de embalaje libre. @es
definition: Langlauf über 1,5 km als Sprint. @de
definition: *Corrida de 1.5km de esqui de fundo em formato de **sprint**.* @pt-pt
definition: スプリント形式の1.5Kコースのクロスカントリースキー @ja-jp
definition: Gara di sci di fondo in velocità su un percorso di 1,5 km
note: nessuno
in scheme: Subject Code
created: 2000-10-30T12:00:00+00:00
modified: 2010-12-15T17:01:09+00:00
broader: Sci nordico
broad match: http://cv.iptc.org/newscodes/mediatopic/20001060

50 km stile classico
type: Concept
preferred label: 50 km estilo clássico @pt-br
preferred label: 50 km style classique @fr
preferred label: 50 km klassisch @de
preferred label: 50 km. estilo clásico @es
preferred label: 50 km classic style @en-gb
preferred label: ５０ｋｍクラシカルスタイル @ja-jp
definition: クラシック形式の50Kコースのクロスカントリースキー @ja-jp
definition: course de 50km style classique : le skieur garde les skis parallèles, sauf dans les montées à fort pourcentage, où il utilise le pas de ciseaux @fr
definition: Corrida de 50km de esqui de fundo em estilo clássico. @pt-br
definition: Gara di 50 km in tecnica classica
definition: Langlauf über 50 km im klassischen Stil. @de
definition: Esquí de fondo a lo largo de una cancha de 50 Km. en formato clásico. @es
definition: Cross-country skiing over a 50km course in a classic style format @en-gb
note: nessuno
in scheme: Subject Code
created: 2000-10-30T12:00:00+00:00
modified: 2010-12-15T17:01:09+00:00
broader: Sci nordico
broad match: http://cv.iptc.org/newscodes/mediatopic/20001060

Sci Orientamento
type: Concept
preferred label: Course d'orientation à skis @fr
preferred label: Ski Orientierung @de
preferred label: スキーオリエンテーリング @ja-jp
preferred label: ski orienteering @en-gb
preferred label: orientação em esqui @pt-pt
preferred label: orientación en esquí @es
definition: Gara a tempo sugli sci su un itinerario segnato da ostacoli che i concorrenti devono cercare e trovare in uno specifico ordine con l'aiuto di una bussola e una mappa
definition: Einzelzeitrennen auf Skiern über eine mit Fackeln markierte Strecke, die der Wettkämpfer mithilfe von Kompass und Karte in einer bestimmten Reihenfolge finden muss. @de
definition: Prueba individual por tiempo sobre esquís en una ruta marcada por balizas. El competidor tiene que buscar y encontrar las marcas en un orden específico, con la ayuda de una brújula y un mapa. @es
definition: Corrida individual de esqui contrarrelógio em percurso assinalado por marcas. O atleta, que prossegue com a ajuda de bússola e mapa, tem que procurar e encontrar as marcas segundo determinada ordem. @pt-pt
definition: An individual ski time-trial over a route marked out by beacons, that the competitor has to search out and find in a specific order. The contestant makes his way with the help of a compass and map @en-gb
definition: Course individuelle contre la montre à ski, sur un parcours matérialisé par des balises que le concurrent doit découvrir dans un ordre imposé. Le coureur définit son chemin à l'aide d'une boussole et d'une carte. @fr
definition: 標識で印を付けたルートを回る個人のスキーのタイムトライアル。競技者は標識を特定の順序で探索する必要がある。競技者はコンパスと地図の助けを借りて前進する @ja-jp
definition: Corrida individual de esqui contra o relógio em percurso assinalado por marcas. O atleta, que prossegue com a ajuda de bússola e mapa, tem que procurar e encontrar as marcas segundo determinada ordem. @pt-br
note: nessuno
in scheme: Subject Code
created: 2000-10-30T12:00:00+00:00
modified: 2010-12-15T17:01:09+00:00
broader: Orientamento

F1
type: Concept
preferred label: f1 @es
preferred label: Ｆ１ @ja-jp
definition: Corrida de velocidade. @pt-br
definition: épreuve de vitesse @fr
definition: Carreras de velocidad en motonáutica. @es
definition: Sprint race @en-gb
definition: スプリントレース @ja-jp
definition: Sprint-Rennen. @de
definition: Gara di velocità tra barche a motore
note: nessuno
in scheme: Subject Code
created: 2000-10-30T12:00:00+00:00
modified: 2010-12-15T17:01:09+00:00
broader: Motonautica
broad match: http://cv.iptc.org/newscodes/mediatopic/20001016

F2
type: Concept
preferred label: Ｆ２ @ja-jp
preferred label: f2 @es
definition: Gara di velocità tra barche a motore
definition: Carreras de larga resistencia y distancia en motonaútica. @es
definition: Long distance race @en-gb
definition: Corrida de fundo. @pt-pt
definition: Langstrecken-Rennen. @de
definition: épreuve d'endurance @fr
definition: 長距離レース @ja-jp
note: nessuno
in scheme: Subject Code
created: 2000-10-30T12:00:00+00:00
modified: 2010-12-15T17:01:09+00:00
broader: Motonautica
broad match: http://cv.iptc.org/newscodes/mediatopic/20001016

Singolo
type: Concept
preferred label: skiff @pt-br
preferred label: Skiff @fr
preferred label: Einer @de
preferred label: single scull @es
preferred label: シングルスカル @ja-jp
preferred label: single sculls @en-gb
definition: Boot für eine Person mit zwei Rudern. @de
definition: 2本のオールを使う1人用ボート @ja-jp
definition: Bote para una persona con dos remos. @es
definition: Barche per una persona con due remi
definition: embarcation avec un rameur et un aviron dans chaque main ( couple) @fr
definition: Barco de 1 pessoa com dois remos. @pt-pt
definition: Single person boats with two oars @en-gb
note: nessuno
in scheme: Subject Code
created: 2000-10-30T12:00:00+00:00
modified: 2010-12-15T17:01:09+00:00
broader: Canottaggio
broad match: http://cv.iptc.org/newscodes/mediatopic/20001026

Doppio
type: Concept
preferred label: double sculls @en-gb
preferred label: doble scull @es
preferred label: Double sculls @fr
preferred label: ダブルスカル @ja-jp
preferred label: Doppelzweier @de
definition: Boot für zwei Personen mit je zwei Rudern. @de
definition: Barco de 2 pessoas com dois remos cada uma. @pt-br
definition: Barche per due persone con due remi a testa
definition: Bote para dos personas con dos remos cada uno. @es
definition: embarcation avec deux rameurs ayant un aviron dans chaque main @fr
definition: 各自が2本のオールを使う2人用ボート @ja-jp
definition: Two person boats with two oars each @en-gb
note: nessuno
in scheme: Subject Code
created: 2000-10-30T12:00:00+00:00
modified: 2010-12-15T17:01:09+00:00
broader: Canottaggio
broad match: http://cv.iptc.org/newscodes/mediatopic/20001026

Quattro di coppia
type: Concept
preferred label: quadruple sculls @en-gb
preferred label: Quatre en couple sans barreur @fr
preferred label: Doppelvierer @de
preferred label: cuádruple scull @es
preferred label: ４人スカル @ja-jp
definition: Four person boats with two oars each and without a team mate to give directions @en-gb
definition: Barco de 4 pessoas com dois remos cada uma e sem timoneiro. @pt-pt
definition: Bote para cuatro personas con dos remos cada uno y sin compañero de equipo para dar direcciones. @es
definition: Barche per quattro persone con due remi a testa e senza un compagno di squadra che indichi la direzione
definition: 各自が2本のオールを使う指示者なしの4人用ボート @ja-jp
definition: embarcation avec quatre rameurs ayant un aviron dans chaque main et sans un équipier qui donne des ordres aux rameurs @fr
definition: Boot für vier Personen mit je zwei Rudern und ohne den Steuermann. @de
note: nessuno
in scheme: Subject Code
created: 2000-10-30T12:00:00+00:00
modified: 2010-12-15T17:01:09+00:00
broader: Canottaggio
broad match: http://cv.iptc.org/newscodes/mediatopic/20001026

Due senza
type: Concept
preferred label: Zweier ohne Steuermann/Steuerfrau @de
preferred label: Deux sans barreur @fr
preferred label: かじなしペア @ja-jp
preferred label: dois sem timoneiro @pt-br
preferred label: par sin timonel @es
preferred label: coxless pair @en-gb
definition: embarcation avec deux rameurs ayant en mains qu'un aviron (en pointe) et sans un équipier qui donne des ordres aux rameurs @fr
definition: Barco de 2 pessoas com um remo cada uma e sem timoneiro. @pt-br
definition: Barche per due persone con un remo a testa e senza un compagno che indichi la direzione
definition: 各自が1本のオールを使う指示者なしの2人用ボート @ja-jp
definition: Boot für zwei Personen mit einem Ruder für jeden und ohne Steuermann. @de
definition: Bote para dos personas, con solamente un remo para cada uno y sin compañero de equipo para dar direcciones. @es
definition: Two person boats with just one oar each and without a team mate to give directions @en-gb
note: nessuno
in scheme: Subject Code
created: 2000-10-30T12:00:00+00:00
modified: 2010-12-15T17:01:09+00:00
broader: Canottaggio
broad match: http://cv.iptc.org/newscodes/mediatopic/20001026

Quattro senza
type: Concept
preferred label: Vierer ohne Steuermann/Steuerfrau @de
preferred label: かじなしフォア @ja-jp
preferred label: Quatre sans barreur @fr
preferred label: quatro sem timoneiro @pt-br
preferred label: coxless four @en-gb
preferred label: cuatro sin timonel @es
definition: Barche per quattro persone con un remo a testa e senza un compagno che indichi la direzione
definition: Barco de 4 pessoas com um remo cada uma e sem timoneiro. @pt-pt
definition: 各自が1本のオールを使う指示者なしの4人用ボート @ja-jp
definition: Bote para cuatro personas, con un remo para cada uno y sin compañero de equipo para dar direcciones. @es
definition: embarcation avec quatre rameurs ayant en mains qu'un aviron (en pointe) et sans un équipier qui donne des ordres aux rameurs @fr
definition: Boot für vier Personen und einem Ruder für jeden ohne Steuermann. @de
definition: Four person boats with just one oar each and without a team mate to give directions @en-gb
note: nessuno
in scheme: Subject Code
created: 2000-10-30T12:00:00+00:00
modified: 2010-12-15T17:01:09+00:00
broader: Canottaggio
broad match: http://cv.iptc.org/newscodes/mediatopic/20001026

Otto
type: Concept
preferred label: ocho @es
preferred label: Huit @fr
preferred label: エイト @ja-jp
preferred label: Achter @de
preferred label: oito @pt-br
preferred label: eight @en-gb
definition: Boot für acht Personen und einem Ruder pro Person ohne Steuermann. @de
definition: 各自が1本のオールを使う指示者なしの8人用ボート @ja-jp
definition: embarcation avec huit rameurs ayant en mains qu'un aviron (en pointe) et avec un équipier qui donne des ordres aux rameurs @fr
definition: Bote para ocho personas, con solamente un remo para cada uno y sin compañero de equipo para dirigir. @es
definition: Barche per otto persone con un remo a testa e senza un compagno che indichi la direzionee
definition: Barco de 8 pessoas com um remo cada uma e sem timoneiro. @pt-br
definition: Eight person boats with just one oar each and without a team mate to give directions @en-gb
note: nessuno
in scheme: Subject Code
created: 2000-10-30T12:00:00+00:00
modified: 2010-12-15T17:01:09+00:00
broader: Canottaggio
broad match: http://cv.iptc.org/newscodes/mediatopic/20001026

Peso leggero
type: Concept
preferred label: peso ligeiro @pt-br
preferred label: peso ligero @es
preferred label: Leichtgewicht @de
preferred label: 軽量級 @ja-jp
preferred label: Poids léger @fr
preferred label: lightweight @en-gb
definition: Quando ai concorrenti è imposta una categoria di peso
definition: Gewichtsklasse die bestimmt wird von den Wettkämpfern. @de
definition: 競技者に課せられる重量のカテゴリー @ja-jp
definition: Where a weight category is imposed on competitors @en-gb
definition: Categoría de peso impuesta a los competidores. @es
definition: Categoria de peso imposta aos competidores. @pt-pt
definition: catégorie de poids imposée aux compétiteurs @fr
note: nessuno
in scheme: Subject Code
created: 2000-10-30T12:00:00+00:00
modified: 2010-12-15T17:01:09+00:00
broader: Canottaggio
broad match: http://cv.iptc.org/newscodes/mediatopic/20001026

Rugby 7
type: Concept
preferred label: rugby 7 @en-gb
preferred label: ７人制ラグビー @ja-jp
preferred label: rúgbi de 7 @pt-br
preferred label: râguebi de 7 @pt-pt
preferred label: rugby 7 (seven) @es
preferred label: Rugby à VII @fr
definition: より楽しく刺激的な種類の競技で、7人からなる2つのチームがピッチで競い、選手は楕円形のボールをパスしながら走り、ゴールラインの後ろでタッチダウンするか、相手のペナルティで得点するか、またはボールをキックしてゴールポストの間を通過させることで得点する、屈強な肉体競技 @ja-jp
definition: Modalidad en la que dos equipos de 7 jugadores compiten en una cancha, anotando tries, conversiones y penales, corriendo y pasándose un balón ovalado, que debe ser apoyado detrás de la línea de anotación, o pateado entre los postes. @es
definition: A more fun and exciting variety where two teams of 7 compete on a pitch where they score tries and penalties by running with and passing an oval ball to be touched down behind the goal line or kicked between goal posts in a tough physical contest @en-gb
definition: Ein lustigere und aufregendere Variante, bei der zwei Teams mit je 7 Spielern um Punktabstand kämpfen, indem sie Versuche und Strafpunkte bekommen durch Rennen und werfen eines ovalen Balles, der hinter der Torlinie den Boden berühren muss oder zwischen zwei Torpfosten geschossen wird in einem harten körperlichen Wettkampf. @de
definition: Jogo de bola em campo relvado opondo duas equipas de 7 jogadores, que tentam marcar ensaios e penalidades correndo e passando uma bola oval com as mãos e os pés. @pt-pt
definition: Jogo de bola em campo gramado opondo duas equipes de 7 jogadores, que tentam marcar ensaios e penalidades correndo e passando uma bola oval com as mãos e os pés. @pt-br
definition: Deux équipes de 7 joueurs essaient de marquer le plus d'essais et de pénalités possibles en portant, passant ou bottant un ballon ovale. @fr
definition: Due squadre, ciascuna composta da sette giocatori, competono su un campo dove segnano punti e penalità correndo con una palla ovale che si passano e devono farla toccare a terra nell'area di meta avversaria o calciata tra i pali della porta
note: nessuno
in scheme: Subject Code
created: 2000-10-30T12:00:00+00:00
modified: 2010-12-15T17:01:09+00:00
broader: Union rugby

Tornado
type: Concept
preferred label: classes olímpicas @pt-pt
preferred label: トルネード級 @ja-jp
preferred label: tornado @es
definition: Boat Category: two man catamaran (21m/sq mainsail) Olympic sport @en-gb
definition: Categoria de embarcação: catamarã de 2 tripulantes (21m quadrados vela grande). Desporto olímpico. @pt-pt
definition: Categoría de embarcación: catamarán de 2 hombres (21m cuadrados vela mayor). Deporte Olímpico. @es
definition: Bootskategorie: zwei-Männer Katamaran (21 m / Hauptsegel) Olympische Disziplin. @de
definition: Categoria di barca: sport olimpico su catamarano per due persone (la randa misura 21 mq)
definition: ヨット・カテゴリ:2人乗りの、いかだ(21平方メートル主帆)オリンピック・スポーツ @ja-jp
definition: catégorie d'embarcation : catamaran à deux équipiers @fr
definition: Categoria de embarcação: catamarã de 2 tripulantes (21m quadrados vela grande). Esporte olímpico. @pt-br
note: nessuno
in scheme: Subject Code
created: 2000-10-30T12:00:00+00:00
modified: 2010-12-15T17:01:09+00:00
broader: Vela
broad match: http://cv.iptc.org/newscodes/mediatopic/20001039

ソリング級
type: Concept
preferred label: soling @en-gb
preferred label: vela ligeira @pt-br
preferred label: Soling
definition: Categoria de embarcação: barco de quilha de 3 tripulantes. @pt-pt
definition: Boat Category: three man keel boat @en-gb
definition: Bootskategorie; Drei-Männer Kielboot. @de
definition: Deriva per tre persone
definition: catégorie d'embarcation : quillard à trois équipiers @fr
definition: ヨット・カテゴリ:3人乗りキール艇(竜骨ボート) @ja-jp
definition: Categoría embarcación: barcaza fluvial con quilla para 3 hombres. @es
note: nessuno
in scheme: Subject Code
created: 2000-10-30T12:00:00+00:00
modified: 2010-12-15T17:01:09+00:00
broader: Vela
broad match: http://cv.iptc.org/newscodes/mediatopic/20001041

49 er
type: Concept
preferred label: 49er @fr
preferred label: ４９ｅｒ級 @ja-jp
definition: Bootskategorie: zwei-Männer Dinghy (8.23/ Hauptsegel). Olympische Disziplin. @de
definition: Categoria de embarcação: dinghy de 2 tripulantes (8.23m quadrados vela grande). Desporto olímpico. @pt-br
definition: Deriva olimpica per due persone (randa 8,23 mq)
definition: ヨット・カテゴリ:2人乗り競走用小型ヨット(8.23平方メートル主帆)オリンピック・スポーツ @ja-jp
definition: catégorie d'embarcation : dériveur à deux équipiers @fr
definition: Boat Category: two man dinghy (8.23m/sq mainsail) Olympic sport @en-gb
definition: Categoría de embarcación: Para dos hombres con vela mayor. Deporte Olímpico. @es
note: nessuno
in scheme: Subject Code
created: 2000-10-30T12:00:00+00:00
modified: 2010-12-15T17:01:09+00:00
broader: Vela
broad match: http://cv.iptc.org/newscodes/mediatopic/20001040

Europa
type: Concept
preferred label: Europe @pt-pt
preferred label: europa @es
preferred label: ヨーロッパ級 @ja-jp
definition: Categoria de embarcação: dinghy de 1 tripulante (4.57m quadrados vela grande). Desporto olímpico. @pt-pt
definition: Deriva olimpica per una persona (randa 4,57 mq)
definition: Bootskategorie: Einmann Dinghy (4.57 m / Hauptsegel). Olympische Disziplin. @de
definition: ヨット・カテゴリ:1人乗り競走用小型ヨット(4.57平方メートル主帆)オリンピック・スポーツ @ja-jp
definition: catégorie d'embarcation : dériveur solitaire @fr
definition: Categoría de embarcación: Navegación de velero individual (4,57m cuadrados vela mayor). Deporte Olímpico. @es
definition: Boat Category: one man dinghy (4.57m/sq mainsail) Olympic sport @en-gb
note: nessuno
in scheme: Subject Code
created: 2000-10-30T12:00:00+00:00
modified: 2010-12-15T17:01:09+00:00
broader: Vela
broad match: http://cv.iptc.org/newscodes/mediatopic/20001040

Laser
type: Concept
preferred label: レーザー級 @ja-jp
preferred label: láser @es
definition: ヨット・カテゴリ:1人乗り競走用小型ヨット(4.6平方メートル主帆)オリンピック・スポーツ @ja-jp
definition: Deriva olimpica per una persona (randa 4,6 mq)
definition: Bootskategorie: Einmann-Dinghy (4.6m/sq Hauptsegel) Olympische Disziplin @de
definition: Categoria de embarcação: dinghy de 1 tripulante (4.6m quadrados vela grande). Desporto olímpico. @pt-br
definition: Categoría de embarcación: Navegación individual (4,6m cuadrados vela mayor). Deporte Olímpico. @es
definition: catégorie d'embarcation : dériveur solitaire @fr
definition: Boat Category: one man dinghy (4.6m/sq mainsail) Olympic sport @en-gb
note: nessuno
in scheme: Subject Code
created: 2000-10-30T12:00:00+00:00
modified: 2010-12-15T17:01:09+00:00
broader: Vela
broad match: http://cv.iptc.org/newscodes/mediatopic/20001040

470
type: Concept
preferred label: ４７０級 @ja-jp
preferred label: 470er @de
definition: Categoria de embarcação: dinghy de 2 tripulantes (7.10m quadrados vela grande). Desporto olímpico. @pt-br
definition: Bootskategorie: zwei-Männer Dinghy (7.10 m / Hauptsegel). Olympische Disziplin. @de
definition: Categoría de embarcación: veleros de a dos competidores (7,10m cuadrados vela mayor). Deporte Olímpico. @es
definition: catégorie d'embarcation : dériveur à deux équipiers @fr
definition: Deriva olimpica per due persone (randa 7,10 mq)
definition: ヨット・カテゴリ:2人乗り競走用小型ヨット(7.10平方メートル主帆)オリンピック・スポーツ @ja-jp
definition: Boat Category: two man dinghy (7.10m/sq mainsail) Olympic sport @en-gb
note: nessuno
in scheme: Subject Code
created: 2000-10-30T12:00:00+00:00
modified: 2010-12-15T17:01:09+00:00
broader: Vela
broad match: http://cv.iptc.org/newscodes/mediatopic/20001040

フィン級
type: Concept
preferred label: finlandesa @es
preferred label: Finn
definition: Boat Category: one man dinghy (10m/sq mainsail) Olympic sport @en-gb
definition: Categoria de embarcação: dinghy de 1 tripulante (10m quadrados vela grande). Desporto olímpico. @pt-br
definition: Deriva olimpica per una persona (randa 10 mq)
definition: Bootskategorie: ein-Mann Dinghy (10 m / Hauptsegel). Olympische Disziplin. @de
definition: Categoría de embarcación: Navegación individual (10m cuadrados vela mayor). Deporte Olímpico. @es
definition: catégorie d'embarcation : dériveur solitaire @fr
definition: ヨット・カテゴリ:1人乗り競走用小型ヨット(10平方メートル主帆)オリンピック・スポーツ @ja-jp
note: nessuno
in scheme: Subject Code
created: 2000-10-30T12:00:00+00:00
modified: 2010-12-15T17:01:09+00:00
broader: Vela
broad match: http://cv.iptc.org/newscodes/mediatopic/20001040

Star
type: Concept
preferred label: estrella @es
preferred label: スター級 @ja-jp
definition: catégorie d'embarcation : quillard à deux équipiers @fr
definition: Categoria de embarcação: barco de quilha de 3 tripulantes (7.10m quadrados vela grande). Esporte olímpico. @pt-br
definition: Barca olimpica con chiglia a due posti (randa 7,10 mq)
definition: Categoria de embarcação: barco de quilha de 3 tripulantes (7.10m quadrados vela grande). Desporto olímpico. @pt-pt
definition: Categoría de embarcación: embarcación con quilla para dos competidores (7,10 m cuadrados vela mayor). Deporte Olímpico. @es
definition: Boat Category: two man keel boat (7.10m/sq mainsail) Olympic sport @en-gb
definition: Bootskategorie: zwei-Mann Kielboot (7.10 m / Hauptsegel). Olympische Disziplin. @de
definition: ヨット・カテゴリ:2人乗りキール艇(竜骨ボート) (7.10平方メートル主帆)オリンピック・スポーツ @ja-jp
note: nessuno
in scheme: Subject Code
created: 2000-10-30T12:00:00+00:00
modified: 2010-12-15T17:01:09+00:00
broader: Vela
broad match: http://cv.iptc.org/newscodes/mediatopic/20001041

Flying dutchmann
type: Concept
preferred label: flying dutchmann @pt-br
preferred label: Flying Dutchmann @de
preferred label: holandés volador @es
preferred label: フライングダッチマン級 @ja-jp
definition: ヨット・カテゴリ:2人乗り競走用小型ヨット @ja-jp
definition: Boat Category: two man dinghy @en-gb
definition: Categoría de embarcación: velero para dos competidores. @es
definition: Categoria de embarcação: dinghy de 2 tripulantes. @pt-br
definition: Bootskategorie: Zwei-Mann Dinghy @de
definition: catégorie d'embarcation : dériveur à deux équipiers @fr
definition: Barca da lago
note: nessuno
in scheme: Subject Code
created: 2000-10-30T12:00:00+00:00
modified: 2010-12-15T17:01:09+00:00
broader: Vela
broad match: http://cv.iptc.org/newscodes/mediatopic/20001040

505
type: Concept
preferred label: ５０５級 @ja-jp
definition: Categoria de embarcação: dinghy de 2 tripulantes. @pt-pt
definition: Bootskategorie: Zwei-Mann Dinghy @de
definition: Deriva
definition: ヨット・カテゴリ:2人乗り競走用小型ヨット @ja-jp
definition: Boat Category: two man dinghy @en-gb
definition: Categoría de embarcación: otra variante de velero para dos competidores. @es
definition: catégorie d'embarcation : dériveur à deux équipiers @fr
note: nessuno
in scheme: Subject Code
created: 2000-10-30T12:00:00+00:00
modified: 2010-12-15T17:01:09+00:00
broader: Vela
broad match: http://cv.iptc.org/newscodes/mediatopic/20001040

Gara a tappe
type: Concept
preferred label: staging race @en-gb
preferred label: Staging Race @de
preferred label: ステージレース @ja-jp
preferred label: corrida por etapas @pt-pt
preferred label: Course à étape @fr
preferred label: carrera por etapas @es
definition: Corrida marítima por etapas. @pt-br
definition: Carrera en el mar por etapas. @es
definition: Sea racing @en-gb
definition: Regata in mare a tappe
definition: Seerennen @de
definition: 海上競技 @ja-jp
definition: catégorie de course en mer @fr
note: nessuno
in scheme: Subject Code
created: 2000-10-30T12:00:00+00:00
modified: 2010-12-15T17:01:09+00:00
broader: Vela
broad match: http://cv.iptc.org/newscodes/mediatopic/20001038

Intorno al mondo
type: Concept
preferred label: cruzeiros @pt-pt
preferred label: travesía alrededor del mundo @es
preferred label: Rund um die Welt @de
preferred label: Autour du monde @fr
preferred label: 世界一周 @ja-jp
preferred label: around the world @en-gb
definition: Open seas racing @en-gb
definition: Rennen auf offener See. @de
definition: Regata in mare aperto, giro del mondo
definition: 外洋ボート競技 @ja-jp
definition: Corrida de embarcações em mar aberto. @pt-br
definition: Carrera de embarcaciones en mar abierto. @es
definition: catégorie de course en mer @fr
note: nessuno
in scheme: Subject Code
created: 2000-10-30T12:00:00+00:00
modified: 2010-12-15T17:01:09+00:00
broader: Vela

Monoscafo
type: Concept
preferred label: Einmaster @de
preferred label: Monocoque @fr
preferred label: 単胴船 @ja-jp
preferred label: monocasco @pt-pt
preferred label: monohull @en-gb
definition: Boot mit einem Mast. @de
definition: bateau à une coque @fr
definition: Barca composta da un singolo scafo o monocarena
definition: Embarcação de um casco. @pt-br
definition: Single hull craft @en-gb
definition: 船体が一つの船 @ja-jp
definition: Barco de un casco @es
note: nessuno
in scheme: Subject Code
created: 2000-10-30T12:00:00+00:00
modified: 2010-12-15T17:01:09+00:00
broader: Vela
broad match: http://cv.iptc.org/newscodes/mediatopic/20001038

Multiscafo
type: Concept
preferred label: multicasco @pt-pt
preferred label: 多胴船 @ja-jp
preferred label: multihulls @en-gb
preferred label: Mehrmaster @de
preferred label: Multicoques @fr
definition: Barco de varios cascos @es
definition: bateau à plusieurs coques @fr
definition: Embarcação de vários cascos. @pt-br
definition: Multi hull craft @en-gb
definition: 船体が複数の船 @ja-jp
definition: Barca multiscafo o catamarano
definition: Boot mit mehreren Masten. @de
note: nessuno
in scheme: Subject Code
created: 2000-10-30T12:00:00+00:00
modified: 2010-12-15T17:01:09+00:00
broader: Vela

Yngling
type: Concept
preferred label: yngling @pt-br
preferred label: イングリング級 @ja-jp
definition: Veleiro de classe olímpica. Corrida feminina com barcos de 6.35m de comprimento e 1.73m de largura. O número e a distância das corridas varia. @pt-pt
definition: Competición de vela Olímpica. Carrera feminina con barcos de 6,35 metros de largo y 1,73 metros de ancho. @es
definition: Olympic boat-class. A race around different courses in a boat of 6.35 metres (20ft 10in) long and 1.73 metres (5ft 8in) wide, crewed in Olympic competition only by women. The number of races and the length of the courses varies. @en-gb
definition: オリンピックのボート競技の階級。全長6.35m(20フィート10インチ)、全幅1.73m(5フィート8インチ)のボートを使用し、オリンピック競技での乗組員は女性のみ。競争の回数とコースの距離は変動する @ja-jp
definition: Voilier de classe olympique, de 6,35 metres de long et de 1,73 mètre de large. Les compétitions olumpiques de yngling sont réservées aux femmes @fr
definition: Olympische Bootsklasse, nur für Damen. Die Boote sind 6.35 Meter lang und 1.73 Meter breit. Die Anzahl der Rennen und die Länge der Strecken variiert. @de
definition: Categoria olimpica.
note: nessuno
in scheme: Subject Code
created: 2004-04-22T12:00:00+00:00
modified: 2012-07-10T12:00:00+00:00
broader: Vela
broad match: http://cv.iptc.org/newscodes/mediatopic/20001038

Mistral
type: Concept
preferred label: mistral @pt-br
preferred label: ミストラル級 @ja-jp
definition: Olympische Bootsklasse. Die Boote sind 4.24 Meter lang und 1.3 Meter breit. Die Anzahl der Rennen und die Länge der Strecken variiert. @de
definition: Competición de vela olímpica con barcos de 4,24 metros de largo y 1,3 metros de ancho. @es
definition: Veleiro de classe olímpica. Corrida com barcos de 4.24m de comprimento e 1.3m de largura. O número e a distância das corridas varia. @pt-br
definition: Olympic boat class. A staged race using boats of the mistral type, which are 4.24 metres (13ft 11in) long and 1.3 metres (4ft 3in) wide. The number of races and the length of the courses varies. @en-gb
definition: Categoria olimpica.
definition: Voilier de classe olympique, de 4,24 metres de long et de 1,3 mètre de large. @fr
definition: オリンピックのボート競技の階級。全長4.24m(13フィート11インチ)全幅1.3m(4フィート3インチ)のミストラルタイプのボートを使用した競技。競技の回数とコースの距離は変動する @ja-jp
note: nessuno
in scheme: Subject Code
created: 2004-04-22T12:00:00+00:00
modified: 2012-07-10T12:00:00+00:00
broader: Vela
broad match: http://cv.iptc.org/newscodes/mediatopic/20001038

10 m carabina ad aria
type: Concept
preferred label: １０ｍエアライフル @ja-jp
preferred label: Carabine à air comprimé 10 m @fr
preferred label: carabina 10 m @pt-br
preferred label: 10 m Luftgewehr @de
preferred label: 10 m air rifle @en-gb
preferred label: 10 m rifle de aire comprimido @es
definition: 射撃競技 @ja-jp
definition: Prova de tiro @pt-br
definition: Schießwettkampf. @de
definition: Shooting event @en-gb
definition: Prueba de tiro. @es
definition: Gara di tiro a segno sui 10 m con carabina
definition: discipline du tir @fr
note: nessuno
in scheme: Subject Code
created: 2000-10-30T12:00:00+00:00
modified: 2010-12-15T17:01:09+00:00
broader: Tiro a segno
broad match: http://cv.iptc.org/newscodes/mediatopic/20001051

10 m pistola ad aria
type: Concept
preferred label: 10 m pistola de aire comprimido @es
preferred label: Pistolet à air comprimé à 10 m @fr
preferred label: pistola 10 m @pt-br
preferred label: １０ｍエアピストル @ja-jp
preferred label: 10 m air pistol @en-gb
preferred label: 10 m Luftpistole @de
definition: Prueba de tiro. @es
definition: 射撃競技 @ja-jp
definition: Shooting event @en-gb
definition: Schießwettkampf. @de
definition: Prova de tiro @pt-br
definition: Gara di tiro a segno su 10 m con pistola
definition: discipline du tir @fr
note: nessuno
in scheme: Subject Code
created: 2000-10-30T12:00:00+00:00
modified: 2010-12-15T17:01:09+00:00
broader: Tiro a segno
broad match: http://cv.iptc.org/newscodes/mediatopic/20001050

10 m bersaglio mobile
type: Concept
preferred label: 10 m Laufende Scheibe @de
preferred label: 10 m running target @en-gb
preferred label: 10 m cible mouvante @fr
preferred label: 10 m blanco en movimiento @es
preferred label: alvo móvel 10 m @pt-pt
preferred label: １０ｍランニングターゲット @ja-jp
definition: Prueba de tiro. @es
definition: Schießwettkampf. @de
definition: Gara di tiro a segno sui 10 m con sagoma a scomparsa
definition: Prova de tiro @pt-br
definition: Shooting event @en-gb
definition: 射撃競技 @ja-jp
definition: discipline du tir @fr
note: nessuno
in scheme: Subject Code
created: 2000-10-30T12:00:00+00:00
modified: 2010-12-15T17:01:09+00:00
broader: Tiro a segno
broad match: http://cv.iptc.org/newscodes/mediatopic/20001052

Pistola automatica
type: Concept
preferred label: tiro rápido 25 m @pt-pt
preferred label: Pistolet 25 m @fr
preferred label: 25 m Schnellfeuerpistole @de
preferred label: 25 m rapid fire pistol @en-gb
preferred label: ２５ｍラピドファイアピストル @ja-jp
preferred label: 25 m pistola de fuego graneado @es
definition: Gara di tiro a segno con pistola automatica
definition: Shooting event @en-gb
definition: Prueba de tiro. @es
definition: discipline du tir @fr
definition: Prova de tiro @pt-br
definition: Schießwettkampf. @de
definition: 射撃競技 @ja-jp
note: nessuno
in scheme: Subject Code
created: 2000-10-30T12:00:00+00:00
modified: 2010-12-15T17:01:09+00:00
broader: Tiro a segno
broad match: http://cv.iptc.org/newscodes/mediatopic/20001050

25 m pistola sportiva
type: Concept
preferred label: 25 m pistolet sport @fr
preferred label: ２５ｍスポーツピストル @ja-jp
preferred label: pistola sport 25 m @pt-pt
preferred label: 25 m pistola deportiva @es
preferred label: 25 m Sportpistole @de
preferred label: 25 m sport pistol @en-gb
definition: Gara di tiro a segno con pistola
definition: Prova de tiro @pt-pt
definition: 射撃競技 @ja-jp
definition: Prueba de tiro. @es
definition: discipline du tir @fr
definition: Schießwettkampf. @de
definition: Shooting event @en-gb
note: nessuno
in scheme: Subject Code
created: 2000-10-30T12:00:00+00:00
modified: 2010-12-15T17:01:09+00:00
broader: Tiro a segno
broad match: http://cv.iptc.org/newscodes/mediatopic/20001050

50 m Pistola libera
type: Concept
preferred label: 50 m pistola libre @es
preferred label: 50 m Freie Pistole @de
preferred label: 50 m free pistol @en-gb
preferred label: pistola livre 50 m @pt-br
preferred label: Pistolet libre à 50 m @fr
preferred label: ５０ｍフリーピストル @ja-jp
definition: Shooting event @en-gb
definition: Schießwettkampf. @de
definition: Gara di tiro a segno con pistola
definition: 射撃競技 @ja-jp
definition: Prova de tiro @pt-pt
definition: Prueba de tiro. @es
definition: discipline du tir @fr
note: nessuno
in scheme: Subject Code
created: 2000-10-30T12:00:00+00:00
modified: 2010-12-15T17:01:09+00:00
broader: Tiro a segno
broad match: http://cv.iptc.org/newscodes/mediatopic/20001050

50 m carabina libera a terra
type: Concept
preferred label: 50 m free rifle prone @en-gb
preferred label: 50 m Kleinkalibergewehr liegend @de
preferred label: ５０ｍフリーライフル伏射 @ja-jp
preferred label: carabina deitado 50 m @pt-pt
preferred label: 50 m rifle libre boca abajo @es
preferred label: 50 m carabine libre couché @fr
definition: Prova de tiro @pt-pt
definition: Prueba de tiro. @es
definition: discipline du tir @fr
definition: Schießwettkampf. @de
definition: Gara di tiro a segno sdraiati
definition: Shooting event @en-gb
definition: 射撃競技 @ja-jp
note: nessuno
in scheme: Subject Code
created: 2000-10-30T12:00:00+00:00
modified: 2010-12-15T17:01:09+00:00
broader: Tiro a segno
broad match: http://cv.iptc.org/newscodes/mediatopic/20001051

50 m carabina libera 3 x 40
type: Concept
preferred label: carabina 3x40 50 m @pt-pt
preferred label: 50 m free rifle 3x40 @en-gb
preferred label: 50 m Kleinkalibergewehr, Dreistellungskampf (3x40) @de
preferred label: ５０ｍフリーライフル３姿勢 @ja-jp
preferred label: 50 m rifle libre 3x40 @es
preferred label: 50 m carabine libre 3x40 @fr
definition: 射撃競技 @ja-jp
definition: Prova de tiro @pt-br
definition: Gara di tiro a segno
definition: discipline du tir @fr
definition: Prueba de tiro. @es
definition: Schießwettkampf. @de
definition: Shooting event @en-gb
note: nessuno
in scheme: Subject Code
created: 2000-10-30T12:00:00+00:00
modified: 2010-12-15T17:01:09+00:00
broader: Tiro a segno
broad match: http://cv.iptc.org/newscodes/mediatopic/20001051

50 m carabina sportiva 3 x 20
type: Concept
preferred label: 50 m Kleinkalibergewehr-Standardgewehr, Dreistellungskampf (3x20) @de
preferred label: ５０ｍスポーツライフル３姿勢 @ja-jp
preferred label: carabina 3x20 50 m @pt-br
preferred label: 50m rifle libre 3x20 @es
preferred label: 50 m carabine sport 3x20 @fr
preferred label: 50 m sport rifle 3x20 @en-gb
definition: Shooting event @en-gb
definition: discipline du tir @fr
definition: Gara di tiro a segno
definition: Schießwettkampf. @de
definition: Prueba de tiro. @es
definition: 射撃競技 @ja-jp
definition: Prova de tiro @pt-pt
note: nessuno
in scheme: Subject Code
created: 2000-10-30T12:00:00+00:00
modified: 2010-12-15T17:01:09+00:00
broader: Tiro a segno
broad match: http://cv.iptc.org/newscodes/mediatopic/20001051

Fossa olimpica
type: Concept
preferred label: fossa olímpica @pt-br
preferred label: トラップ @ja-jp
preferred label: Trap @de
preferred label: fosso olímpico @pt-pt
preferred label: trap @en-gb
preferred label: trampa @es
definition: épreuve de tir sur cible mouvante @fr
definition: Shooting event with moving targets @en-gb
definition: Prova de tiro com alvo móvel. @pt-br
definition: Schießwettkampf mit sich drehenden Zielscheiben. @de
definition: Gara di tiro a segno con bersagli mobili - tiro a piattello
definition: Prueba de tiro con blancos en movimiento @es
definition: 動くターゲットを撃つ射撃競技 @ja-jp
note: nessuno
in scheme: Subject Code
created: 2000-10-30T12:00:00+00:00
modified: 2010-12-15T17:01:09+00:00
broader: Tiro a segno
broad match: http://cv.iptc.org/newscodes/mediatopic/20001054

Tiro a 2 piattelli
type: Concept
preferred label: fossa olímpica dupla @pt-br
preferred label: duplo fosso olímpico @pt-pt
preferred label: ダブルトラップ @ja-jp
preferred label: Double trap @fr
preferred label: double trap @en-gb
preferred label: trampa doble @es
preferred label: Doppeltrap @de
definition: Prova de tiro com dois alvos móveis em simultâneo. @pt-br
definition: Schießwettkampf mit zwei sich drehenden Zielscheiben zur gleichen Zeit. @de
definition: 同時に発射された2つの動くターゲットを撃つ射撃競技 @ja-jp
definition: Prueba de tiro con dos blancos en movimiento, lanzados al mismo tiempo. @es
definition: Shooting event with two moving targets launched at the same time @en-gb
definition: épreuve de tir sur deux cibles mouvantes lancées en même temps @fr
definition: Gara di tiro a segno con due bersagli mobili lanciati contemporaneamente
note: nessuno
in scheme: Subject Code
created: 2000-10-30T12:00:00+00:00
modified: 2010-12-15T17:01:09+00:00
broader: Tiro a segno
broad match: http://cv.iptc.org/newscodes/mediatopic/20001054

skeet
type: Concept
preferred label: スキート @ja-jp
preferred label: Skeet
definition: Prova de tiro com alvos móveis em que os atiradores disparam de diferentes posições. @pt-br
definition: Schießwettkampf mit sich drehenden Zielscheiben, der Wettkämpfer schießt aus verschiedenen Positionen. @de
definition: épreuve de tir sur plateaux @fr
definition: Gara di tiro a segno con bersagli mobili in cui i concorrenti sparano da varie posizioni
definition: Shooting event with moving targets, competitor shoots from a series of positions @en-gb
definition: 各競技者が一連の射台から動く目標を撃つ射撃競技 @ja-jp
definition: Prueba de tiro con blancos en movimiento, en la que los competidores disparan desde diferentes posiciones. @es
note: nessuno
in scheme: Subject Code
created: 2000-10-30T12:00:00+00:00
modified: 2010-12-15T17:01:09+00:00
broader: Tiro a segno
broad match: http://cv.iptc.org/newscodes/mediatopic/20001054

K 90 salto
type: Concept
preferred label: 90-m-Schanze @de
preferred label: K90 jump @en-gb
preferred label: salto k90 @es
preferred label: K90 @fr
preferred label: ノーマルヒル @ja-jp
definition: saut à skis d'un tremplin haut de 90m @fr
definition: Os esquiadores saltam de um trampolim a 70m de altura e devem fazer um salto de 90m em queda livre. @pt-br
definition: 競技者は70mからジャンプし、その得点ポイントより前方である90m以上の飛距離をクリアしなければならない @ja-jp
definition: Wettkämpfer springen von 90 m und müssen mindestens 90 m springen bevor sie Punkte bekommen. @de
definition: Competitors jump from 70m and must clear 90m distance in their jump before scoring points for it @en-gb
definition: Gli sciatori saltano da 70 m e devono raggiungere almeno 90 m di distanza nel loro salto per guadagnare punti
definition: Competidores saltan desde 90 metros en caída libre y tratan de superar la distancia sin intervalo (limpia), para lograr puntaje. @es
note: nessuno
note: typo fixed in Explanation @en-gb
in scheme: Subject Code
created: 2000-10-30T12:00:00+00:00
modified: 2010-12-15T17:01:09+00:00
broader: Salto con gli sci
broad match: http://cv.iptc.org/newscodes/mediatopic/20001061

K 120 salto
type: Concept
preferred label: ラージヒル @ja-jp
preferred label: K120 @fr
preferred label: K120 jump @en-gb
preferred label: salto k120 @es
preferred label: 120-m-Schanze @de
definition: 競技者は90mからジャンプし、その得点ポイントより前方である120m以上の飛距離をクリアしなければならない @ja-jp
definition: Competidores saltan desde 90 metros en caída libre y tratan de superar 120m sin intervalo (limpia), para lograr puntaje. @es
definition: Os esquiadores saltam de um trampolim a 90m de altura e devem fazer um salto de 120m em queda livre. @pt-br
definition: Competitors jump from 90m and must clear 120m distance in their jump before scoring points for it @en-gb
definition: Wettkämpfer springen von 120 m und müssen mindestens 120 m springen bevor sie Punkte bekommen. @de
definition: Gli sciatori saltano da 90 m e devono raggiungere almeno 120 m di distanza nel loro salto per guadagnare punti
definition: saut à skis d'un tremplin haut de 120m @fr
note: nessuno
in scheme: Subject Code
created: 2000-10-30T12:00:00+00:00
modified: 2010-12-15T17:01:09+00:00
broader: Salto con gli sci
broad match: http://cv.iptc.org/newscodes/mediatopic/20001061

K 180
type: Concept
preferred label: K180 (flying jump) @en-gb
preferred label: salto aéreo k180 @es
preferred label: K180 @pt-br
preferred label: フライング @ja-jp
preferred label: 180-m-Schanze (Skifliegen) @de
definition: Gli sciatori saltano da 180 m e devono raggiungere almeno 180 m nel loro salto prima di guadagnare punti
definition: Os esquiadores saltam 180m de altura e devem fazer um salto de 180m em queda livre. @pt-br
definition: Competidores saltan desde 180 metros en caída libre para lograr puntaje. @es
definition: Wettkämpfer springen von 180 m und müssen mindestens 180 m springen bevor sie Punkte bekommen. @de
definition: saut à skis d'un tremplin haut de 180m @fr
definition: 競技者は180mからジャンプし、その得点ポイントより前方である180m以上の飛距離をクリアしなければならない @ja-jp
definition: Competitors jump from 180m and must clear 180m in their jump before scoring points for it @en-gb
note: nessuno
in scheme: Subject Code
created: 2000-10-30T12:00:00+00:00
modified: 2010-12-15T17:01:09+00:00
broader: Salto con gli sci
broad match: http://cv.iptc.org/newscodes/mediatopic/20001061

Slalom gigante
type: Concept
preferred label: 大回転 @ja-jp
preferred label: slalom gigante @pt-br
preferred label: giant slalom @en-gb
preferred label: Slalom géant parallèle @fr
preferred label: Riesenslalom @de
preferred label: slalom gigante. @es
definition: Corrida de velocidade de snowboard paralela, com eliminação direta do adversário. @pt-br
definition: Kopf an Kopf Abfahrtsrennen @de
definition: Discesa testa a testa con eliminazione diretta dell'avversario
definition: éliminer son adversaire direct en descendant plus vite que lui une pente neigeuse jalonnée de portes sur une planche spéciale. @fr
definition: Knock-out head-to-head downhill racing @en-gb
definition: Carrera en velocidad sobre nieve, colina abajo, con eliminación directa del adversario utilizando una tabla especial. @es
definition: 勝ち抜きで対戦する滑降レース @ja-jp
note: nessuno
in scheme: Subject Code
created: 2000-10-30T12:00:00+00:00
modified: 2010-12-15T17:01:09+00:00
broader: Snowboard
broad match: http://cv.iptc.org/newscodes/mediatopic/20001064

Half-pipe
type: Concept
preferred label: halfpipe @pt-pt
preferred label: half-pipe @es
preferred label: ハーフパイプ @ja-jp
preferred label: Half-Pipe @de
definition: Su una pista innevata semicilindrica di 100 m i concorrenti devono eseguire una serie di movimenti che vengono giudicati in base allo stile da cinque giudici
definition: Sobre una pista nevada semi-cilíndrica, de 100m, los competidores deben efectuar una serie de movimientos que cinco jueces evalúan por su estilo. @es
definition: Über einen halb-zylindrischen Schlauch von 100 m müssen die Wettkämpfer eine Serie von Figuren zeigen, deren Stil von 5 Jurymitgliedern bewertet wird. @de
definition: 100mのパイプを半分にしたような斜面を滑りながら行う演技を、5人の審判が判定する @ja-jp
definition: obtenir de 5 juges les meilleures notes possibles en réalisant des figures sur une planche, sur une piste d'une centaine de mètres de long et de forme semi-cylindrique. @fr
definition: *Sobre uma pista nevada semicilíndrica, os **snowboarders** executam uma série de movimentos cujo estilo é avaliado por 5 juízes.* @pt-pt
definition: Over a semi-cylindrical tube of 100m competitors must perform a series of moves that are marked for style by 5 judges @en-gb
note: nessuno
note: typo fixed in Explanation @en-gb
in scheme: Subject Code
created: 2000-10-30T12:00:00+00:00
modified: 2010-12-15T17:01:09+00:00
broader: Snowboard
broad match: http://cv.iptc.org/newscodes/mediatopic/20001064

500 m
type: Concept
preferred label: 500m @fr
preferred label: ５００ｍ @ja-jp
definition: course de patinage de vitesse sur 500 m @fr
definition: Speed skating race over 500m @en-gb
definition: Rennen im Eisschnelllauf über 500 m. @de
definition: 500mスピードスケートレース @ja-jp
definition: Corrida de patinação de velocidade de 500m. @pt-br
definition: Carrera de velocidad de patinaje sobre 500 m @es
definition: Gara di 500 m di pattinaggio di velocità
definition: Corrida de patinagem de velocidade de 500m. @pt-pt
note: nessuno
in scheme: Subject Code
created: 2000-10-30T12:00:00+00:00
modified: 2010-12-15T17:01:09+00:00
broader: Pattinaggio di velocità
broad match: http://cv.iptc.org/newscodes/mediatopic/20001067

1000 m
type: Concept
preferred label: １０００ｍ @ja-jp
preferred label: 1.000 m @es
preferred label: 1000m @fr
definition: Rennen im Eisschnelllauf über 1000 m. @de
definition: course de patinage de vitesse sur 1000 m @fr
definition: Speed skating race over 1000m @en-gb
definition: Gara di 1000 m di pattinaggio di velocità
definition: Corrida de patinação de velocidade de 1000m. @pt-br
definition: Corrida de patinagem de velocidade de 1000m. @pt-pt
definition: 1000mスピードスケートレース @ja-jp
definition: Carrera de velocidad de patinaje sobre 1.000 m @es
note: nessuno
in scheme: Subject Code
created: 2000-10-30T12:00:00+00:00
modified: 2010-12-15T17:01:09+00:00
broader: Pattinaggio di velocità
broad match: http://cv.iptc.org/newscodes/mediatopic/20001067

1500 m
type: Concept
preferred label: １５００ｍ @ja-jp
preferred label: 1.500 m @es
preferred label: 1500m @fr
definition: Corrida de patinagem de velocidade de 1500m. @pt-pt
definition: Rennen im Eisschnelllauf über 1500 m. @de
definition: Corrida de patinação de velocidade de 1500m. @pt-br
definition: Carrera de velocidad de patinaje sobre 1.500 m @es
definition: 1500mスピードスケートレース @ja-jp
definition: Gara di 1500 m di pattinaggio di velocità
definition: Speed skating race over 1500m @en-gb
definition: course de patinage de vitesse sur 1500 m @fr
note: nessuno
in scheme: Subject Code
created: 2000-10-30T12:00:00+00:00
modified: 2010-12-15T17:01:09+00:00
broader: Pattinaggio di velocità
broad match: http://cv.iptc.org/newscodes/mediatopic/20001067

３０００ｍ
type: Concept
preferred label: 3000 m
preferred label: 3.000 m @es
preferred label: 3000m @fr
definition: Carrera de velocidad de patinaje sobre 3.000 m @es
definition: Speed skating race over 3000m @en-gb
definition: Gara di 3000 m di pattinaggio di velocità
definition: course de patinage de vitesse sur 3000 m @fr
definition: Corrida de patinagem de velocidade de 3000m. @pt-pt
definition: Corrida de patinação de velocidade de 3000m. @pt-br
definition: Rennen im Eisschnelllauf über 3000. @de
definition: 3000mスピードスケートレース @ja-jp
note: nessuno
in scheme: Subject Code
created: 2000-10-30T12:00:00+00:00
modified: 2010-12-15T17:01:09+00:00
broader: Pattinaggio di velocità
broad match: http://cv.iptc.org/newscodes/mediatopic/20001067

5000 m
type: Concept
preferred label: ５０００ｍ @ja-jp
preferred label: 5.000 m @es
preferred label: 5000m @fr
definition: Corrida de patinagem de velocidade de 5000m. @pt-pt
definition: 5000mスピードスケートレース @ja-jp
definition: Rennen im Eisschnelllauf über 5000 m. @de
definition: Carrera de velocidad de patinaje sobre 5.000 m @es
definition: course de patinage de vitesse sur 5000 m @fr
definition: Corrida de patinação de velocidade de 5000m. @pt-br
definition: Speed skating race over 5000m @en-gb
definition: Gara di 5000 m di pattinaggio di velocità
note: nessuno
in scheme: Subject Code
created: 2000-10-30T12:00:00+00:00
modified: 2010-12-15T17:01:09+00:00
broader: Pattinaggio di velocità
broad match: http://cv.iptc.org/newscodes/mediatopic/20001067

10000 m
type: Concept
preferred label: １００００ｍ @ja-jp
preferred label: 10.000 m @es
preferred label: 10000m @fr
definition: Speed skating race over 10000m @en-gb
definition: Rennen im Eisschnelllauf über 10000 m. @de
definition: Corrida de patinação de velocidade de 10000m. @pt-br
definition: Carrera de velocidad de patinaje sobre 10.000 m @es
definition: Corrida de patinagem de velocidade de 10000m. @pt-pt
definition: Gara di 10000 m di pattinaggio di velocità
definition: 10000mスピードスケートレース @ja-jp
definition: course de patinage de vitesse sur 10000 m @fr
note: nessuno
in scheme: Subject Code
created: 2000-10-30T12:00:00+00:00
modified: 2010-12-15T17:01:09+00:00
broader: Pattinaggio di velocità
broad match: http://cv.iptc.org/newscodes/mediatopic/20001067

Short Track
type: Concept
preferred label: pista corta @es
preferred label: patinação de pista curta @pt-br
preferred label: Kurzstrecke @de
preferred label: Short-track @en-gb
preferred label: patinagem de pista curta @pt-pt
preferred label: ショートトラック @ja-jp
definition: Course de vitesse 4 concurrents et plus sur une piste de glace de petit périmètre tracée dans une patinoire couverte. L'épreuve se déroule par élimination (séries, demi-finales, finale). @fr
definition: 一つの楕円形のスケートリンクで4人またはそれ以上のスケーターより予選、準決勝、決勝を行い勝者を決定する @ja-jp
definition: Corridas de 4 ou mais patinadores em pista oval de gelo. Provas de qualificação, semifinais e finais determinam os vencedores. @pt-br
definition: Races of four or more skaters on an oval ice track. Qualifying, semi-finals and finals determine winners. @en-gb
definition: Carrera de cuatro o más patinadores sobre una pista ovalada de hielo. Rondas de clasificaciones, semifinales y finales, determinan los ganadores. @es
definition: Rennen von vier oder mehr Läufern auf einer ovalen Eisbahn. Qualifiziert Gewinner für das Halbfinale und das Finale. @de
definition: Corse su ghiaccio di quattro o più pattinatori su una pista ovale. Il vincitore si determina attraverso qualificazione, semi-finali e finali
note: nessuno
note: typo fixed in Explanation @en-gb
in scheme: Subject Code
created: 2000-10-30T12:00:00+00:00
modified: 2010-12-15T17:01:09+00:00
broader: Pattinaggio di velocità
broad match: http://cv.iptc.org/newscodes/mediatopic/20001067

Short track 500 m
type: Concept
preferred label: 500 m @pt-br
preferred label: st 500 m @es
preferred label: ５００ｍ @ja-jp
preferred label: st500m @fr
definition: Corrida de patinação de pista curta de 500m. @pt-br
definition: 500mショートトラックスケートレース @ja-jp
definition: Short track speed skate race over 500m @en-gb
definition: course de short track sur 500m @fr
definition: Carrera corta de velocidad de patinaje sobre 500 m @es
definition: Corrida de patinagem de pista curta de 500m. @pt-pt
definition: Gara di pattinaggio dove un certo numero di pattinatori (solitamente da 4 a 6) pattinano contemporaneamente su una breve pista al coperto (111 m).
definition: Kurzstrecken Rennen über 500 m. @de
note: nessuno
in scheme: Subject Code
created: 2000-10-30T12:00:00+00:00
modified: 2010-12-15T17:01:09+00:00
broader: Pattinaggio di velocità
broad match: http://cv.iptc.org/newscodes/mediatopic/20001067

Short track 1000 m
type: Concept
preferred label: st 1000m @en-gb
preferred label: 1000 m @pt-pt
preferred label: st 1000 m @de
preferred label: st1000m @fr
preferred label: st 1.000m @es
preferred label: １０００ｍ @ja-jp
definition: Corrida de patinagem de pista curta de 1000m. @pt-pt
definition: Short track speed skate race over 1000m @en-gb
definition: Gara di pattinaggio dove un certo numero di pattinatori (solitamente da 4 a 6) pattinano contemporaneamente su una breve pista al coperto (111 m).
definition: Corrida de patinação de pista curta de 1000m. @pt-br
definition: 1000mショートトラックスケートレース @ja-jp
definition: course de short track sur 1000m @fr
definition: Carrera corta de velocidad de patinaje sobre 1.000 m @es
definition: Kurzstrecken Rennen über 1000 m. @de
note: nessuno
in scheme: Subject Code
created: 2000-10-30T12:00:00+00:00
modified: 2010-12-15T17:01:09+00:00
broader: Pattinaggio di velocità
broad match: http://cv.iptc.org/newscodes/mediatopic/20001067

Short track 1500 m
type: Concept
preferred label: 1500 m @pt-pt
preferred label: st 1.500m @es
preferred label: st 1500m @en-gb
preferred label: １５００ｍ @ja-jp
preferred label: st1500m @fr
preferred label: st 1500 m @de
definition: Corrida de patinação de pista curta de 1500m. @pt-br
definition: Corrida de patinagem de pista curta de 1500m. @pt-pt
definition: Carrera corta de velocidad de patinaje sobre 1.500 m @es
definition: course de short track sur 1500m @fr
definition: Gara di pattinaggio dove un certo numero di pattinatori (solitamente da 4 a 6) pattinano contemporaneamente su una breve pista al coperto (111 m).
definition: Short track speed skate race over 1500m @en-gb
definition: 1500mショートトラックスケートレース @ja-jp
definition: Kurzstrecken Rennen über 1500 m. @de
note: nessuno
in scheme: Subject Code
created: 2000-10-30T12:00:00+00:00
modified: 2010-12-15T17:01:09+00:00
broader: Pattinaggio di velocità
broad match: http://cv.iptc.org/newscodes/mediatopic/20001067

Short track 3000 m
type: Concept
preferred label: st 3000 m @de
preferred label: st 3000m @en-gb
preferred label: st3000m @fr
preferred label: ３０００ｍ @ja-jp
preferred label: st 3.000m @es
preferred label: 3000 m @pt-pt
definition: 3000mショートトラックスケートレース @ja-jp
definition: SGara di pattinaggio dove un certo numero di pattinatori (solitamente da 4 a 6) pattinano contemporaneamente su una breve pista al coperto (111 m).
definition: course de short track sur 3000m @fr
definition: Short track speed skate race over 3000m @en-gb
definition: Corrida de patinagem de pista curta de 3000m. @pt-pt
definition: Kurzstrecken Rennen über 3000 m. @de
definition: Carrera corta de velocidad de patinaje sobre 3.000 m @es
definition: Corrida de patinação de pista curta de 3000m. @pt-br
note: nessuno
in scheme: Subject Code
created: 2000-10-30T12:00:00+00:00
modified: 2010-12-15T17:01:09+00:00
broader: Pattinaggio di velocità
broad match: http://cv.iptc.org/newscodes/mediatopic/20001067

Short track 3000 m staffetta
type: Concept
preferred label: st 3000m relais @fr
preferred label: 3000 m revezamento @pt-br
preferred label: 3000 m estafetas @pt-pt
preferred label: st 3000m relay @en-gb
preferred label: st 3000 m Staffel @de
preferred label: st 3.000m relevos @es
preferred label: ３０００ｍリレー @ja-jp
definition: Carrera corta de velocidad de patinaje con relevos sobre 3.000 m @es
definition: 4 atleti, che si danno il cambio ogni giro e mezzo (circa 167 metri), mentre gli ultimi due giri vengono percorsi da uno stesso pattinatore. Il cambio si esegue spingendo il proprio compagno, che entra in pista dalla parte interna della stessa.
definition: course relais de short track sur 3000m @fr
definition: Corrida de patinagem de pista curta de 3000m com estafetas. @pt-pt
definition: 3000mリレーショートトラックスケートレース @ja-jp
definition: Short track relay speed skate race over 3000m @en-gb
definition: Kurzstrecken Rennen in der Staffel über 3000 m. @de
definition: Corrida de patinação de pista curta de 3000m com revezamento. @pt-br
note: nessuno
in scheme: Subject Code
created: 2000-10-30T12:00:00+00:00
modified: 2010-12-15T17:01:09+00:00
broader: Pattinaggio di velocità
broad match: http://cv.iptc.org/newscodes/mediatopic/20001067

Short track 5000 m
type: Concept
preferred label: st 5.000m @es
preferred label: 5000 m @pt-br
preferred label: st 5000 m @de
preferred label: ５０００ｍ @ja-jp
preferred label: st 5000m @en-gb
preferred label: st5000m @fr
definition: course de short track sur 5000m @fr
definition: Gara di pattinaggio dove un certo numero di pattinatori (solitamente da 4 a 6) pattinano contemporaneamente su una breve pista al coperto (111 m).
definition: Corrida de patinagem de pista curta de 5000m. @pt-pt
definition: 5000mショートトラックスケートレース @ja-jp
definition: Kurzstrecken Rennen über 5000 m. @de
definition: Short track speed skate race over 5000m @en-gb
definition: Carrera corta de velocidad de patinaje sobre 5.000 m @es
definition: Corrida de patinação de pista curta de 5000m. @pt-br
note: nessuno
in scheme: Subject Code
created: 2000-10-30T12:00:00+00:00
modified: 2010-12-15T17:01:09+00:00
broader: Pattinaggio di velocità
broad match: http://cv.iptc.org/newscodes/mediatopic/20001067

Short track 5000 m staffetta
type: Concept
preferred label: ５０００ｍリレー @ja-jp
preferred label: st 5.000m relevos @es
preferred label: st 5000m relay @en-gb
preferred label: 5000 m estafetas @pt-pt
preferred label: 5000 m revezamento @pt-br
preferred label: st 5000m relais @fr
preferred label: st 5000 m Staffel @de
definition: Corrida de patinação de pista curta de 5000m com revezamento. @pt-br
definition: Short track relay speed skate race over 5000m @en-gb
definition: Kurzstrecken Rennen in der Staffel über 5000 m. @de
definition: Corrida de patinagem de pista curta de 5000m com estafetas. @pt-pt
definition: course relais de short track sur 5000m @fr
definition: 5000mリレーショートトラックスケートレース @ja-jp
definition: 4 atleti, che si danno il cambio ogni giro e mezzo (circa 167 metri), mentre gli ultimi due giri vengono percorsi da uno stesso pattinatore. Il cambio si esegue spingendo il proprio compagno, che entra in pista dalla parte interna della stessa.
definition: Carrera corta de velocidad de patinaje con relevos sobre 5.000 m @es
note: nessuno
in scheme: Subject Code
created: 2000-10-30T12:00:00+00:00
modified: 2010-12-15T17:01:09+00:00
broader: Pattinaggio di velocità
broad match: http://cv.iptc.org/newscodes/mediatopic/20001067

IOC
type: Concept
preferred label: COI @pt-pt
preferred label: ＩＯＣ @ja-jp
preferred label: CIO @fr
preferred label: coi @es
definition: Comité Olímpico Internacional @es
definition: Comitato Olimpionico Internazionale
definition: Internationales Olympisches Komitee. @de
definition: Comité International Olympique @fr
definition: International Olympic Committee @en-gb
definition: Comitê Olímpico Internacional @pt-br
definition: 国際オリンピック委員会 @ja-jp
note: nessuno
in scheme: Subject Code
created: 2000-10-30T12:00:00+00:00
modified: 2010-12-15T17:01:09+00:00
broader: Organizzazioni sportive
broad match: http://cv.iptc.org/newscodes/mediatopic/20001125

Federazione Internazionale
type: Concept
preferred label: Internationale Förderation @de
preferred label: federações internacionais @pt-pt
preferred label: fi @es
preferred label: Fédération internationale @fr
preferred label: 国際競技連盟 @ja-jp
preferred label: international federation @en-gb
definition: Fédération responsable de la coordination internationale d'un sport en particulier @fr
definition: Órgão responsável pela coordenação internacional de um esporte específico. @pt-br
definition: Un ente responsabile del coordinamento internazionale di uno specifico sport
definition: Ein Gremium, das verantwortlich ist für die internationale Koordination eines spezifischen Sports. @de
definition: A body responsible for the international coordination of a specific sport @en-gb
definition: Órgão responsável pela coordenação internacional de um desporto específico. @pt-pt
definition: Federación Internacional @es
definition: 特定スポーツの国際的な調整に責任を負う組織 @ja-jp
note: nessuno
in scheme: Subject Code
created: 2000-10-30T12:00:00+00:00
modified: 2010-12-15T17:01:09+00:00
broader: Organizzazioni sportive
broad match: http://cv.iptc.org/newscodes/mediatopic/20001125

Federazione continentale
type: Concept
preferred label: Europäische Förderation @de
preferred label: fc @es
preferred label: confederações continentais @pt-br
preferred label: Fédération continentale @fr
preferred label: 大陸競技連盟 @ja-jp
preferred label: continental federation @en-gb
definition: Fédération responsable de la coordination continentale d'un sport en particulier @fr
definition: Órgão responsável pela coordenação continental de um desporto específico. @pt-pt
definition: Órgão responsável pela coordenação continental de um esporte específico. @pt-br
definition: Ein Gremium, das verantwortlich ist für die kontinentale Koordination eines spezifischen Sports. @de
definition: Federación Continental @es
definition: A body responsible for the continental coordination of a specific sport @en-gb
definition: 特定スポーツの大陸的な調整に責任を負う組織 @ja-jp
definition: Un ente responsabile per il coordinamento continentale di uno sport in particolare
note: nessuno
in scheme: Subject Code
created: 2000-10-30T12:00:00+00:00
modified: 2010-12-15T17:01:09+00:00
broader: Organizzazioni sportive
broad match: http://cv.iptc.org/newscodes/mediatopic/20001125

Federazione nazionale
type: Concept
preferred label: fn @es
preferred label: Fédération nationale @fr
preferred label: federações nacionais @pt-pt
preferred label: national federation @en-gb
preferred label: 国内競技連盟 @ja-jp
preferred label: Nationale Förderation @de
definition: A body responsible for the national coordination of a specific sport @en-gb
definition: Ein Gremium, das verantwortlich ist für die nationale Koordination eines spezifischen Sports. @de
definition: Federación Nacional @es
definition: Órgão responsável pela coordenação nacional de um esporte específico. @pt-br
definition: Un ente responsabile del coordinamento nazionale di uno specifico sport
definition: Órgão responsável pela coordenação nacional de um desporto específico. @pt-pt
definition: Fédération responsable de la coordination nationale d'un sport en particulier @fr
definition: 特定スポーツの国内的な調整に責任を負う組織 @ja-jp
note: nessuno
in scheme: Subject Code
created: 2000-10-30T12:00:00+00:00
modified: 2010-12-15T17:01:09+00:00
broader: Organizzazioni sportive
broad match: http://cv.iptc.org/newscodes/mediatopic/20001125

GAISF
type: Concept
preferred label: 国際競技連盟連合 @ja-jp
preferred label: AGFIS @fr
preferred label: agfdi @es
definition: Associação Geral das Federações Desportivas Internacionais @pt-pt
definition: Associação Geral das Federações Esportivas Internacionais @pt-br
definition: Dachverband der Internationalen Sportgremien. @de
definition: Asociación General de Federaciones Deportivas Internacionales. @es
definition: Associazione Generale delle Federazioni Sportive Internazionali
definition: Association Générale des Fédérations Internationales de Sports @fr
definition: 国際スポーツ団体総連合 @ja-jp
definition: General Association of International Sports Federations @en-gb
note: nessuno
in scheme: Subject Code
created: 2000-10-30T12:00:00+00:00
modified: 2010-12-15T17:01:09+00:00
broader: Organizzazioni sportive
broad match: http://cv.iptc.org/newscodes/mediatopic/20001125

50 m sl
type: Concept
preferred label: 50 m freestyle @en-gb
preferred label: 50 m livres @pt-pt
preferred label: 50m libre @es
preferred label: 50 m libre @fr
preferred label: ５０ｍ自由形 @ja-jp
preferred label: 50 m Freistil @de
preferred label: 50 m livre @pt-br
definition: Os nadadores nadam 50m em qualquer estilo, embora o nado crawl seja o estilo mais usado. @pt-br
definition: Wettkämpfer schwimmen 50 m egal in welchem Stil, wobei meist das Kraulschwimmen bevorzugt wird. @de
definition: Competidores cubren a nado 50 metros en cualquier estilo, aunque *crawl* es el universalmente más empleado. @es
definition: I nuotatori coprono 50 metri in stile libero
definition: longueur à parcourir dans n'importe quel style de nage @fr
definition: Os nadadores nadam 50m em qualquer estilo, embora o crawl seja o estilo mais usado. @pt-pt
definition: Competitors cover 50m in any style, though front crawl is universally employed @en-gb
definition: 競泳者は自由な泳法で50mを泳ぐ。通常クロール泳法を選ぶ @ja-jp
note: nessuno
in scheme: Subject Code
created: 2000-10-30T12:00:00+00:00
modified: 2010-12-15T17:01:09+00:00
broader: Nuoto
broad match: http://cv.iptc.org/newscodes/mediatopic/20001071

100 m sl
type: Concept
preferred label: １００ｍ自由形 @ja-jp
preferred label: 100 m livre @pt-br
preferred label: 100 m Freistil @de
preferred label: 100 m livres @pt-pt
preferred label: 100 m libre @fr
preferred label: 100m libre @es
preferred label: 100 m freestyle @en-gb
definition: I concorrenti coprono 100 m in stile libero
definition: 競泳者は自由な泳法で100mを泳ぐ。通常クロール泳法を選ぶ @ja-jp
definition: Wettkämpfer schwimmen 100 m egal in welchem Stil, wobei meist das Kraulschwimmen bevorzugt wird. @de
definition: longueur à parcourir dans n'importe quel style de nage @fr
definition: Os nadadores nadam 100m em qualquer estilo, embora o nado crawl seja o estilo mais usado. @pt-br
definition: Os nadadores nadam 100m em qualquer estilo, embora o crawl seja o estilo mais usado. @pt-pt
definition: Competidores cubren a nado 100 metros en cualquier estilo, aunque *crawl* es el universalmente más empleado. @es
definition: Competitors cover 100m in any style, though front crawl is universally employed @en-gb
note: nessuno
in scheme: Subject Code
created: 2000-10-30T12:00:00+00:00
modified: 2010-12-15T17:01:09+00:00
broader: Nuoto
broad match: http://cv.iptc.org/newscodes/mediatopic/20001071

200 m sl
type: Concept
preferred label: ２００ｍ自由形 @ja-jp
preferred label: 200 m livre @pt-br
preferred label: 200 m libre @fr
preferred label: 200 m livres @pt-pt
preferred label: 200 m freestyle @en-gb
preferred label: 200m libre @es
preferred label: 200 m Freistil @de
definition: 競泳者は自由な泳法で200mを泳ぐ。通常クロール泳法を選ぶ @ja-jp
definition: Wettkämpfer schwimmen 200 m egal in welchem Stil, wobei meist das Kraulschwimmen bevorzugt wird. @de
definition: Competitors cover 200m in any style, though front crawl is universally employed @en-gb
definition: Os nadadores nadam 200m em qualquer estilo, embora o crawl seja o estilo mais usado. @pt-pt
definition: Os nadadores nadam 200m em qualquer estilo, embora o nado crawl seja o estilo mais usado. @pt-br
definition: I concorrenti coprono 200 m in stile libero
definition: longueur à parcourir dans n'importe quel style de nage @fr
definition: Competidores cubren a nado 200 metros en cualquier estilo, aunque *crawl* es el universalmente más empleado. @es
note: nessuno
in scheme: Subject Code
created: 2000-10-30T12:00:00+00:00
modified: 2010-12-15T17:01:09+00:00
broader: Nuoto
broad match: http://cv.iptc.org/newscodes/mediatopic/20001071

400 m sl
type: Concept
preferred label: 400m libre @es
preferred label: 400 m Freistil @de
preferred label: 400 m livre @pt-br
preferred label: 400 m libre @fr
preferred label: 400 m freestyle @en-gb
preferred label: 400 m livres @pt-pt
preferred label: ４００ｍ自由形 @ja-jp
definition: longueur à parcourir dans n'importe quel style de nage @fr
definition: Competidores cubren a nado 400 metros en cualquier estilo, aunque *crawl* es el universalmente más empleado. @es
definition: Os nadadores nadam 400m em qualquer estilo, embora o crawl seja o estilo mais usado. @pt-pt
definition: Wettkämpfer schwimmen 400 m egal in welchem Stil, wobei meist das Kraulschwimmen bevorzugt wird. @de
definition: 競泳者は自由な泳法で400mを泳ぐ。通常クロール泳法を選ぶ @ja-jp
definition: Os nadadores nadam 400m em qualquer estilo, embora o nado crawl seja o estilo mais usado. @pt-br
definition: I concorrenti coprono 400 m in stile libero
definition: Competitors cover 400m in any style, though front crawl is universally employed @en-gb
note: nessuno
in scheme: Subject Code
created: 2000-10-30T12:00:00+00:00
modified: 2010-12-15T17:01:09+00:00
broader: Nuoto
broad match: http://cv.iptc.org/newscodes/mediatopic/20001071

800 m sl
type: Concept
preferred label: 800m libre @es
preferred label: ８００ｍ自由形 @ja-jp
preferred label: 800 m livres @pt-pt
preferred label: 800 m libre @fr
preferred label: 800 m livre @pt-br
preferred label: 800 m freestyle @en-gb
preferred label: 800 m Freistil @de
definition: Os nadadores nadam 800m em qualquer estilo, embora o nado crawl seja o estilo mais usado. @pt-br
definition: Wettkämpfer schwimmen 800 m egal in welchem Stil, wobei meist das Kraulschwimmen bevorzugt wird. @de
definition: I concorrenti coprono 800 m in stile libero
definition: longueur à parcourir dans n'importe quel style de nage @fr
definition: Os nadadores nadam 800m em qualquer estilo, embora o crawl seja o estilo mais usado. @pt-pt
definition: Competidores cubren a nado 800 metros en cualquier estilo, aunque *crawl* es el universalmente más empleado. @es
definition: 競泳者は自由な泳法で800mを泳ぐ。通常クロール泳法を選ぶ @ja-jp
definition: Competitors cover 800m in any style, though front crawl is universally employed @en-gb
note: nessuno
in scheme: Subject Code
created: 2000-10-30T12:00:00+00:00
modified: 2010-12-15T17:01:09+00:00
broader: Nuoto
broad match: http://cv.iptc.org/newscodes/mediatopic/20001071

1500 m sl
type: Concept
preferred label: 1500 m freestyle @en-gb
preferred label: 1500 m Freistil @de
preferred label: 1.500m libre @es
preferred label: 1500 m livre @pt-br
preferred label: １５００ｍ自由形 @ja-jp
preferred label: 1500 m livres @pt-pt
preferred label: 1500 m libre @fr
definition: Competidores cubren a nado 1.500 metros en cualquier estilo, aunque *crawl* es universalmente más empleado. @es
definition: I concorrenti coprono 1500 m in stile libero
definition: Os nadadores nadam 1500m em qualquer estilo, embora o nado crawl seja o estilo mais usado. @pt-br
definition: longueur à parcourir dans n'importe quel style de nage @fr
definition: Os nadadores nadam 1500m em qualquer estilo, embora o crawl seja o estilo mais usado. @pt-pt
definition: Competitors cover 1500m in any style, though front crawl is universally employed @en-gb
definition: Wettkämpfer schwimmen 1500 m egal in welchem Stil, wobei meist das Kraulschwimmen bevorzugt wird. @de
definition: 競泳者は自由な泳法で1500mを泳ぐ。通常クロール泳法を選ぶ @ja-jp
note: nessuno
in scheme: Subject Code
created: 2000-10-30T12:00:00+00:00
modified: 2010-12-15T17:01:09+00:00
broader: Nuoto
broad match: http://cv.iptc.org/newscodes/mediatopic/20001071

4 x 50 m sl
type: Concept
preferred label: ２００ｍリレー @ja-jp
preferred label: relevo 4 x 50 metros libre @es
preferred label: Staffel 4x50 m Freistil @de
preferred label: Relais 4x50 m libre @fr
preferred label: 4x50 m livres @pt-pt
preferred label: relay 4x50 m freestyle @en-gb
preferred label: 4x50 m livre @pt-br
definition: Teams mit 4 Schwimmern legen je 50 m Freistil zurück über eine 200 m Strecke. @de
definition: Equipos de cuatro nadadores cubren 50 metros libre cada uno, en una carrera de 200 metros. @es
definition: 4人競泳者のチームが、各50mを分担する自由形200mレース @ja-jp
definition: Equipas de 4 nadadores nadam 50m livres em corrida de 200m. @pt-pt
definition: relais de quatre nageurs devant parcourir la longueur en utilisant n'importe quel style de nage @fr
definition: Teams of four swimmers cover 50m freestyle in a 200m race @en-gb
definition: Squadre di quattro nuotatori che coprono 50 m ciascuno in stile libero in una gara di 200 m
definition: Equipes de 4 nadadores nadam 50m de nado livre em corrida de 200m. @pt-br
note: nessuno
in scheme: Subject Code
created: 2000-10-30T12:00:00+00:00
modified: 2010-12-15T17:01:09+00:00
broader: Nuoto
broad match: http://cv.iptc.org/newscodes/mediatopic/20001071

4 x 100 m sl
type: Concept
preferred label: relay 4x100 m freestyle @en-gb
preferred label: Staffel 4x100 m Freistil @de
preferred label: ４００ｍリレー @ja-jp
preferred label: Relais 4x100 m libre @fr
preferred label: 4x100 m livres @pt-pt
preferred label: 4x100 m livre @pt-br
preferred label: relevo 4 x 100 metros libre @es
definition: Equipas de 4 nadadores nadam 100m livres em corrida de 400m. @pt-pt
definition: Teams of four swimmers cover 100m freestyle in a 400m race @en-gb
definition: Equipos de cuatro nadadores cubren 100 metros libre cada uno, en una carrera de 400 metros. @es
definition: Equipes de 4 nadadores nadam 100m de nado livre em corrida de 400m. @pt-br
definition: Squadre di quattro nuotatori che coprono ciascuno 100 m in stile libero in una gara di 400 m
definition: Teams mit 4 Schwimmern legen je 100 m Freistil zurück über eine 400 m Strecke. @de
definition: 4人競泳者のチームが、各100mを分担する自由形400mレース @ja-jp
definition: relais de quatre nageurs devant parcourir la longueur en utilisant n'importe quel style de nage @fr
note: nessuno
in scheme: Subject Code
created: 2000-10-30T12:00:00+00:00
modified: 2010-12-15T17:01:09+00:00
broader: Nuoto
broad match: http://cv.iptc.org/newscodes/mediatopic/20001071

libero 4 x 200 m sl
type: Concept
preferred label: relay 4x200 m freestyle @en-gb
preferred label: ８００ｍリレー @ja-jp
preferred label: Relais 4x200 m libre @fr
preferred label: 4x200 m livres @pt-pt
preferred label: 4x200 m livre @pt-br
preferred label: relevo 4 x 200 metros libre @es
preferred label: Staffel 4x200 m Freistil @de
definition: relais de quatre nageurs devant parcourir la longueur en utilisant n'importe quel style de nage @fr
definition: Teams of four swimmers cover 200m freestyle in a 800m race @en-gb
definition: 4人競泳者のチームが、各200mを分担する自由形800mレース @ja-jp
definition: Equipes de 4 nadadores nadam 200m de nado livre em corrida de 800m. @pt-br
definition: Squadre di quattro nuotatori che coprono ciascuno 200 m in stile libero in una gara di 800 m
definition: Teams mit 4 Schwimmern legen je 200 m Freistil zurück über eine 800 m Strecke. @de
definition: Equipas de 4 nadadores nadam 200m livres em corrida de 800m. @pt-pt
definition: Equipos de cuatro nadadores cubren 200 metros libre cada uno, en una carrera de 800 metros. @es
note: nessuno
in scheme: Subject Code
created: 2000-10-30T12:00:00+00:00
modified: 2010-12-15T17:01:09+00:00
broader: Nuoto
broad match: http://cv.iptc.org/newscodes/mediatopic/20001071

50 m dorso
type: Concept
preferred label: 50 m costas @pt-br
preferred label: 50 m Rückenschwimmen @de
preferred label: ５０ｍ背泳ぎ @ja-jp
preferred label: 50m dos @fr
preferred label: 50m espalda @es
preferred label: 50 m backstroke @en-gb
definition: longueur à parcourir en nageant sur le dos @fr
definition: Competidores cubren 50 metros estilo espalda. @es
definition: Os nadadores nadam 50m de costas. @pt-pt
definition: 競泳者は背泳で50mを泳ぐ @ja-jp
definition: I concorrenti coprono 50 m in stile dorso
definition: Wettkämpfer legen 50 m im Rückenschwimmen zurück. @de
definition: Competitors cover 50m in the backstroke style @en-gb
note: nessuno
in scheme: Subject Code
created: 2000-10-30T12:00:00+00:00
modified: 2010-12-15T17:01:09+00:00
broader: Nuoto
broad match: http://cv.iptc.org/newscodes/mediatopic/20001071

100 m dorso
type: Concept
preferred label: 100 m costas @pt-pt
preferred label: 100m dos @fr
preferred label: 100 m Rückenschwimmen @de
preferred label: １００ｍ背泳ぎ @ja-jp
preferred label: 100 m backstroke @en-gb
preferred label: 100m espalda @es
definition: Wettkämpfer legen 100 m im Rückenschwimmen zurück. @de
definition: longueur à parcourir en nageant sur le dos @fr
definition: Os nadadores nadam 100m de costas. @pt-br
definition: Competidores cubren 100 metros estilo espalda. @es
definition: I concorrenti coprono 100 m in stile dorso
definition: Competitors cover 100m in the backstroke style @en-gb
definition: 競泳者は背泳で100mを泳ぐ @ja-jp
note: nessuno
in scheme: Subject Code
created: 2000-10-30T12:00:00+00:00
modified: 2010-12-15T17:01:09+00:00
broader: Nuoto
broad match: http://cv.iptc.org/newscodes/mediatopic/20001071

200 m dorso
type: Concept
preferred label: 200m espalda @es
preferred label: 200m dos @fr
preferred label: 200 m costas @pt-pt
preferred label: ２００ｍ背泳ぎ @ja-jp
preferred label: 200 m Rückenschwimmen @de
preferred label: 200 m backstroke @en-gb
definition: I concorrenti coprono 200 m in stile dorso
definition: Wettkämpfer legen 200 m im Rückenschwimmen zurück. @de
definition: longueur à parcourir en nageant sur le dos @fr
definition: Os nadadores nadam 200m de costas. @pt-pt
definition: 競泳者は背泳で200mを泳ぐ @ja-jp
definition: Competidores cubren 200 metros estilo espalda. @es
definition: Competitors cover 200m in the backstroke style @en-gb
note: nessuno
in scheme: Subject Code
created: 2000-10-30T12:00:00+00:00
modified: 2010-12-15T17:01:09+00:00
broader: Nuoto
broad match: http://cv.iptc.org/newscodes/mediatopic/20001071

50 m rana
type: Concept
preferred label: 50m pecho @es
preferred label: 50 m breaststroke @en-gb
preferred label: 50m brasse @fr
preferred label: ５０ｍ平泳ぎ @ja-jp
preferred label: 50 m bruços @pt-pt
preferred label: 50 m Brustschwimmen @de
preferred label: 50 m peito @pt-br
definition: 50 m Strecke im Brustschwimmen. Auf dem Bauch liegend sich vorwärts und außerhalb mit den Armen und rückwärts mit den Beinen bewegend. @de
definition: Una carrera de 50 metros en estilo pecho, realizando movimientos de empuje hacia adelante y atrás con los brazos y hacia atrás y hacia afuera con las piernas @es
definition: Corrida de 50m de nado de peito, em que o nadador realiza movimentos para a frente e para fora com os braços e para trás e para fora com as pernas. @pt-br
definition: 50m平泳ぎレース。水中で腕を前方から外側に押し出したり、脚を外側から後方に蹴り出して前に進む @ja-jp
definition: A 50m race in the breaststroke style, on the front, effecting forward and outward push movements with the arms and backward and outward pushes with the legs @en-gb
definition: Corrida de 50m de bruços, em que o nadador realiza movimentos para a frente e para fora com os braços e para trás e para fora com as pernas. @pt-pt
definition: longueur à parcourir en nageant la brasse: le corps est allongé sur la poitrine. Les mouvements de bras et de jambes doivent être simultanés dans le même plan horizontal et les mains poussées ensemble en avant à partir de la poitrine. @fr
definition: Una gara di 50 m in stile rana, frontale, con movimenti in avanti e indietro con le braccia, e movimenti indietro e in avanti con le gambe
note: nessuno
in scheme: Subject Code
created: 2000-10-30T12:00:00+00:00
modified: 2010-12-15T17:01:09+00:00
broader: Nuoto
broad match: http://cv.iptc.org/newscodes/mediatopic/20001071

100 m rana
type: Concept
preferred label: 100m pecho @es
preferred label: 100 m peito @pt-br
preferred label: 100 m bruços @pt-pt
preferred label: １００ｍ平泳ぎ @ja-jp
preferred label: 100 m Brustschwimmen @de
preferred label: 100 m breaststroke @en-gb
preferred label: 100m brasse @fr
definition: Corrida de 100m de nado de peito, em que o nadador realiza movimentos para a frente e para fora com os braços e para trás e para fora com as pernas. @pt-br
definition: 100 m Strecke im Brustschwimmen. Auf dem Bauch liegend sich vorwärts und außerhalb mit den Armen und rückwärts mit den Beinen bewegend. @de
definition: Una gara di 100 m in stile rana, frontale, con movimenti di spinta in avanti e indietro con le braccia, e con movimenti di spinta in avanti e indietro con le gambe
definition: longueur à parcourir en nageant la brasse: le corps est allongé sur la poitrine. Les mouvements de bras et de jambes doivent être simultanés dans le même plan horizontal et les mains poussées ensemble en avant à partir de la poitrine. @fr
definition: A 100m race in the breaststroke style, on the front, effecting forward and outward push movements with the arms and backward and outward pushes with the legs @en-gb
definition: 100m平泳ぎレース。水中で腕を前方から外側に押し出したり、脚を外側から後方に蹴り出して前に進む @ja-jp
definition: Corrida de 100 de bruços, em que o nadador realiza movimentos para a frente e para fora com os braços e para trás e para fora com as pernas. @pt-pt
definition: Una carrera de 100 metros en estilo pecho, realizando movimientos de empuje hacia adelante y atrás con los brazos y hacia atrás y hacia afuera con las piernas. @es
note: nessuno
in scheme: Subject Code
created: 2000-10-30T12:00:00+00:00
modified: 2010-12-15T17:01:09+00:00
broader: Nuoto
broad match: http://cv.iptc.org/newscodes/mediatopic/20001071

200 m rana
type: Concept
preferred label: 200 m breaststroke @en-gb
preferred label: 200m brasse @fr
preferred label: 200 m Brustschwimmen @de
preferred label: ２００ｍ平泳ぎ @ja-jp
preferred label: 200m pecho @es
preferred label: 200 m bruços @pt-pt
preferred label: 200 m peito @pt-br
definition: longueur à parcourir en nageant la brasse: le corps est allongé sur la poitrine. Les mouvements de bras et de jambes doivent être simultanés dans le même plan horizontal et les mains poussées ensemble en avant à partir de la poitrine. @fr
definition: Corrida de 200m de nado de peito, em que o nadador realiza movimentos para a frente e para fora com os braços e para trás e para fora com as pernas. @pt-br
definition: 200 m Strecke im Brustschwimmen. Auf dem Bauch liegend sich vorwärts und außerhalb mit den Armen und rückwärts mit den Beinen bewegend. @de
definition: Gara di 200 m in stile rana, frontale, con movimenti di spinta in avanti e indietro con le braccia e la schiena, e movimenti di spinta indietro e in avanti con le gambe
definition: Una carrera de 200 metros en estilo pecho, realizando movimientos de empuje hacia adelante y atrás con los brazos y hacia atrás y hacia afuera con las piernas. @es
definition: 200m平泳ぎレース。水中で腕を前方から外側に押し出したり、脚を外側から後方に蹴り出して前に進む @ja-jp
definition: A 200m race in the breaststroke style, on the front, effecting forward and outward push movements with the arms and backward and outward pushes with the legs @en-gb
definition: Corrida de 200 de bruços, em que o nadador realiza movimentos para a frente e para fora com os braços e para trás e para fora com as pernas. @pt-pt
note: nessuno
in scheme: Subject Code
created: 2000-10-30T12:00:00+00:00
modified: 2010-12-15T17:01:09+00:00
broader: Nuoto
broad match: http://cv.iptc.org/newscodes/mediatopic/20001071

50 m farfalla
type: Concept
preferred label: 50 m mariposa @pt-pt
preferred label: 50m mariposa @es
preferred label: 50 m borboleta @pt-br
preferred label: ５０ｍバタフライ @ja-jp
preferred label: 50 m butterfly @en-gb
preferred label: 50m papillon @fr
preferred label: 50 m Schmetterling @de
definition: Corrida de 50m de nado borboleta, em que o nadador mantém os ombros paralelos à água e projeta os braços para fora, como um moinho, com batimentos simultâneos das pernas, que permanecem juntas. É a prova mais exigente. @pt-br
definition: Corrida de 50m de mariposa, em que o nadador mantém os ombros paralelos à água e projeta os braços para fora, como um moinho, com batimentos simultâneos das pernas, que permanecem juntas. É a prova mais exigente. @pt-pt
definition: 正面で肩を水面に平行にしたまま両腕を風車のように動かし、両足を合わせたままフラップ運動のように動かす、50mのバタフライ競争。全ての泳法の中でもっとも肉体的に負担がある @ja-jp
definition: Una carrera de 50 metros mariposa, donde el nadador mantiene los hombros paralelos al agua y mueve los brazos en forma de molino. Las piernas permanecen juntas y se mueven juntas. La más exigente de todas las pruebas. @es
definition: 50 m Strecke Schmetterling. Bauchlage, bei der beide Schultern parallel zum Wasser bleiben und die Arme sich simultan in Schmetterlingsform bewegen. Die Beine werden zusammengehalten und flossenartig bewegt. Der kraftaufwendigste aller Schwimmstile. @de
definition: longueur à parcourir en nageant la brasse: le corps est allongé sur la poitrine. Les mouvements de bras et de jambes doivent être simultanés dans le même plan horizontal et les mains poussées ensemble en avant à partir de la poitrine. @fr
definition: Una gara di 50 m in stile farfalla, di nuoto frontale con le spalle parallele all'acqua ed entrambe le braccia si muovono simultaneamente come un mulino mentre le gambe restano unite in un movimento di spinta verso il basso e poi verso l'alto
definition: A 50m butterfly race, swum on the front with the shoulders remaining parallel to the water both arms moving in simultaneous windmill fashion, the legs remain together and are moved in a flapping motion. The most physical of all styles. @en-gb
note: nessuno
in scheme: Subject Code
created: 2000-10-30T12:00:00+00:00
modified: 2010-12-15T17:01:09+00:00
broader: Nuoto
broad match: http://cv.iptc.org/newscodes/mediatopic/20001071

100 m farfalla
type: Concept
preferred label: １００ｍバタフライ @ja-jp
preferred label: 100 m Schmetterling @de
preferred label: 100 m butterfly @en-gb
preferred label: 100 m borboleta @pt-br
preferred label: 100 m mariposa @pt-pt
preferred label: 100m papillon @fr
preferred label: 100m mariposa @es
definition: Corrida de 100m de mariposa, em que o nadador mantém os ombros paralelos à água e projeta os braços para fora, como um moinho, com batimentos simultâneos das pernas, que permanecem juntas. É a prova mais exigente. @pt-pt
definition: 正面で肩を水面に平行にしたまま両腕を風車のように動かし、両足を合わせたままフラップ運動のように動かす、100mのバタフライ競争。全ての泳法の中でもっとも肉体的に負担がある @ja-jp
definition: Corrida de 100m de nado borboleta, em que o nadador mantém os ombros paralelos à água e projeta os braços para fora, como um moinho, com batimentos simultâneos das pernas, que permanecem juntas. É a prova mais exigente. @pt-br
definition: A 100m butterfly race, swum on the front with the shoulders remaining parallel to the water both arms moving in simultaneous windmill fashion, the legs remain together and are moved in a flapping motion. The most physical of all styles @en-gb
definition: Una gara di 100 m in stile farfalla, nuotando frontalmente con le spalle tenute parallele all'acqua ed entrambe le braccia si muovono simultaneamente come un mulino, le gambe restano unite in un movimento di spinta verso il basso e poi verso l'alto.
definition: longueur à parcourir en nage papillon: le corps doit être allongé sur la poitrine, les épaules parallèles à la surface. Les bras doivent être amenés en avant ensemble au-dessus de l'eau et ramenés en arrière en même temps de même que les pieds. @fr
definition: Una carrera de 100 metros mariposa, donde el nadador mantiene los hombros paralelos al agua y mueve los brazos en forma de molino. Las piernas permanecen juntas y se mueven juntas. La más exigente de todas las modalidades. @es
definition: 100 m Strecke Schmetterling. Bauchlage, bei der beide Schultern parallel zum Wasser bleiben und die Arme sich simultan in Schmetterlingsform bewegen. Die Beine werden zusammengehalten und flossenartig bewegt. Der kraftaufwendigste aller Schwimmstile. @de
note: nessuno
in scheme: Subject Code
created: 2000-10-30T12:00:00+00:00
modified: 2010-12-15T17:01:09+00:00
broader: Nuoto
broad match: http://cv.iptc.org/newscodes/mediatopic/20001071

200 m farfalla
type: Concept
preferred label: 200 m borboleta @pt-br
preferred label: 200m Schmetterling @de
preferred label: ２００ｍバタフライ @ja-jp
preferred label: 200 m mariposa @pt-pt
preferred label: 200 m butterfly @en-gb
preferred label: 200m mariposa @es
preferred label: 200 m papillon @fr
definition: Una gara di 200 m in stile farfalla, nuotando frontalmente mantenendo le spalle parallele all'acqua e con entrambe le braccia che si muovono simultaneamente come un mulino a vento, le gambe restano unite in un movimento di spinta verso il basso e verso l'alto
definition: Corrida de 200m de nado borboleta, em que o nadador mantém os ombros paralelos à água e projeta os braços para fora, como um moinho, com batimentos simultâneos das pernas, que permanecem juntas. É a prova mais exigente. @pt-br
definition: A 200m butterfly race, swum on the front with the shoulders remaining parallel to the water both arms moving in simultaneous windmill fashion, the legs remain together and are moved in a flapping motion. The most physical of all styles @en-gb
definition: 正面で肩を水面に平行にしたまま両腕を風車のように動かし、両足を合わせたままフラップ運動のように動かす、200mのバタフライ競争。全ての泳法の中でもっとも肉体的に負担がある @ja-jp
definition: Una carrera de 200 metros mariposa, donde el nadador mantiene los hombros paralelos al agua y mueve los brazos en forma de molino. Las piernas permanecen juntas y se mueven juntas. La más exigente de todas las modalidades. @es
definition: 200 m Strecke Schmetterling. Bauchlage, bei der beide Schultern parallel zum Wasser bleiben und die Arme sich simultan in Schmetterlingsform bewegen. Die Beine werden zusammengehalten und flossenartig bewegt. Der kraftaufwendigste aller Schwimmstile. @de
definition: longueur à parcourir en nage papillon: le corps doit être allongé sur la poitrine, les épaules parallèles à la surface. Les bras doivent être amenés en avant ensemble au-dessus de l'eau et ramenés en arrière en même temps de même que les pieds. @fr
definition: Corrida de 200m de mariposa, em que o nadador mantém os ombros paralelos à água e projeta os braços para fora, como um moinho, com batimentos simultâneos das pernas, que permanecem juntas. É a prova mais exigente. @pt-pt
note: nessuno
in scheme: Subject Code
created: 2000-10-30T12:00:00+00:00
modified: 2010-12-15T17:01:09+00:00
broader: Nuoto
broad match: http://cv.iptc.org/newscodes/mediatopic/20001071

100 m Misti (individuale)
type: Concept
preferred label: 100 m medley @en-gb
preferred label: １００ｍ個人メドレー @ja-jp
preferred label: 100 m 4 nages @fr
preferred label: 100 m Lagen @de
preferred label: 100 m estilos @pt-pt
preferred label: 100m combinados @es
definition: Swimmers complete four laps, each in a different style and in this order: butterfly, backstroke, breaststroke and freestyle, covering a total of 100m. @en-gb
definition: 水泳競技でラップ毎に異なるスタイルのバタフライ、背泳、平泳ぎ、自由形の順で100mを完泳する @ja-jp
definition: Los nadadores completan cuatro recorridos en diferentes estilos y en el siguiente orden: mariposa, espalda, pecho y libre, cubriendo un total de 100 metros. @es
definition: I nuotatori completano quattro giri con quattro stili in questo ordine: farfalla, dorso, rana e in stile libero, per un totale di 100 m
definition: le nageur parcourt la longeur en utilisant les 4 styles dans l'ordre suivant : papillon, dos, brasse et libre. @fr
definition: Corrida em que os nadadores completam 4 voltas, cada uma com um estilo diferente, por esta ordem: nado borboleta, costas, peito e livre, no total de 100m . @pt-br
definition: Schwimmer legen in vier Runden 100 m zurück, jede davon in einem anderen Stil in der folgenden Reihenfolge: Schmetterling, Rücken, Brust und Freistil. @de
definition: Corrida em que os nadadores completam 4 voltas, cada uma com um estilo diferente, por esta ordem: mariposa, costas, bruços e livre, no total de 100m. @pt-pt
note: nessuno
in scheme: Subject Code
created: 2000-10-30T12:00:00+00:00
modified: 2010-12-15T17:01:09+00:00
broader: Nuoto
broad match: http://cv.iptc.org/newscodes/mediatopic/20001071

200 m Misti (individuale)
type: Concept
preferred label: 200 m 4 nages @fr
preferred label: 200 m Lagen @de
preferred label: ２００ｍ個人メドレー @ja-jp
preferred label: 200 m medley @pt-br
preferred label: 200 m estilos @pt-pt
preferred label: 200m combinados @es
definition: Los nadadores completan cuatro recorridos en diferentes estilos y en el siguiente orden: mariposa, espalda, pecho y libre, cubriendo un total de 200 metros. @es
definition: Swimmers complete four laps, each in a different style and in this order: butterfly, backstroke, breaststroke and freestyle, covering a total of 200m. @en-gb
definition: 水泳競技でラップ毎に異なるスタイルのバタフライ、背泳、平泳ぎ、自由形の順で200mを完泳する @ja-jp
definition: le nageur parcourt la longeur en utilisant les 4 styles dans l'ordre suivant : papillon, dos, brasse et libre. @fr
definition: I nuotatori completano quattro vasche, ognuno in uno stile diverso e in quest'ordine: farfalla, dorso, rana e stile libero, per un totale di 200 m
definition: Schwimmer legen in vier Runden 200 m zurück, jede davon in einem anderen Stil in der folgenden Reihenfolge: Schmetterling, Rücken, Brust und Freistil. @de
definition: Corrida em que os nadadores completam 4 voltas, cada uma com um estilo diferente, por esta ordem: mariposa, costas, bruços e livre, no total de 200m. @pt-pt
definition: Corrida em que os nadadores completam 4 voltas, cada uma com um estilo diferente, por esta ordem: nado borboleta, costas, peito e livre, no total de 200m . @pt-br
note: nessuno
in scheme: Subject Code
created: 2000-10-30T12:00:00+00:00
modified: 2010-12-15T17:01:09+00:00
broader: Nuoto
broad match: http://cv.iptc.org/newscodes/mediatopic/20001071

400 m Misti (individuale)
type: Concept
preferred label: ４００ｍ個人メドレー @ja-jp
preferred label: 400 m medley @en-gb
preferred label: 400m combinados @es
preferred label: 400 m Lagen @de
preferred label: 400 m 4 nages @fr
preferred label: 400 m estilos @pt-pt
definition: Schwimmer legen in vier Runden 400 m zurück, jede davon in einem anderen Stil in der folgenden Reihenfolge: Schmetterling, Rücken, Brust und Freistil. @de
definition: Swimmers complete eight laps, two in each style and in this order: butterfly, backstroke, breaststroke and freestyle, covering a total of 400m. @en-gb
definition: Corrida em que os nadadores completam 4 voltas, cada uma com um estilo diferente, por esta ordem: mariposa, costas, bruços e livre, no total de 400m. @pt-pt
definition: I nuotatori completano otto vasche, due per stile e in quest'ordine: farfalla, dorso, rana e stile libero, per un totale di 400 m
definition: Corrida em que os nadadores completam 4 voltas, cada uma com um estilo diferente, por esta ordem: nado borboleta, costas, peito e livre, no total de 400m . @pt-br
definition: Los nadadores completan cuatro recorridos en diferentes estilos y en el siguiente orden: mariposa, espalda, pecho y libre, cubriendo un total de 400 metros. @es
definition: le nageur parcourt la longeur en utilisant les 4 styles dans l'ordre suivant : papillon, dos, brasse et libre. @fr
definition: 水泳競技で2ラップ毎に異なるスタイルのバタフライ、背泳、平泳ぎ、自由形の順で400mを完泳する @ja-jp
note: nessuno
in scheme: Subject Code
created: 2000-10-30T12:00:00+00:00
modified: 2010-12-15T17:01:09+00:00
broader: Nuoto
broad match: http://cv.iptc.org/newscodes/mediatopic/20001071

Staffetta mista 4 x 50 m
type: Concept
preferred label: 4x50 estilos estafetas @pt-pt
preferred label: relevo 4 x 50 metros combinados @es
preferred label: 4x50 medley revezamento @pt-br
preferred label: Staffel 4x50 m Lagen @de
preferred label: ２００ｍメドレーリレー @ja-jp
preferred label: relay 4x50 m medlay @en-gb
preferred label: relais 4x50m 4 nages @fr
definition: Corrida de equipe em que 4 nadadores fazem uma volta cada um estilos de nado diferentes, por esta ordem: nado de costas, peito, borboleta e livre, no total de 200m. @pt-br
definition: relais de quatre nageurs devant parcourir la longueur en utilisant les quatre styles dans l'ordre suivant: dos, brasse, papillon et libre. @fr
definition: A relay team of four, each of whom completes a single lap and each in a different style in this order: backstroke, breaststroke, butterfly and freestyle in a race of 200m total. @en-gb
definition: Corrida de equipa em que 4 nadadores fazem uma volta cada um com estilos de natação diferente, por esta ordem: costas, bruços, mariposa e livre, no total de 200m. @pt-pt
definition: Una squadra di quattro nuotatori, ciascuno dei quali completa una vasca e in uno stile: dorso, rana, farfalla e stile libero, in una gara di 200 m
definition: 4人構成のリレーチームで、異なるスタイルの背泳ぎ、平泳ぎ、バタフライ、自由形の順で4人が1ラップ毎に代わり200mを完泳する @ja-jp
definition: Relevo de cuatro nadadores, cada uno de los cuales cubre 50 metros en un estilo diferente: espalda, pecho, mariposa y libre en una carrera de 200 metros total @es
definition: Staffelteam mit 4 Schwimmern, wobei jeder von Ihnen eine Einzelrunde zurücklegt in verschiedenen Stilen in folgender Reihenfolge: Rücken, Brust, Schmetterling und Freistil auf einer Stecke von insgesamt 200 m. @de
note: nessuno
in scheme: Subject Code
created: 2000-10-30T12:00:00+00:00
modified: 2010-12-15T17:01:09+00:00
broader: Nuoto
broad match: http://cv.iptc.org/newscodes/mediatopic/20001071

Staffetta mista 4 x 100 m
type: Concept
preferred label: relay4x100 m medley @en-gb
preferred label: Staffel 4x100 m Lagen @de
preferred label: Relais 4x100 m 4nages @fr
preferred label: 4x100 m estilos @pt-pt
preferred label: 4x100 m medley @pt-br
preferred label: relevo 4 x 100 metros combinados @es
preferred label: ４００ｍメドレーリレー @ja-jp
definition: A relay team of four, each of whom completes two laps and each in a different style in this order: backstroke, breaststroke, butterfly and freestyle in a race of 400m total. @en-gb
definition: Corrida de equipe em que 4 nadadores fazem duas voltas cada um estilos de nado diferentes, por esta ordem: nado de costas, peito, borboleta e livre, no total de 400m. @pt-br
definition: Staffelteam mit 4 Schwimmern, wobei jeder von Ihnen eine Einzelrunde zurücklegt in verschiedenen Stilen in folgender Reihenfolge: Rücken, Brust, Schmetterling und Freistil auf einer Stecke von insgesamt 400 m @de
definition: 4人構成のリレーチームで、異なるスタイルの背泳ぎ、平泳ぎ、バタフライ、自由形の順で4人が2ラップ毎に代わり400mを完泳する @ja-jp
definition: Corsa a staffetta di quattro nuotatori, ciascuno dei quali deve completare due vasche e in uno stile: dorso, rana, farfalla e stile libero
definition: Corrida de equipa em que 4 nadadores fazem duas voltas cada um com estilos de natação diferente, por esta ordem: costas, bruços, mariposa e livre, no total de 400m. @pt-pt
definition: Relevo de cuatro nadadores, cada uno de los cuales cubre 100 metros en un estilo diferente: espalda, pecho, mariposa y libre en una carrera de 400 metros total. @es
definition: relais de quatre nageurs devant parcourir la longueur en utilisant les quatre styles dans l'ordre suivant: dos, brasse, papillon et libre. @fr
note: typo fixed in Explanation @en-gb
note: nessuno
in scheme: Subject Code
created: 2000-10-30T12:00:00+00:00
modified: 2010-12-15T17:01:09+00:00
broader: Nuoto
broad match: http://cv.iptc.org/newscodes/mediatopic/20001071

Vasca corta
type: Concept
preferred label: petit bassin @fr
preferred label: piscina curta @pt-br
preferred label: short course @en-gb
preferred label: Kurzbahnen @de
preferred label: piscina corta @es
preferred label: 短水路 @ja-jp
definition: épreuve se déroulant dans un bassin de 25m @fr
definition: Rennen, was in einer 25 m Bahn ausgetragen wird. @de
definition: Carreras en piscinas de 25 metros. @es
definition: Corridas realizadas em piscina de 25m de comprimento. @pt-br
definition: Gara in una piscina lunga 25 m
definition: Races competed in a 25m length pool @en-gb
definition: 25mプールにて行われる水泳競技 @ja-jp
note: nessuno
in scheme: Subject Code
created: 2000-10-30T12:00:00+00:00
modified: 2010-12-15T17:01:09+00:00
broader: Nuoto
broad match: http://cv.iptc.org/newscodes/mediatopic/20001071

Nuoto sincronizzato tecnico
type: Concept
preferred label: シンクロ・テクニカル @ja-jp
preferred label: rutina técnica sincronizada @es
preferred label: Natation synchronisée programme technique @fr
preferred label: Synchronschwimmen Disziplin @de
preferred label: sincronizada @pt-br
preferred label: synchronised technical routine @en-gb
definition: Contestants obtain points from 10 sitting judges by executing certain synchronised artistic shapes and movements in the water. In the technical programme, competitors must execute a range of specific moves in a given order. @en-gb
definition: I concorrenti ricevono i voti di dieci giudici eseguendo nell'acqua figure e movimenti sincronizzati. Nel programma tecnico i concorrenti devono compiere una serie di mosse specifiche e in un determinato ordine
definition: 競技者は、水中での一連の芸術的な形や動作で10人の着席した審判から点数を得る。テクニカルプログラムでは、競技者は決められた順序と動きの範囲内で演技しなければならない @ja-jp
definition: nager en exécutant des figures artistiques en synchronisation avec la ou les partenaires. Dans le programme technique, les nageuses présentent des figures spécifiques dans un ordre donné. @fr
definition: Los nadadores obtienen puntos de diez jurados al ejecutar determinados movimientos sincronizados y artísticos. En el programa técnico, los competidores deben ejecutar una serie de movimientos específicos en un orden dado. @es
definition: Wettkämpfer erhalten Punkte von einer zehnköpfigen Jury für synchrone artistische Formen und Bewegungen im Wasser. In der technischen Disziplin müssen die Schwimmer eine Rangfolge von speziellen Bewegungen einhalten. @de
definition: Os nadadores executam determinados movimentos sincronizados e artísticos na água, sendo avaliados por 10 juízes. No programa técnico, os nadadores devem executar uma série de figuras específicas segundo determinada ordem. @pt-br
definition: Prova em que os nadadores executam determinados movimentos sincronizados e artísticos na água, sendo avaliados por 10 juízes. No programa técnico, os nadadores devem executar uma série de figuras específicas segundo determinada ordem. @pt-pt
note: nessuno
in scheme: Subject Code
created: 2000-10-30T12:00:00+00:00
modified: 2010-12-15T17:01:09+00:00
broader: Nuoto

Nuoto sincronizzato libero
type: Concept
preferred label: Synchronschwimmen frei @de
preferred label: シンクロ・フリー @ja-jp
preferred label: sincronizada livre @pt-br
preferred label: Natation synchronisée programme libre @fr
preferred label: synchronised free routine @en-gb
preferred label: rutina libre sincronizada @es
definition: In der freien Disziplin sind die Bewegungen, die Musik und die Reihenfolge nicht vorgegeben. @de
definition: nager en exécutant des figures artistiques en synchronisation avec la ou les partenaires. Dans le programme libre, la musique, les figures et leur ordre ne comportent aucune restriction. @fr
definition: In the free programme, music, movements and their order of execution are not restricted. @en-gb
definition: フリープログラムでは、音楽、動き、およびそれらの演奏順序は制限されない @ja-jp
definition: En el programa libre, la música, los movimientos y su orden no son predeterminados. @es
definition: No programa livre, música, movimentos e sua ordem de execução não são predeterminados. @pt-br
definition: Nel programma libero la musica, i movimenti e il loro ordine di esecuzione non sono limitati
note: nessuno
in scheme: Subject Code
created: 2000-10-30T12:00:00+00:00
modified: 2010-12-15T17:01:09+00:00
broader: Nuoto

Al di sotto dei 49 kg
type: Concept
preferred label: menos de 49 kg @pt-pt
preferred label: Moins de 49 kg @fr
preferred label: menos de 49 kg. @es
preferred label: unter 49 kg @de
preferred label: 女子フライ級 @ja-jp
preferred label: under 49 kg @en-gb
definition: Gewichtsklasse in Taekwon-Do @de
definition: Categoria de peso. @pt-pt
definition: Categoria di peso
definition: catégorie de poids @fr
definition: Weight category in Taekwon-Do @en-gb
definition: Categoría de competencia del Taekwondo. @es
definition: テコンドーの重量階級 @ja-jp
note: nessuno
in scheme: Subject Code
created: 2000-10-30T12:00:00+00:00
modified: 2010-12-15T17:01:09+00:00
broader: Taekwon-Do
broad match: http://cv.iptc.org/newscodes/mediatopic/20001084

Al di sotto dei 58 kg
type: Concept
preferred label: unter 58 kg @de
preferred label: Moins de 58 kg @fr
preferred label: menos de 58 kg. @es
preferred label: 男子フライ級 @ja-jp
preferred label: menos de 58 kg @pt-pt
preferred label: under 58 kg @en-gb
definition: Gewichtsklasse in Taekwon-Do @de
definition: Categoria di peso
definition: テコンドーの重量階級 @ja-jp
definition: Categoría de peso @es
definition: Categoria de peso. @pt-pt
definition: Weight category in Taekwon-Do @en-gb
definition: catégorie de poids @fr
note: nessuno
in scheme: Subject Code
created: 2000-10-30T12:00:00+00:00
modified: 2010-12-15T17:01:09+00:00
broader: Taekwon-Do
broad match: http://cv.iptc.org/newscodes/mediatopic/20001084

49-57 kg
type: Concept
preferred label: 女子フェザー級 @ja-jp
definition: catégorie de poids @fr
definition: Gewichtsklasse in Taekwon-Do @de
definition: Categoría de peso @es
definition: Categoria de peso. @pt-br
definition: Weight category in Taekwon-Do @en-gb
definition: テコンドーの重量階級 @ja-jp
definition: Categoria di peso
note: nessuno
in scheme: Subject Code
created: 2000-10-30T12:00:00+00:00
modified: 2010-12-15T17:01:09+00:00
broader: Taekwon-Do
broad match: http://cv.iptc.org/newscodes/mediatopic/20001084

58-68 kg
type: Concept
preferred label: 58-68kg @fr
preferred label: 男子フェザー級 @ja-jp
definition: Categoria de peso. @pt-pt
definition: Weight category in Taekwon-Do @en-gb
definition: Categoria di peso
definition: Categoría de peso @es
definition: テコンドーの重量階級 @ja-jp
definition: catégorie de poids @fr
definition: Gewichtsklasse in Taekwon-Do @de
note: nessuno
in scheme: Subject Code
created: 2000-10-30T12:00:00+00:00
modified: 2010-12-15T17:01:09+00:00
broader: Taekwon-Do
broad match: http://cv.iptc.org/newscodes/mediatopic/20001084

57-67 kg
type: Concept
preferred label: 57-67kg @fr
preferred label: 女子ウエルター級 @ja-jp
definition: catégorie de poids @fr
definition: Categoria de peso. @pt-pt
definition: テコンドーの重量階級 @ja-jp
definition: Categoría de peso @es
definition: Categoria di peso
definition: Gewichtsklasse in Taekwon-Do @de
definition: Weight category in Taekwon-Do @en-gb
note: nessuno
in scheme: Subject Code
created: 2000-10-30T12:00:00+00:00
modified: 2010-12-15T17:01:09+00:00
broader: Taekwon-Do
broad match: http://cv.iptc.org/newscodes/mediatopic/20001084

68-80 kg
type: Concept
preferred label: 68-80kg @fr
preferred label: 男子ウエルター級 @ja-jp
definition: Categoria de peso. @pt-br
definition: Weight category in Taekwon-Do @en-gb
definition: Categoría de peso @es
definition: catégorie de poids @fr
definition: Categoria di peso
definition: Gewichtsklasse in Taekwon-Do @de
definition: テコンドーの重量階級 @ja-jp
note: nessuno
in scheme: Subject Code
created: 2000-10-30T12:00:00+00:00
modified: 2010-12-15T17:01:09+00:00
broader: Taekwon-Do
broad match: http://cv.iptc.org/newscodes/mediatopic/20001084

Oltre i 67 kg
type: Concept
preferred label: más de 67 kg @es
preferred label: 女子ヘビー級 @ja-jp
preferred label: over 67 kg @en-gb
preferred label: mais de 67 kg @pt-br
preferred label: Plus de 67 kg @fr
preferred label: über 67 kg @de
definition: Categoría de peso @es
definition: Categoria di peso
definition: Categoria de peso. @pt-br
definition: catégorie de poids @fr
definition: テコンドーの重量階級 @ja-jp
definition: Weight category in Taekwon-Do @en-gb
definition: Gewichtsklasse in Taekwon-Do @de
note: nessuno
in scheme: Subject Code
created: 2000-10-30T12:00:00+00:00
modified: 2010-12-15T17:01:09+00:00
broader: Taekwon-Do
broad match: http://cv.iptc.org/newscodes/mediatopic/20001084

Oltre gli 80 kg
type: Concept
preferred label: über 80 kg @de
preferred label: 男子ヘビー級 @ja-jp
preferred label: mais de 80 kg @pt-pt
preferred label: más de 80 kg. @es
preferred label: Plus de 80 kg @fr
preferred label: over 80 kg @en-gb
definition: Gewichtsklasse in Taekwon-Do @de
definition: Weight category in Taekwon-Do @en-gb
definition: Categoria di peso
definition: Categoría de peso @es
definition: テコンドーの重量階級 @ja-jp
definition: Categoria de peso. @pt-br
definition: catégorie de poids @fr
note: nessuno
in scheme: Subject Code
created: 2000-10-30T12:00:00+00:00
modified: 2010-12-15T17:01:09+00:00
broader: Taekwon-Do
broad match: http://cv.iptc.org/newscodes/mediatopic/20001084

soft tennis
type: Concept
preferred label: ソフトテニス @ja-jp
preferred label: Soft tennis
preferred label: Softtennis @de
definition: Tennis giocato con una palla morbida di gomma
definition: Modalidade de ténis jogada no Japão com uma bola macia de borracha. @pt-pt
definition: tennis avec une balle molle en caoutchouc (au programme du Festival national des Sports au Japon) @fr
definition: 柔らかいゴムボールを使ったテニス(日本の国体競技) @ja-jp
definition: Modalidade de tênis jogada no Japão com uma bola macia de borracha. @pt-br
definition: Tennis mit einem weichen Ball. (Programm des nationalen Sport Festivals in Japan) @de
definition: Tennis jugado en Japón con una pelota ligera de gaucho @es
definition: Tennis with a soft rubber ball. (Programme of National Sports Festival in Japan) @en-gb
note: nessuno
in scheme: Subject Code
created: 2004-04-22T12:00:00+00:00
modified: 2012-07-10T12:00:00+00:00
broader: tenis
broad match: http://cv.iptc.org/newscodes/mediatopic/20000822

Nuoto
type: Concept
preferred label: Natation @fr
preferred label: 水泳 @ja-jp
preferred label: natación-triatlón @es
preferred label: Triathlon Schwimmen @de
preferred label: triatlo natação @pt-br
preferred label: triathlon swimming @en-gb
definition: Triathlon Disziplin @de
definition: Prueba de triatlón @es
definition: Evento de triatlo @pt-pt
definition: Triathlon event @en-gb
definition: Gara di triathlon
definition: トライアスロン競技(水泳) @ja-jp
definition: épreuve du triathlon @fr
note: nessuno
in scheme: Subject Code
created: 2000-10-30T12:00:00+00:00
modified: 2010-12-15T17:01:09+00:00
broader: triatlo
broad match: http://cv.iptc.org/newscodes/mediatopic/20001087

Ciclismo
type: Concept
preferred label: triatlo ciclismo @pt-pt
preferred label: triathlon cycling @en-gb
preferred label: Triathlon Radfahren @de
preferred label: 自転車 @ja-jp
preferred label: ciclismo-triatlón @es
preferred label: Cyclisme @fr
definition: Evento de triatlo @pt-pt
definition: épreuve du triathlon @fr
definition: Gara di triathlon
definition: トライアスロン競技(サイクリング) @ja-jp
definition: Triathlon event @en-gb
definition: Triathlon Disziplin @de
definition: Prueba de triatlón @es
note: nessuno
in scheme: Subject Code
created: 2000-10-30T12:00:00+00:00
modified: 2010-12-15T17:01:09+00:00
broader: triatlo
broad match: http://cv.iptc.org/newscodes/mediatopic/20001087

Corsa
type: Concept
preferred label: Course @fr
preferred label: triatlo corrida @pt-pt
preferred label: ラン @ja-jp
preferred label: Triathlon Laufen @de
preferred label: prueba pedestre-triatlón @es
preferred label: triathlon run @en-gb
definition: Triathlon event @en-gb
definition: Gara di triathlon
definition: Evento de triatlo @pt-pt
definition: Triathlon Disziplin @de
definition: Prueba de triatlón @es
definition: トライアスロン競技(ランニング) @ja-jp
definition: épreuve du triathlon @fr
note: nessuno
in scheme: Subject Code
created: 2000-10-30T12:00:00+00:00
modified: 2010-12-15T17:01:09+00:00
broader: triatlo
broad match: http://cv.iptc.org/newscodes/mediatopic/20001087

Beach volley
type: Concept
preferred label: beach volleyball @en-gb
preferred label: ビーチバレー @ja-jp
preferred label: vôlei de praia @pt-br
preferred label: Beachvolleyball @de
preferred label: vóleibol playa @es
preferred label: voleibol de praia @pt-pt
definition: Jogo de bola que opõe duas equipas de 2 jogadores ao ar livre, em campo de areia dividido ao meio por rede. A areia torna esta modalidade mais difícil do que o vólei de interior. @pt-pt
definition: Deux équipes de 2 joueurs s'affrontent sur un terrain de sable en faisant passer un ballon par-dessus un filet. Le but est d'empêcher le ballon de tomber au sol dans sa partie de terrain @fr
definition: 2人構成の2つのチームが砂のコート上で競う。屋内のバレーボールと異なり、サービス権のあるチームがラリーに勝つか、ミスをさせることでポイントを得る。砂の表面がバレーボールよりも身体的に過酷にさせる @ja-jp
definition: Zwei Teams mit je zwei Spielern spielen auf einem Sandfeld. Anders als beim Volleyball werden nur dann Punkte gemacht, wenn ein Team einen Satz gewinnt oder einen Fehler macht. Der Sanduntergrund macht das Spiel anstrengender als Volleyball. @de
definition: Due squadre di due giocatori competono su un campo di sabbia. Diversamente dalla pallavolo al coperto, i punti si guadagnano solo quando la squadra che serve vince un recupero di palla o forza un errore avversario
definition: Two teams of two players compete on a sand court. Unlike indoor volleyball, points are scored only when the serving team wins a rally or forces an error. The sand surface makes it more physically demanding than volleyball. @en-gb
definition: Dos equipos de dos jugadores juegan en cancha de arena. A diferencia del voleibol de gimnasio, sólo se anotan puntos cuando se tiene el saque. La superficie de arena demanda mayor esfuerzo físico. @es
definition: Jogo de bola que opõe duas equipes de 2 jogadores ao ar livre, em campo de areia dividido ao meio por rede. A areia torna esta modalidade mais difícil do que o vôlei de interior. @pt-br
note: nessuno
in scheme: Subject Code
created: 2000-10-30T12:00:00+00:00
modified: 2010-12-15T17:01:09+00:00
broader: Pallavolo

Slalom
type: Concept
preferred label: slalom @pt-pt
preferred label: スラローム @ja-jp
definition: Rennen bei dem die Wettkämpfer einem Kurs folgen, der mit Bojen markiert wird. @de
definition: Deporte de velocidad donde el esquiador debe eludir un trazado de boyas sobre la superficie. @es
definition: Prova de velocidade em que os esquiadores se deslocam por um percurso delimitado por boias. @pt-pt
definition: Speed event where contestants round a course marked out by buoys @en-gb
definition: Epreuve de vitesse constistant à se déplacer sur une piste matérialisée par des bouées @fr
definition: Gara di velocità in cui i gareggianti devono terminare un percorso segnato da boe
definition: 水上スキーで、ポールによって作られたコースを周るスピード競技 @ja-jp
note: nessuno
note: typo fixed in Explanation @en-gb
in scheme: Subject Code
created: 2000-10-30T12:00:00+00:00
modified: 2010-12-15T17:01:09+00:00
broader: Sci nautico
broad match: http://cv.iptc.org/newscodes/mediatopic/20001092

Acrobatico
type: Concept
preferred label: truques @pt-pt
preferred label: Figures @fr
preferred label: トリック @ja-jp
preferred label: trick @en-gb
preferred label: figuras @es
preferred label: Trick @de
definition: 水上スキーのフリースタイルスキーで、スキーヤーが決められた時間内に最大限の演技を行う(競技) @ja-jp
definition: le skieur doit effectuer un maximun de figures dans un temps limité @fr
definition: Prova em que os esquiadores executam uma série de figuras em determinado período de tempo. @pt-pt
definition: Skiers perform a maximum of figures in a limited time period @en-gb
definition: Gli atleti eseguono un numero massimo di figure in un tempo limitato
definition: Esquiadores ejecutan una serie de figuras en un período de tiempo dado. @es
definition: Skifahrer bilden maximal viele Figuren in einer bestimmten Zeit. @de
note: nessuno
in scheme: Subject Code
created: 2000-10-30T12:00:00+00:00
modified: 2010-12-15T17:01:09+00:00
broader: Sci nautico
broad match: http://cv.iptc.org/newscodes/mediatopic/20001092

Salto
type: Concept
preferred label: salto @pt-br
preferred label: ジャンプ @ja-jp
preferred label: Sprung @de
preferred label: Saut @fr
preferred label: jump @en-gb
definition: 水上スキーで、水上にある斜面からできる限り長いジャンプを行う(競技) @ja-jp
definition: le skieur doit effectuer le plus long saut possible à partir d'un tremplin @fr
definition: Prova em que os esquiadores devem saltar o mais longe possível a partir de uma rampa. @pt-pt
definition: Gli atleti devono arrivare il più lontano possibile saltando da una rampa situata in acqua
definition: Skiers perform as long a jump as possible from a ramp in the water @en-gb
definition: Skifahrer springen so langanhaltend wie möglich von einer Rampe in das Wasser. @de
definition: Esquiadores deben saltar lo más lejos posible mediante una rampa @es
note: nessuno
in scheme: Subject Code
created: 2000-10-30T12:00:00+00:00
modified: 2010-12-15T17:01:09+00:00
broader: Sci nautico
broad match: http://cv.iptc.org/newscodes/mediatopic/20001092

Combinato
type: Concept
preferred label: combinado @pt-br
preferred label: Kombination @de
preferred label: combined @en-gb
preferred label: 複合 @ja-jp
preferred label: combiné @fr
definition: Prova que combina as disciplinas de slalom, salto e truques. @pt-br
definition: Una gara combinata fatta da slalom, salto e acrobazie
definition: Deporte combinado de salto, artístico y slalom @es
definition: 水上スキーで、スラローム、ジャンプ、トリックを組み合わせた競技 @ja-jp
definition: A combined event made up of the slalom, jump and trick @en-gb
definition: Kombiniertes Ereignis von Slalom, Sprung und Trick. @de
definition: le résultat du combiné est obtenu par addition des points correspondant aux performances dans chacune des trois disciplines (saut, figures, slalom) @fr
note: nessuno
in scheme: Subject Code
created: 2000-10-30T12:00:00+00:00
modified: 2010-12-15T17:01:09+00:00
broader: Sci nautico
broad match: http://cv.iptc.org/newscodes/mediatopic/20001092

Strappo
type: Concept
preferred label: Arrachée @fr
preferred label: arranque @pt-pt
preferred label: snatch @en-gb
preferred label: スナッチ @ja-jp
preferred label: Snatch @de
preferred label: arranco @pt-br
definition: A barra de pesos deve ser levantada do solo até acima da cabeça com um só movimento. @pt-br
definition: バーを一連の動作で床から頭上まで持ち上げなければならない(競技) @ja-jp
definition: The bar must be lifted from floor to above the head in one movement @en-gb
definition: amener une barre à disques à bout de bras en un seul temps @fr
definition: Il bilanciere deve essere sollevato da terra e portato al di sopra della testa con un solo movimento
definition: La barra debe ser elevada desde el piso hasta arriba de la cabeza en un solo movimiento @es
definition: Die Stange muss vom Boden über den Kopf in einem Zug gehoben werden. @de
note: nessuno
in scheme: Subject Code
created: 2000-10-30T12:00:00+00:00
modified: 2010-12-15T17:01:09+00:00
broader: Sollevamento pesi

Due tempi (salto e strappo)
type: Concept
preferred label: dos tiempos @es
preferred label: arremesso @pt-pt
preferred label: Clean and Jerk @de
preferred label: ジャーク @ja-jp
preferred label: clean and jerk @en-gb
preferred label: épaulé-jeté @fr
definition: La barra es elevada primero hasta los hombros, luego elevada por encima de la cabeza y se debe mantener allí con las piernas estiradas. @es
definition: amener une barre à disques à bout de bras en deux temps : d'abord au niveau des épaules ensuite au-dessus de la tête avec les bras tendus @fr
definition: A barra de pesos é primeiro levantada até os ombros e só depois arremessada acima da cabeça, posição que o atleta deve manter durante alguns segundos com as pernas esticadas. @pt-br
definition: Il bilanciere è prima sollevato all'altezza delle spalle e poi spinto al di sopra della testa con uno strappo deciso e va tenuto mantenendo le gambe unite
definition: The bar is first lifted to the shoulders and then jerk it above the head and keep it there while maintaining straight legs @en-gb
definition: A barra de pesos é primeiro levantada até aos ombros e só depois arremessada acima da cabeça, posição que o atleta deve manter durante alguns segundos com as pernas esticadas. @pt-pt
definition: バーを最初に肩まで持ち上げ、その後に頭上に持ち上げて、足をまっすぐ揃えるまで保ち続ける(競技) @ja-jp
definition: Die Stange wird zu den Schultern gehoben, dann über den Kopf und dort gehalten während die Beine gestreckt werden. @de
note: nessuno
in scheme: Subject Code
created: 2000-10-30T12:00:00+00:00
modified: 2010-12-15T17:01:09+00:00
broader: Sollevamento pesi

48kg
type: Concept
preferred label: 48 kg
preferred label: ４８ｋｇ級 @ja-jp
definition: Competitor weight category in weightlifting @en-gb
definition: Categoria de peso do competidor @pt-pt
definition: catégories de poids du compétiteur @fr
definition: Categoria di peso del concorrente
definition: Categoría de peso, del competidor de halterofilia. @es
definition: Gewichtsklasse im Gewichtheben @de
definition: 重量挙げの重量階級 @ja-jp
note: nessuno
in scheme: Subject Code
created: 2000-10-30T12:00:00+00:00
modified: 2010-12-15T17:01:09+00:00
broader: Sollevamento pesi
broad match: http://cv.iptc.org/newscodes/mediatopic/20001093

53 kg
type: Concept
preferred label: ５３ｋｇ級 @ja-jp
preferred label: 53kg @fr
definition: Competitor weight category in weightlifting @en-gb
definition: Categoría de peso, del competidor de halterofilia. @es
definition: catégories de poids du compétiteur @fr
definition: Categoria de peso do competidor @pt-br
definition: 重量挙げの重量階級 @ja-jp
definition: Categoria di peso del concorrente
definition: Gewichtsklasse im Gewichtheben @de
note: nessuno
in scheme: Subject Code
created: 2000-10-30T12:00:00+00:00
modified: 2010-12-15T17:01:09+00:00
broader: Sollevamento pesi
broad match: http://cv.iptc.org/newscodes/mediatopic/20001093

63 kg
type: Concept
preferred label: 63kg @fr
preferred label: ６３ｋｇ級 @ja-jp
definition: Categoría de peso, del competidor de halterofilia. @es
definition: Categoria de peso do competidor @pt-br
definition: Gewichtsklasse im Gewichtheben @de
definition: Categoria di peso del concorrente
definition: 重量挙げの重量階級 @ja-jp
definition: Competitor weight category in weightlifting @en-gb
definition: catégories de poids du compétiteur @fr
note: nessuno
in scheme: Subject Code
created: 2000-10-30T12:00:00+00:00
modified: 2010-12-15T17:01:09+00:00
broader: Sollevamento pesi
broad match: http://cv.iptc.org/newscodes/mediatopic/20001093

75 kg
type: Concept
preferred label: ７５ｋｇ級 @ja-jp
preferred label: 75kg @fr
definition: Categoria de peso do competidor @pt-br
definition: Categoria di peso del concorrente
definition: 重量挙げの重量階級 @ja-jp
definition: Competitor weight category in weightlifting @en-gb
definition: catégories de poids du compétiteur @fr
definition: Categoría de peso, del competidor de halterofilia. @es
definition: Gewichtsklasse im Gewichtheben @de
note: nessuno
in scheme: Subject Code
created: 2000-10-30T12:00:00+00:00
modified: 2010-12-15T17:01:09+00:00
broader: Sollevamento pesi
broad match: http://cv.iptc.org/newscodes/mediatopic/20001093

Oltre 75 kg
type: Concept
preferred label: mais de 675 kg @pt-pt
preferred label: Plus de 75kg @fr
preferred label: ７５ｋｇ超級 @ja-jp
preferred label: over 75 kg @en-gb
preferred label: más de 75 kg @es
preferred label: über 75 kg @de
definition: 重量挙げの重量階級 @ja-jp
definition: Competitor weight category in weightlifting @en-gb
definition: Categoría de peso, del competidor de halterofilia. @es
definition: Categoria de peso do competidor @pt-br
definition: Gewichtsklasse im Gewichtheben @de
definition: Categoria di peso del concorrente
definition: catégories de poids du compétiteur @fr
note: nessuno
in scheme: Subject Code
created: 2000-10-30T12:00:00+00:00
modified: 2010-12-15T17:01:09+00:00
broader: Sollevamento pesi
broad match: http://cv.iptc.org/newscodes/mediatopic/20001093

56 kg
type: Concept
preferred label: ５６ｋｇ級 @ja-jp
preferred label: 56kg @fr
definition: catégories de poids du compétiteur @fr
definition: Competitor weight category in weightlifting @en-gb
definition: 重量挙げの重量階級 @ja-jp
definition: Categoría de peso, del competidor de halterofilia. @es
definition: Categoria di peso del concorrente
definition: Gewichtsklasse im Gewichtheben @de
definition: Categoria de peso do competidor @pt-pt
note: nessuno
in scheme: Subject Code
created: 2000-10-30T12:00:00+00:00
modified: 2010-12-15T17:01:09+00:00
broader: Sollevamento pesi
broad match: http://cv.iptc.org/newscodes/mediatopic/20001093

62 kg
type: Concept
preferred label: ６２ｋｇ級 @ja-jp
preferred label: 62kg @fr
definition: Categoria de peso do competidor @pt-pt
definition: Categoría de peso, del competidor de halterofilia. @es
definition: catégories de poids du compétiteur @fr
definition: 重量挙げの重量階級 @ja-jp
definition: Gewichtsklasse im Gewichtheben @de
definition: Competitor weight category in weightlifting @en-gb
definition: Categoria di peso del concorrente
note: nessuno
in scheme: Subject Code
created: 2000-10-30T12:00:00+00:00
modified: 2010-12-15T17:01:09+00:00
broader: Sollevamento pesi
broad match: http://cv.iptc.org/newscodes/mediatopic/20001093

69 kg
type: Concept
preferred label: ６９ｋｇ級 @ja-jp
preferred label: 69kg @fr
definition: Categoría de peso, del competidor de halterofilia. @es
definition: 重量挙げの重量階級 @ja-jp
definition: Categoria de peso do competidor @pt-pt
definition: Gewichtsklasse im Gewichtheben @de
definition: catégories de poids du compétiteur @fr
definition: Competitor weight category in weightlifting @en-gb
definition: Categoria di peso del concorrente
note: nessuno
in scheme: Subject Code
created: 2000-10-30T12:00:00+00:00
modified: 2010-12-15T17:01:09+00:00
broader: Sollevamento pesi
broad match: http://cv.iptc.org/newscodes/mediatopic/20001093

７７ｋｇ級
type: Concept
preferred label: 77 kg
preferred label: 77kg @fr
definition: 重量挙げの重量階級 @ja-jp
definition: Gewichtsklasse im Gewichtheben @de
definition: Competitor weight category in weightlifting @en-gb
definition: catégories de poids du compétiteur @fr
definition: Categoria di peso del concorrente
definition: Categoría de peso, del competidor de halterofilia. @es
definition: Categoria de peso do competidor @pt-pt
note: nessuno
in scheme: Subject Code
created: 2000-10-30T12:00:00+00:00
modified: 2010-12-15T17:01:09+00:00
broader: Sollevamento pesi
broad match: http://cv.iptc.org/newscodes/mediatopic/20001093

85 kg
type: Concept
preferred label: ８５ｋｇ級 @ja-jp
preferred label: 85kg @fr
definition: Gewichtsklasse im Gewichtheben @de
definition: Categoria de peso do competidor @pt-pt
definition: Competitor weight category in weightlifting @en-gb
definition: Categoria di peso del concorrente
definition: Categoría de peso, del competidor de halterofilia. @es
definition: 重量挙げの重量階級 @ja-jp
definition: catégories de poids du compétiteur @fr
note: nessuno
in scheme: Subject Code
created: 2000-10-30T12:00:00+00:00
modified: 2010-12-15T17:01:09+00:00
broader: Sollevamento pesi
broad match: http://cv.iptc.org/newscodes/mediatopic/20001093

94 kg
type: Concept
preferred label: ９４ｋｇ級 @ja-jp
preferred label: 94kg @fr
definition: Gewichtsklasse im Gewichtheben @de
definition: Categoria de peso do competidor @pt-br
definition: Categoría de peso, del competidor de halterofilia. @es
definition: Categoria di peso del concorrente
definition: Competitor weight category in weightlifting @en-gb
definition: catégories de poids du compétiteur @fr
definition: 重量挙げの重量階級 @ja-jp
note: nessuno
in scheme: Subject Code
created: 2000-10-30T12:00:00+00:00
modified: 2010-12-15T17:01:09+00:00
broader: Sollevamento pesi
broad match: http://cv.iptc.org/newscodes/mediatopic/20001093

１０５ｋｇ級
type: Concept
preferred label: 105 kg
preferred label: 105kg @fr
definition: Categoria de peso do competidor @pt-pt
definition: Categoría de peso, del competidor de halterofilia. @es
definition: Categoria di peso del concorrente
definition: Competitor weight category in weightlifting @en-gb
definition: catégories de poids du compétiteur @fr
definition: 重量挙げの重量階級 @ja-jp
definition: Gewichtsklasse im Gewichtheben @de
note: nessuno
in scheme: Subject Code
created: 2000-10-30T12:00:00+00:00
modified: 2010-12-15T17:01:09+00:00
broader: Sollevamento pesi
broad match: http://cv.iptc.org/newscodes/mediatopic/20001093

Più di 105 kg
type: Concept
preferred label: mais de 105 kg @pt-br
preferred label: > 105 kg @fr
preferred label: über 105 kg @de
preferred label: over 105 kg @en-gb
preferred label: más de 105 kg @es
preferred label: １０５ｋｇ超級 @ja-jp
definition: Categoria de peso do competidor @pt-br
definition: Categoria di peso del concorrente
definition: Competitor weight category in weightlifting @en-gb
definition: Categoría de peso, del competidor de halterofilia. @es
definition: Gewichtsklasse im Gewichtheben @de
definition: 重量挙げの重量階級 @ja-jp
definition: catégories de poids du compétiteur @fr
note: nessuno
in scheme: Subject Code
created: 2000-10-30T12:00:00+00:00
modified: 2010-12-15T17:01:09+00:00
broader: Sollevamento pesi
broad match: http://cv.iptc.org/newscodes/mediatopic/20001093

Powerlifting
type: Concept
preferred label: Force athlétique @fr
preferred label: powerlifting @en-gb
preferred label: パワーリフティング @ja-jp
preferred label: Kraftdreikampf @de
preferred label: levantamento de peso básico @pt-br
preferred label: levantamento de peso @pt-pt
definition: Teste de força em que os atletas tentam levantar o máximo de peso possível. @pt-pt
definition: sport de force qui consiste à soulever des charges les plus lourdes possibles @fr
definition: Kräftemessen, bei dem die Wettkämpfer eine Gewicht so schwer wie möglich heben. @de
definition: Una prova di forza in cui gli atleti sollevano il massimo peso possibile
definition: Deporte de fuerza donde cada competidor debe elevar el máximo de peso posible @es
definition: 競技者が出来る限り重い錘を持ち上げる力持ち競技 @ja-jp
definition: A strength test where competitors lift as heavy a weight as possible @en-gb
note: nessuno
in scheme: Subject Code
created: 2000-10-30T12:00:00+00:00
modified: 2010-12-15T17:01:09+00:00
broader: Sollevamento pesi

Oceano
type: Concept
preferred label: océano @es
preferred label: oceano @pt-pt
preferred label: ocean @en-gb
preferred label: オーシャン @ja-jp
preferred label: Meer @de
preferred label: Courses en mer @fr
definition: Carreraras en mar abierto @es
definition: 外洋でのレース @ja-jp
definition: Corridas em mar aberto. @pt-br
definition: compétition se déroulant en mer @fr
definition: Gare in mare aperto
definition: Races on the open seas @en-gb
definition: Corridas em embarcações em mar aberto. @pt-pt
definition: Rennen auf dem offenen Meer. @de
note: nessuno
in scheme: Subject Code
created: 2000-10-30T12:00:00+00:00
modified: 2010-12-15T17:01:09+00:00
broader: Windsurf
broad match: http://cv.iptc.org/newscodes/mediatopic/20001097

Lago
type: Concept
preferred label: Régates sur lac @fr
preferred label: lagos @es
preferred label: lago @pt-pt
preferred label: lake @en-gb
preferred label: See @de
preferred label: レイク @ja-jp
definition: Corridas em lagos. @pt-br
definition: Carreras realizadas en lagos @es
definition: Races competed on lakes @en-gb
definition: Corridas em embarcações em lagos. @pt-pt
definition: compétition se déroulant sur lac @fr
definition: Gare disputate su laghi
definition: Rennen auf Seen. @de
definition: 湖で競争するレース @ja-jp
note: nessuno
in scheme: Subject Code
created: 2000-10-30T12:00:00+00:00
modified: 2010-12-15T17:01:09+00:00
broader: Windsurf
broad match: http://cv.iptc.org/newscodes/mediatopic/20001097

Fiume
type: Concept
preferred label: Régates sur fleuve @fr
preferred label: リバー @ja-jp
preferred label: Fluß @de
preferred label: rio @pt-br
preferred label: river @en-gb
preferred label: ríos @es
definition: 川で競争するレース @ja-jp
definition: Races competed on rivers @en-gb
definition: Rennen auf Flüssen. @de
definition: Corridas em embarcações em rios. @pt-pt
definition: Gare disputate su fiumi
definition: Corridas em rios. @pt-br
definition: Carreras realizadas en ríos @es
definition: compétition se déroulant sur fleuve @fr
note: nessuno
in scheme: Subject Code
created: 2000-10-30T12:00:00+00:00
modified: 2010-12-15T17:01:09+00:00
broader: Windsurf
broad match: http://cv.iptc.org/newscodes/mediatopic/20001097

Terra
type: Concept
preferred label: terra @pt-br
preferred label: Courses sur terre @fr
preferred label: Land @de
preferred label: tierra @es
preferred label: ランド @ja-jp
preferred label: land @en-gb
definition: 車輪の付いたボードを使った陸上で競争するレース @ja-jp
definition: Races competed on land with a board equipped with wheels @en-gb
definition: Rennen auf dem Land mit einem Board auf Rädern. @de
definition: Corridas em terra com uma prancha à vela equipada com rodas. @pt-pt
definition: Carreras en tierra con una tabla munida de ruedas @es
definition: Gare disputate sulla terra con una tavola dotata di ruote
definition: Corridas em terra com uma prancha a vela equipada com rodas. @pt-br
definition: compétition de planche à voile à roulette @fr
note: nessuno
note: typo fixed in Explanation @en-gb
in scheme: Subject Code
created: 2000-10-30T12:00:00+00:00
modified: 2010-12-15T17:01:09+00:00
broader: Windsurf
broad match: http://cv.iptc.org/newscodes/mediatopic/20001097

Libera
type: Concept
preferred label: lucha libre @es
preferred label: estilo livre @pt-pt
preferred label: freestyle @en-gb
preferred label: Freestyle @de
preferred label: Lutte libre @fr
preferred label: フリースタイル @ja-jp
definition: Estilo de luta onde é permitido agarrar com as pernas. @pt-pt
definition: A style where leg holds are allowed @en-gb
definition: Stile nel quale è permesso l'uso delle gambe
definition: レスリングで腰から下の脚部への攻撃もを認めるスタイル @ja-jp
definition: style de lutte qui permet les prises aux jambes @fr
definition: Un estilo donde sostener con las piernas está permitido @es
definition: Stil bei dem auch das Festhalten der Beine erlaubt ist, d.h. Angriffe auf den ganzen Körper. @de
note: nessuno
in scheme: Subject Code
created: 2000-10-30T12:00:00+00:00
modified: 2010-12-15T17:01:09+00:00
broader: Lotta

Greco-romana
type: Concept
preferred label: Griechisch-Römisch @de
preferred label: greco-romana @pt-br
preferred label: greco-roman @en-gb
preferred label: グレコローマン @ja-jp
preferred label: Lutte gréco-romaine @fr
preferred label: grecorromana @es
definition: style de lutte où seules les prises entre le tête et la ceinture sont permises @fr
definition: Estilo de luta onde só é permitido agarrar entre a cintura e a cabeça. @pt-br
definition: A style where the only holds allowed are those between the head and the belt @en-gb
definition: レスリングで頭から腰のベルトまでを掴むことが許される(腰から下への攻撃はゆるされない)スタイル @ja-jp
definition: Ein Stil bei dem nur Angriffe zwischen Kopf und Gürtellinie erlaubt sind. @de
definition: Un estilo donde las únicas tomas permitidas son aquéllas entre la cabeza y la cintura @es
definition: Stile nel quale le uniche prese permesse sono quelle tra la testa e la cintura
note: nessuno
in scheme: Subject Code
created: 2000-10-30T12:00:00+00:00
modified: 2010-12-15T17:01:09+00:00
broader: Lotta

Superiore ai 130 kg
type: Concept
preferred label: Plus de 130 kg @fr
preferred label: mais de 130 kg @pt-pt
preferred label: más de 130 kg @es
preferred label: over 130 kg @en-gb
preferred label: １３０ｋｇ超 @ja-jp
preferred label: über 130kg @de
definition: Gewichtsklasse im Ringen @de
definition: Categoria de peso do competidor @pt-br
definition: 競技者重量区分 @ja-jp
definition: Competitor weight category in wrestling @en-gb
definition: catégorie de poids du lutteur @fr
definition: Categoria di peso del concorrente
definition: Categorías de peso de lucha @es
note: nessuno
in scheme: Subject Code
created: 2000-10-30T12:00:00+00:00
modified: 2010-12-15T17:01:09+00:00
broader: Lotta
broad match: http://cv.iptc.org/newscodes/mediatopic/20001098

130 kg
type: Concept
preferred label: 130kg @fr
preferred label: １３０ｋｇ級 @ja-jp
definition: Categoria di peso del concorrente
definition: 競技者重量区分 @ja-jp
definition: Categoria de peso do competidor @pt-pt
definition: Categorías de peso @es
definition: Competitor weight category in wrestling @en-gb
definition: catégorie de poids du lutteur @fr
definition: Gewichtsklasse im Ringen @de
note: nessuno
in scheme: Subject Code
created: 2000-10-30T12:00:00+00:00
modified: 2010-12-15T17:01:09+00:00
broader: Lotta
broad match: http://cv.iptc.org/newscodes/mediatopic/20001098

97 kg
type: Concept
preferred label: ９７ｋｇ級 @ja-jp
preferred label: 97kg @fr
definition: Categoria de peso do competidor @pt-pt
definition: 競技者重量区分 @ja-jp
definition: Gewichtsklasse im Ringen @de
definition: catégorie de poids du lutteur @fr
definition: Competitor weight category in wrestling @en-gb
definition: Categorías de peso @es
definition: Categoria di peso del concorrente
note: nessuno
in scheme: Subject Code
created: 2000-10-30T12:00:00+00:00
modified: 2010-12-15T17:01:09+00:00
broader: Lotta
broad match: http://cv.iptc.org/newscodes/mediatopic/20001098

85 kg
type: Concept
preferred label: 85kg @de
preferred label: ８５ｋｇ級 @ja-jp
definition: Categoria de peso do competidor @pt-br
definition: Competitor weight category in wrestling @en-gb
definition: Categorías de peso @es
definition: Categoria di peso del concorrente
definition: 競技者重量区分 @ja-jp
definition: catégorie de poids du lutteur @fr
definition: Gewichtsklasse im Ringen @de
note: nessuno
in scheme: Subject Code
created: 2000-10-30T12:00:00+00:00
modified: 2010-12-15T17:01:09+00:00
broader: Lotta
broad match: http://cv.iptc.org/newscodes/mediatopic/20001098

76 kg
type: Concept
preferred label: ７６ｋｇ級 @ja-jp
preferred label: 76kg @fr
definition: Categoria de peso do competidor @pt-pt
definition: Categoria di peso del concorrente
definition: catégorie de poids du lutteur @fr
definition: 競技者重量区分 @ja-jp
definition: Gewichtsklasse im Ringen @de
definition: Categorías de peso @es
definition: Competitor weight category in wrestling @en-gb
note: nessuno
in scheme: Subject Code
created: 2000-10-30T12:00:00+00:00
modified: 2010-12-15T17:01:09+00:00
broader: Lotta
broad match: http://cv.iptc.org/newscodes/mediatopic/20001098

69 kg
type: Concept
preferred label: ６９ｋｇ級 @ja-jp
preferred label: 69kg @de
definition: catégorie de poids du lutteur @fr
definition: 競技者重量区分 @ja-jp
definition: Categoria de peso do competidor @pt-br
definition: Gewichtsklasse im Ringen @de
definition: Categoria di peso del concorrente
definition: Competitor weight category in wrestling @en-gb
definition: Categorías de peso @es
note: nessuno
in scheme: Subject Code
created: 2000-10-30T12:00:00+00:00
modified: 2010-12-15T17:01:09+00:00
broader: Lotta
broad match: http://cv.iptc.org/newscodes/mediatopic/20001098

63 kg
type: Concept
preferred label: ６３ｋｇ級 @ja-jp
preferred label: 63kg @fr
definition: catégorie de poids du lutteur @fr
definition: Gewichtsklasse im Ringen @de
definition: Categoria de peso do competidor @pt-br
definition: Categorías de peso @es
definition: 競技者重量区分 @ja-jp
definition: Competitor weight category in wrestling @en-gb
definition: Categoria di peso del concorrente
note: nessuno
in scheme: Subject Code
created: 2000-10-30T12:00:00+00:00
modified: 2010-12-15T17:01:09+00:00
broader: Lotta
broad match: http://cv.iptc.org/newscodes/mediatopic/20001098

58 kg
type: Concept
preferred label: ５８ｋｇ級 @ja-jp
preferred label: 58kg @fr
definition: Gewichtsklasse im Ringen @de
definition: catégorie de poids du lutteur @fr
definition: Categoria de peso do competidor @pt-pt
definition: 競技者重量区分 @ja-jp
definition: Categorías de peso @es
definition: Competitor weight category in wrestling @en-gb
definition: Categoria di peso del concorrente
note: nessuno
in scheme: Subject Code
created: 2000-10-30T12:00:00+00:00
modified: 2010-12-15T17:01:09+00:00
broader: Lotta
broad match: http://cv.iptc.org/newscodes/mediatopic/20001098

５４ｋｇ級
type: Concept
preferred label: 54 kg
preferred label: 54kg @fr
definition: Gewichtsklasse im Ringen @de
definition: Competitor weight category in wrestling @en-gb
definition: 競技者重量区分 @ja-jp
definition: Categorías de peso @es
definition: Categoria de peso do competidor @pt-pt
definition: Categoria di peso del concorrente
definition: catégorie de poids du lutteur @fr
note: nessuno
in scheme: Subject Code
created: 2000-10-30T12:00:00+00:00
modified: 2010-12-15T17:01:09+00:00
broader: Lotta
broad match: http://cv.iptc.org/newscodes/mediatopic/20001098

Lotta svizzera
type: Concept
preferred label: Swiss wrestling @en-gb
preferred label: lucha suiza @es
preferred label: スイスレスリング @ja-jp
preferred label: Lutte suisse @fr
preferred label: luta suíça @pt-br
preferred label: Schwingen @de
definition: Desporto tradicional suíço, semelhante à luta livre, mas com regras específicas. @pt-pt
definition: 特有のルールをもつ、レスリングに類似した、スイスの伝統的なスポーツ @ja-jp
definition: Traditionelle Schweizer Sportart, ähnlich dem Ringen mit speziellen Regeln. @de
definition: Traditional Swiss sport similar to wrestling with specific rules @en-gb
definition: Lucha de origen suizo con reglas específicas @es
definition: Esporte tradicional suíço, semelhante à luta livre, mas com regras específicas. @pt-br
definition: sport de combat traditionnel suisse @fr
definition: Tradizionale sport svizzero simile al wrestling ma con regole specifiche
note: nessuno
in scheme: Subject Code
created: 2003-11-26T12:00:00+00:00
modified: 2012-07-10T12:00:00+00:00
broader: Lotta

Olimpiadi
type: Concept
preferred label: 夏季五輪 @ja-jp
preferred label: Summer Olympics @en-gb
preferred label: Olympische Sommerspiele @de
preferred label: juegos olímpicos de verano @es
preferred label: Jogos Olímpicos de Verão @pt-pt
preferred label: JO d'été @fr
definition: --- @de
definition: Olimpiadi estive
definition: Jogos Olímpicos de Verão @pt-pt
definition: Summer Olympics @en-gb
definition: juegos olímpicos de verano @es
definition: 夏季オリンピック大会 @ja-jp
definition: Jeux Olympiques d'été @fr
note: nessuno
in scheme: Subject Code
created: 2000-10-30T12:00:00+00:00
modified: 2010-12-15T17:01:09+00:00
broader: Evento sportivo
broad match: http://cv.iptc.org/newscodes/mediatopic/20001108

Olimpiadi invernali
type: Concept
preferred label: 冬季五輪 @ja-jp
preferred label: Jogos Olímpicos de Inverno @pt-pt
preferred label: juegos olímpicos de invierno @es
preferred label: Winter Olympics @en-gb
preferred label: Olympische Winterspiele @de
preferred label: JO d'hiver @fr
definition: 冬季オリンピック大会 @ja-jp
definition: Winter Olympics @en-gb
definition: --- @de
definition: Jeux Olympiques d'hiver @fr
definition: Jogos Olímpicos de Inverno @pt-pt
definition: Olimpiadi invernali
definition: juegos olímpicos de invierno @es
note: nessuno
in scheme: Subject Code
created: 2000-10-30T12:00:00+00:00
modified: 2010-12-15T17:01:09+00:00
broader: Evento sportivo
broad match: http://cv.iptc.org/newscodes/mediatopic/20001108

Universiade
type: Concept
preferred label: Universíadas @pt-pt
preferred label: universiadas de verano @es
preferred label: 夏季ユニバーシアード @ja-jp
preferred label: Universíada @pt-br
preferred label: Sommeruniversiade @de
preferred label: Universiade d'été @fr
preferred label: Summer universiade @en-gb
definition: Universíada @pt-br
definition: 夏季ユニバーシアード大会 @ja-jp
definition: Universiade (gare mondiali fra atleti universitari) estiva
definition: --- @de
definition: universiadas de verano @es
definition: Universiade d'été @fr
definition: Summer universiade @en-gb
definition: Provas para universitários, no verão. @pt-pt
note: nessuno
in scheme: Subject Code
created: 2000-10-30T12:00:00+00:00
modified: 2010-12-15T17:01:09+00:00
broader: Evento sportivo
broad match: http://cv.iptc.org/newscodes/mediatopic/20001108

Universiade invernale
type: Concept
preferred label: universiadas de invierno @es
preferred label: Winter Universiade @en-gb
preferred label: Universíadas de Inverno @pt-pt
preferred label: Winteruniversiade @de
preferred label: Universiade d'hiver @fr
preferred label: 冬季ユニバーシアード @ja-jp
preferred label: Universíada de Inverno @pt-br
definition: --- @de
definition: 冬季ユニバーシアード大会 @ja-jp
definition: Winter Universiade @en-gb
definition: universiadas de invierno @es
definition: Provas para universitários, no inverno. @pt-pt
definition: Universiade invernale
definition: Universíada de Inverno @pt-br
definition: Universiade d'hiver @fr
note: nessuno
in scheme: Subject Code
created: 2000-10-30T12:00:00+00:00
modified: 2010-12-15T17:01:09+00:00
broader: Evento sportivo
broad match: http://cv.iptc.org/newscodes/mediatopic/20001108

Giochi del Commonwealth
type: Concept
preferred label: Jeux du Commonwealth @fr
preferred label: Commonwealth Games @de
preferred label: 英連邦競技会 @ja-jp
preferred label: juegos del commonwealth (comunidad británica) @es
preferred label: Jogos da Commonwealth @pt-pt
definition: Jogos da Commonwealth @pt-pt
definition: 国家競技 @ja-jp
definition: Commonwealth Games @en-gb
definition: Jeux du Commonwealth @fr
definition: Giochi del Commonwealth
definition: --- @de
definition: juegos del commonwealth (comunidad británica) @es
note: nessuno
in scheme: Subject Code
created: 2000-10-30T12:00:00+00:00
modified: 2010-12-15T17:01:09+00:00
broader: Evento sportivo
broad match: http://cv.iptc.org/newscodes/mediatopic/20001108

Giochi invernali della buona volontà
type: Concept
preferred label: Jogos da Boa Vontade de Inverno @pt-br
preferred label: Winter Goodwill Games @en-gb
preferred label: Goodwill Games hiver @fr
preferred label: juegos invernales de la buena voluntad @es
preferred label: 冬季交歓試合 @ja-jp
definition: --- @de
definition: Jogos da Boa Vontade de Inverno @pt-pt
definition: Winter Goodwill Games @en-gb
definition: juegos invernales de la buena voluntad @es
definition: 冬季交歓試合 @ja-jp
definition: Goodwill Games hiver @fr
definition: Giochi invernali della buona volontà
note: nessuno
in scheme: Subject Code
created: 2000-10-30T12:00:00+00:00
modified: 2010-12-15T17:01:09+00:00
broader: Evento sportivo
broad match: http://cv.iptc.org/newscodes/mediatopic/20001108

Giochi Asiatici
type: Concept
preferred label: juegos asiáticos de verano @es
preferred label: Summer Asian Games @en-gb
preferred label: 夏季アジア大会 @ja-jp
preferred label: Jogos Asiáticos @pt-br
preferred label: Asienspiele Sommer @de
preferred label: Jeux asiatiques d'été @fr
definition: --- @de
definition: Jogos Asiáticos @pt-pt
definition: 夏季アジア競技大会 @ja-jp
definition: Giochi Asiatici
definition: Summer Asian Games @en-gb
definition: juegos asiáticos de verano @es
definition: Jeux asiatiques d'été @fr
note: nessuno
in scheme: Subject Code
created: 2000-10-30T12:00:00+00:00
modified: 2010-12-15T17:01:09+00:00
broader: Evento sportivo
broad match: http://cv.iptc.org/newscodes/mediatopic/20001108

Giochi Asiatici Invernali
type: Concept
preferred label: Jogos Asiáticos de Inverno @pt-br
preferred label: Asienspiele Winter @de
preferred label: Winter Asian Games @en-gb
preferred label: juegos asíaticos de invierno @es
preferred label: 冬季アジア大会 @ja-jp
preferred label: Jeux asiatiques d'hiver @fr
definition: Giochi Asiatici Invernali
definition: juegos asíaticos de invierno @es
definition: Winter Asian Games @en-gb
definition: Jogos Asiáticos de Inverno @pt-br
definition: Jeux asiatiques d'hiver @fr
definition: 冬季アジア競技大会 @ja-jp
definition: --- @de
note: nessuno
in scheme: Subject Code
created: 2000-10-30T12:00:00+00:00
modified: 2010-12-15T17:01:09+00:00
broader: Evento sportivo
broad match: http://cv.iptc.org/newscodes/mediatopic/20001108

Giochi panamericani
type: Concept
preferred label: 全米競技大会 @ja-jp
preferred label: Panamerican Games @en-gb
preferred label: Jogos Pan-americanos @pt-pt
preferred label: juegos panamericanos @es
preferred label: Panamerikanische Spiele @de
preferred label: Jeux panaméricains @fr
definition: Jogos Pan-americanos @pt-br
definition: Jeux panaméricains @fr
definition: --- @de
definition: 全米競技大会 @ja-jp
definition: Panamerican Games @en-gb
definition: Giochi panamericani
definition: juegos panamericanos @es
note: nessuno
in scheme: Subject Code
created: 2000-10-30T12:00:00+00:00
modified: 2010-12-15T17:01:09+00:00
broader: Evento sportivo
broad match: http://cv.iptc.org/newscodes/mediatopic/20001108

Giochi africani
type: Concept
preferred label: juegos africanos @es
preferred label: Jogos Africanos @pt-pt
preferred label: Afrikaspiele @de
preferred label: African Games @en-gb
preferred label: Jeux africains @fr
preferred label: アフリカ競技大会 @ja-jp
definition: juegos africanos @es
definition: Jogos Africanos @pt-pt
definition: --- @de
definition: African Games @en-gb
definition: アフリカ競技大会 @ja-jp
definition: Giochi africani
definition: Jeux africains @fr
note: nessuno
in scheme: Subject Code
created: 2000-10-30T12:00:00+00:00
modified: 2010-12-15T17:01:09+00:00
broader: Evento sportivo
broad match: http://cv.iptc.org/newscodes/mediatopic/20001108

Giochi mediterranei
type: Concept
preferred label: Jogos Mediterrânicos @pt-pt
preferred label: 地中海沿岸競技大会 @ja-jp
preferred label: juegos mediterráneos @es
preferred label: Jeux méditerranéens @fr
preferred label: Mediterranean Games @en-gb
preferred label: Mediterrane Spiele @de
definition: juegos mediterráneos @es
definition: Jogos Mediterrânicos @pt-br
definition: --- @de
definition: Jeux méditerranéens @fr
definition: Giochi mediterranei
definition: Mediterranean Games @en-gb
definition: 地中海沿岸競技大会 @ja-jp
note: nessuno
in scheme: Subject Code
created: 2000-10-30T12:00:00+00:00
modified: 2010-12-15T17:01:09+00:00
broader: Evento sportivo
broad match: http://cv.iptc.org/newscodes/mediatopic/20001108

Giochi sudest asiatici
type: Concept
preferred label: Jeux du sud est asiatique @fr
preferred label: Jogos do Sudeste Asiático @pt-br
preferred label: 東南アジア競技大会 @ja-jp
preferred label: juegos del sudeste asiático @es
preferred label: Südostasienspiele @de
preferred label: SouthEast Asiatic Games @en-gb
definition: juegos del sudeste asiático @es
definition: Jeux du sud est asiatique @fr
definition: Jogos do Sudeste Asiático @pt-br
definition: --- @de
definition: Giochi sudest asiatici
definition: SouthEast Asiatic Games @en-gb
definition: 東南アジア競技大会 @ja-jp
note: nessuno
in scheme: Subject Code
created: 2000-10-30T12:00:00+00:00
modified: 2010-12-15T17:01:09+00:00
broader: Evento sportivo
broad match: http://cv.iptc.org/newscodes/mediatopic/20001108

Giochi panpacifici
type: Concept
preferred label: Panpazifische Spiele @de
preferred label: 環太平洋競技大会 @ja-jp
preferred label: PanPacific Games @en-gb
preferred label: juegos pan-pacíficos @es
preferred label: Jogos Pan-pacífico @pt-br
preferred label: Jeux Panpacifique @fr
definition: 環太平洋競技大会 @ja-jp
definition: PanPacific Games @en-gb
definition: Jogos Pan-pacífico @pt-br
definition: juegos pan-pacíficos @es
definition: Jeux Panpacifique @fr
definition: Giochi panpacifici
definition: --- @de
note: nessuno
in scheme: Subject Code
created: 2000-10-30T12:00:00+00:00
modified: 2010-12-15T17:01:09+00:00
broader: Evento sportivo
broad match: http://cv.iptc.org/newscodes/mediatopic/20001108

Giochi del sudpacifico
type: Concept
preferred label: SouthPacific Games @en-gb
preferred label: Jeux du Pacifique sud @fr
preferred label: Jogos do Pacífico Sul @pt-pt
preferred label: 南太平洋競技大会 @ja-jp
preferred label: Südpazifische Spiele @de
preferred label: juegos del pacífico sur @es
definition: Jeux du Pacifique sud @fr
definition: SouthPacific Games @en-gb
definition: --- @de
definition: Jogos do Pacífico Sul @pt-br
definition: juegos del pacífico sur @es
definition: Giochi del sudpacifico
definition: 南太平洋競技大会 @ja-jp
note: nessuno
in scheme: Subject Code
created: 2000-10-30T12:00:00+00:00
modified: 2010-12-15T17:01:09+00:00
broader: Evento sportivo
broad match: http://cv.iptc.org/newscodes/mediatopic/20001108

Giochi panarabici
type: Concept
preferred label: juegos panarábigos @es
preferred label: 全アラブ競技大会 @ja-jp
preferred label: Jogos Pan-árabes @pt-pt
preferred label: Panarabische Spiele @de
preferred label: PanArabic Games @en-gb
preferred label: Jeux panarabiques @fr
definition: Giochi panarabici
definition: juegos panarábigos @es
definition: --- @de
definition: Jogos Pan-árabes @pt-br
definition: Jeux panarabiques @fr
definition: PanArabic Games @en-gb
definition: 全アラブ競技大会 @ja-jp
note: nessuno
in scheme: Subject Code
created: 2000-10-30T12:00:00+00:00
modified: 2010-12-15T17:01:09+00:00
broader: Evento sportivo
broad match: http://cv.iptc.org/newscodes/mediatopic/20001108

Giochi estivi della buona volontà
type: Concept
preferred label: Summer Goodwill Games @en-gb
preferred label: 夏季交歓試合 @ja-jp
preferred label: Jogos da Boa Vontade @pt-pt
preferred label: juegos estivales de la buena voluntad @es
preferred label: Goodwill Games été @fr
preferred label: Sommer Goodwill Games @de
definition: Jogos da Boa Vontade @pt-br
definition: Goodwill Games été @fr
definition: 夏季交歓試合 @ja-jp
definition: Summer Goodwill Games @en-gb
definition: juegos estivales de la buena voluntad @es
definition: Giochi estivi della buona volontà
definition: --- @de
note: nessuno
in scheme: Subject Code
created: 2000-10-30T12:00:00+00:00
modified: 2010-12-15T17:01:09+00:00
broader: Evento sportivo
broad match: http://cv.iptc.org/newscodes/mediatopic/20001108

Giochi mondiali
type: Concept
preferred label: 世界大会 @ja-jp
preferred label: World games @en-gb
preferred label: Mondiaux @fr
preferred label: Jogos Mundiais @pt-pt
preferred label: juegos mundiales @es
preferred label: Weltspiele @de
definition: Una competizione in cui gareggiano atleti di classe mondiale
definition: Competencia desarrollada por atletas de clase mundial @es
definition: A competition featuring world class athletes @en-gb
definition: Competição com atletas internacionais. @pt-br
definition: 世界レベルで活躍する選手による競技会 @ja-jp
definition: rassemblement sportif à l'échelle mondiale @fr
definition: Wettbewerb, der von Athleten der Weltklasse ausgetragen wird. @de
note: nessuno
in scheme: Subject Code
created: 2000-10-30T12:00:00+00:00
modified: 2010-12-15T17:01:09+00:00
broader: Evento sportivo

Coppa del mondo
type: Concept
preferred label: World Cup @en-gb
preferred label: ワールドカップ @ja-jp
preferred label: taça do mundo @pt-pt
preferred label: Coupe du monde @fr
preferred label: Weltcup @de
preferred label: copa del mundo @es
preferred label: copa do mundo @pt-br
definition: coupe rassemblant des athlètes venant des pays des cinq continents @fr
definition: 五大陸からの選手が集まるスポーツ大会 @ja-jp
definition: Sports meeting with competitors from the five continents @en-gb
definition: Encuentro deportivo que reúne deportistas de los cinco continentes @es
definition: Incontro sportivo con atleti provenienti dai cinque continenti
definition: Evento esportivo com participantes dos 5 continentes. @pt-br
definition: Evento desportivo com participantes dos 5 continentes. @pt-pt
definition: Sportveranstaltung mit Wettkämpfern von den fünf Kontinenten. @de
note: nessuno
in scheme: Subject Code
created: 2000-10-30T12:00:00+00:00
modified: 2010-12-15T17:01:09+00:00
broader: Evento sportivo

Coppa intercontinentale
type: Concept
preferred label: インターコンチネンタルカップ @ja-jp
preferred label: copa intercontinental @pt-br
preferred label: Interkontinentaler Cup @de
preferred label: taça intercontinental @pt-pt
preferred label: Coupe intercontinentale @fr
preferred label: intercontinental cup @en-gb
definition: Encuentro deportivo que reúne competidores de diferentes continentes. @es
definition: 異なる大陸から選手が集まるスポーツ大会 @ja-jp
definition: coupe rassemblant des athlètes de plusieurs continents @fr
definition: Evento esportivo com participantes de diferentes continentes. @pt-br
definition: Sportveranstaltung, die Wettkämpfer aus verschiedenen Kontinenten zusammenbringt. @de
definition: Sports meeting bringing together competitors from different continents @en-gb
definition: Evento desportivo com participantes de diferentes continentes. @pt-pt
definition: Incontro sportivo che riunisce atleti di continenti diversi
note: typo fixed in Explanation @en-gb
note: nessuno
in scheme: Subject Code
created: 2000-10-30T12:00:00+00:00
modified: 2010-12-15T17:01:09+00:00
broader: Evento sportivo
broad match: http://cv.iptc.org/newscodes/mediatopic/20001108

Coppa continentale
type: Concept
preferred label: copa continental @es
preferred label: continental cup @en-gb
preferred label: Kontinentaler Cup @de
preferred label: taça continental @pt-pt
preferred label: コンチネンタルカップ @ja-jp
preferred label: Coupe continentale @fr
definition: Sportveranstaltung, die Wettkämpfer eines Kontinents zusammenbringt. @de
definition: Incontro di sport in cui gli atleti provengono da un unico continente
definition: Encuentro deportivo donde se dan cita competidores de un solo continente. @es
definition: Evento desportivo com participantes de um continente. @pt-pt
definition: Sports meeting where competitors come from a single continent @en-gb
definition: Evento esportivo com participantes de um continente. @pt-br
definition: １つの大陸(ヨーロッパ大陸)の選手が集まるスポーツ大会 @ja-jp
definition: coupe rassemblant des athlètes d'un continent @fr
note: nessuno
in scheme: Subject Code
created: 2000-10-30T12:00:00+00:00
modified: 2010-12-15T17:01:09+00:00
broader: Evento sportivo

Coppa internazionale
type: Concept
preferred label: copa internacional @es
preferred label: international cup @en-gb
preferred label: インターナショナルカップ @ja-jp
preferred label: Coupe internationale @fr
preferred label: taça internacional @pt-pt
preferred label: Internationaler Cup @de
definition: Evento desportivo com participantes de vários países. @pt-pt
definition: Sportveranstaltung, bei der die Wettkämpfer aus verschiedenen Ländern kommen. @de
definition: Encuentro deportivo donde se dan cita competidores de varias naciones. @es
definition: Incontro di sport in cui gli atleti provengono da nazioni diverse
definition: Evento esportivo com participantes de vários países. @pt-br
definition: coupe rassemblant des athlètes de plusieurs nations @fr
definition: Sports meeting where competitors come from several nations @en-gb
definition: 様々な国から選手が集まるスポーツ大会 @ja-jp
note: nessuno
in scheme: Subject Code
created: 2000-10-30T12:00:00+00:00
modified: 2010-12-15T17:01:09+00:00
broader: Evento sportivo

Coppa nazionale
type: Concept
preferred label: taça nacional @pt-pt
preferred label: copa nacional @pt-br
preferred label: ナショナルカップ @ja-jp
preferred label: National Cup @en-gb
preferred label: Coupe nationale @fr
preferred label: Nationaler Cup @de
definition: Sports meeting where competitors come from a single nation @en-gb
definition: Encuentro deportivo del que participan competidores de una nación. @es
definition: coupe à l'echelle d'un pays @fr
definition: Sportveranstaltung bei der die Wettkämpfer aus einem Land kommen. @de
definition: １つの国内から選手が集まるスポーツ大会 @ja-jp
definition: Evento esportivo com participantes de um país. @pt-br
definition: Incontro sportivo in cui gli atleti sono di un'unica nazione
definition: Evento desportivo com participantes de um país. @pt-pt
note: nessuno
in scheme: Subject Code
created: 2000-10-30T12:00:00+00:00
modified: 2010-12-15T17:01:09+00:00
broader: Evento sportivo

Coppa interregionale
type: Concept
preferred label: copa interregional @es
preferred label: Coupe interregionale @fr
preferred label: interregional cup @en-gb
preferred label: インターリージョンカップ @ja-jp
preferred label: Bundesliga @de
preferred label: taça inter-regional @pt-pt
preferred label: copa inter-regional @pt-br
definition: Incontro sportivo in cui gli atleti sono di regioni diverse
definition: 様々な地域から選手が集まるスポーツ大会 @ja-jp
definition: Evento desportivo com participantes de várias regiões. @pt-pt
definition: Sports meeting where competitors come from several regions @en-gb
definition: coupe rassemblant des athlétes de plusieurs régions @fr
definition: Evento esportivo com participantes de várias regiões. @pt-br
definition: Encuentro deportivo al que se dan cita competidores de dos o más regiones. @es
definition: Sportveranstaltung bei der die Wettkämpfer aus verschiedenen Regionen kommen. @de
note: nessuno
in scheme: Subject Code
created: 2000-10-30T12:00:00+00:00
modified: 2010-12-15T17:01:09+00:00
broader: Evento sportivo
broad match: http://cv.iptc.org/newscodes/mediatopic/20001108

Coppa regionale
type: Concept
preferred label: リージョンカップ @ja-jp
preferred label: regional cup @en-gb
preferred label: copa regional @pt-br
preferred label: Landesliga @de
preferred label: taça regional @pt-pt
preferred label: Coupe régionale @fr
definition: Encuentro deportivo del que participan competidores de una región. @es
definition: Sportveranstaltung bei die Wettkämpfer aus einer Region kommen. @de
definition: Sports meeting where competitors come from a single region @en-gb
definition: Incontro sportivo in cui gli atleti sono di una singola regione
definition: １つの地域から選手が集まるスポーツ大会 @ja-jp
definition: Evento desportivo com participantes de uma região. @pt-pt
definition: Evento esportivo com participantes de uma região. @pt-br
definition: compétition rassemblant des athlétes d'une région @fr
note: nessuno
in scheme: Subject Code
created: 2000-10-30T12:00:00+00:00
modified: 2010-12-15T17:01:09+00:00
broader: Evento sportivo

Coppa della lega
type: Concept
preferred label: Liga @de
preferred label: copa da liga @pt-br
preferred label: Coupe de Ligue @fr
preferred label: league cup @en-gb
preferred label: taça da liga @pt-pt
preferred label: copa de liga @es
preferred label: リーグカップ @ja-jp
definition: compétion au sein d'une ligue sportive @fr
definition: Competencia dentro de una liga deportiva. @es
definition: スポーツリーグの中での競技会 @ja-jp
definition: A competition within a sports league @en-gb
definition: Una competizione interna ad una lega sportiva
definition: Competição de uma liga esportiva. @pt-br
definition: Wettkampf innerhalb einer Sportliga. @de
definition: Competição de uma liga desportiva. @pt-pt
note: nessuno
in scheme: Subject Code
created: 2000-10-30T12:00:00+00:00
modified: 2010-12-15T17:01:09+00:00
broader: Evento sportivo
broad match: http://cv.iptc.org/newscodes/mediatopic/20001108

Campionato mondiale
type: Concept
preferred label: campeonato do mundo @pt-pt
preferred label: world championship @en-gb
preferred label: Championnat du Monde @fr
preferred label: 世界選手権大会 @ja-jp
preferred label: campeonato mundial @es
preferred label: Weltmeisterschaft @de
definition: championnat rassemblant des athlètes venant des pays des cinq continents @fr
definition: 五大陸から選手が集まる選手権 @ja-jp
definition: A championship where competitors from the five continents take part @en-gb
definition: Campeonato com participantes dos 5 continentes. @pt-br
definition: Campeonato Mundial. Campeonato donde toman parte competidores de los cinco continentes. @es
definition: Un campionato in cui gli atleti che vi prendono parte provengono da tutti e cinque i continenti
definition: Meisterschaft an der Wettkämpfer aus den fünf Kontinenten teilmehmen. @de
note: nessuno
in scheme: Subject Code
created: 2000-10-30T12:00:00+00:00
modified: 2010-12-15T17:01:09+00:00
broader: Evento sportivo

Campionato intercontinentale
type: Concept
preferred label: intercontinental championship @en-gb
preferred label: campeonato intercontinental @pt-pt
preferred label: Interkontinentale Meisterschaft @de
preferred label: Championnat intercontinental @fr
preferred label: インターコンチネンタル選手権大会 @ja-jp
definition: Campeonato del que toman parte competidores de diferentes continentes. @es
definition: 異なる大陸から選手が集まる選手権 @ja-jp
definition: A championship where competitors from the different continents take part @en-gb
definition: Campeonato com participantes de diferentes continentes. @pt-pt
definition: Meisterschaft an der Wettkämpfer aus verschiedenen Kontinenten teilnehmen. @de
definition: Un campionato in cui gli atleti che vi prendono parte sono di continenti diversi
definition: championnat au niveau de plusieurs continents @fr
note: nessuno
in scheme: Subject Code
created: 2000-10-30T12:00:00+00:00
modified: 2010-12-15T17:01:09+00:00
broader: Evento sportivo
broad match: http://cv.iptc.org/newscodes/mediatopic/20001108

Campionato continentale di primo livello
type: Concept
preferred label: 大陸選手権大会第１レベル @ja-jp
preferred label: continental championship 1st level @en-gb
preferred label: campeonato continental de primer nivel @es
preferred label: Championnat continental 1er niveau @fr
preferred label: Kontinentale Meisterschaft 1. Stufe @de
preferred label: campeonato continental nível 1 @pt-br
definition: Campeonato del que toman parte competidores de máximo nivel de un continente. @es
definition: Campeonato com participantes de 1º nível de um continente. @pt-br
definition: A championship where top level competitors from a single continent take part @en-gb
definition: championnat entre pays d'un même continent rassemblant des équipes du niveau le plus élévé @fr
definition: １つの大陸からトップ級の選手が集まる選手権 @ja-jp
definition: Un campionato in cui gli atleti di primo livello che vi prendono parte sono di un unico continente
definition: Meisterschaft, an der die besten Wettkämpfer eines Kontinents teilnehmen. @de
note: nessuno
in scheme: Subject Code
created: 2000-10-30T12:00:00+00:00
modified: 2010-12-15T17:01:09+00:00
broader: Evento sportivo
broad match: http://cv.iptc.org/newscodes/mediatopic/20001109

Campionato continentale di secondo livello
type: Concept
preferred label: campeonato continental nível 2 @pt-pt
preferred label: Championnat continental 2ème niveau @fr
preferred label: Kontinentale Meisterschaft 2. Stufe @de
preferred label: continental championship 2nd level @en-gb
preferred label: 大陸選手権大会第２レベル @ja-jp
preferred label: campeonato continental de segundo nivel @es
definition: Campeonato com participantes de 2º nível de um continente. @pt-br
definition: Meisterschaft an der die 2. besten Wettkämpfer eines Kontinents teilnehmen. @de
definition: Un campionato in cui vi partecipano atleti di secondo livello e di un unico continente
definition: １つの大陸から第２級レベルの選手が集まる選手権 @ja-jp
definition: Campeonato del que toman parte competidores de segundo nivel de un continente. @es
definition: championnat entre pays d'un même continent rassemblant des équipes du 2ème niveau @fr
definition: A championship where second string competitors from a single continent take part @en-gb
note: nessuno
in scheme: Subject Code
created: 2000-10-30T12:00:00+00:00
modified: 2010-12-15T17:01:09+00:00
broader: Evento sportivo
broad match: http://cv.iptc.org/newscodes/mediatopic/20001109

Campionato continentale di terzo livello
type: Concept
preferred label: continental championship 3rd level @en-gb
preferred label: campeonato continental de tercer nivel @es
preferred label: campeonato continental nível 3 @pt-br
preferred label: Kontinentale Meisterschaft 3. Stufe @de
preferred label: 大陸選手権大会第３レベル @ja-jp
preferred label: Championnat continental 3ème niveau @fr
definition: Campeonato com participantes de 3º nível de um continente. @pt-br
definition: championnat entre pays d'un même continent rassemblant des équipes du 3ème niveau @fr
definition: １つの大陸から第３級レベルの選手が集まる選手権 @ja-jp
definition: Meisterschaft an der die 3. besten Wettkämpfer eines Kontinents teilnehmen. @de
definition: Un campionato in cui gli atleti che vi prendono parte sono di terzo livello e di un continente in particolare
definition: A championship where third string competitors from a single continent take part @en-gb
definition: Campeonato del que toman parte competidores de tercer nivel de un continente. @es
note: nessuno
in scheme: Subject Code
created: 2000-10-30T12:00:00+00:00
modified: 2010-12-15T17:01:09+00:00
broader: Evento sportivo
broad match: http://cv.iptc.org/newscodes/mediatopic/20001109

Campionato nazionale di I livello
type: Concept
preferred label: national championship 1st level @en-gb
preferred label: campeonato nacional de primer nivel @es
preferred label: Championnat national 1er niveau @fr
preferred label: campeonato nacional nível 1 @pt-pt
preferred label: Nationale Meisterschaft 1. Stufe @de
preferred label: ナショナル選手権大会第１レベル @ja-jp
definition: A championship where top level competitors from a single nation take part @en-gb
definition: Un campionato in cui gli atleti che vi prendono parte sono di primo livello e di una nazione in particolare
definition: championnat au sein d'un même pays rassemblant des équipes du niveau le plus élévé @fr
definition: Campeonato com participantes de 1º nível de um país. @pt-pt
definition: Campeonato del que toman parte competidores de primer nivel de una nación. @es
definition: １つの国からトップ級の選手が集まる選手権 @ja-jp
definition: Meisterschaft an der die besten Wettkämpfer eines Landes teilnehmen. @de
note: nessuno
in scheme: Subject Code
created: 2000-10-30T12:00:00+00:00
modified: 2010-12-15T17:01:09+00:00
broader: Evento sportivo
broad match: http://cv.iptc.org/newscodes/mediatopic/20001115

Campionato nazionale di II livello
type: Concept
preferred label: campeonato nacional nível 2 @pt-br
preferred label: Championnat national 2eme niveau @fr
preferred label: ナショナル選手権大会第２レベル @ja-jp
preferred label: campeonato nacional de segundo nivel @es
preferred label: national championship 2nd level @en-gb
preferred label: Nationale Meisterschaft 2. Stufe @de
definition: １つの国から第２級の選手が集まる選手権 @ja-jp
definition: Meisterschaft an der die 2. besten Wettkämpfer eines Landes teilnehmen. @de
definition: Campeonato com participantes de 2º nível de um país. @pt-pt
definition: A championship where second string competitors from a single continent take part @en-gb
definition: championnat au sein d'un même pays rassemblant des équipes du 2ème niveau @fr
definition: Un campionato cui prendono parte concorrenti di II livello di una singola nazione
definition: Campeonato del que toman parte competidores de segundo nivel de una nación. @es
note: nessuno
in scheme: Subject Code
created: 2000-10-30T12:00:00+00:00
modified: 2010-12-15T17:01:09+00:00
broader: Evento sportivo
broad match: http://cv.iptc.org/newscodes/mediatopic/20001115

Campionato nazionale di III livello
type: Concept
preferred label: campeonato nacional nível 3 @pt-br
preferred label: Nationale Meisterschaft 3. Stufe @de
preferred label: campeonato nacional de tercer nivel @es
preferred label: Championnat national 3ème niveau @fr
preferred label: national championship3rdlevel @en-gb
preferred label: ナショナル選手権大会第３レベル @ja-jp
definition: Un campionato cui prendono parte i concorrenti di III livello di una singola nazione
definition: Campeonato com participantes de 3º nível de um país. @pt-pt
definition: １つの国から第３級の選手が集まる選手権 @ja-jp
definition: Campeonato del que toman parte competidores de tercer nivel de una nación. @es
definition: A championship where third string competitors from a single continent take part @en-gb
definition: championnat au sein d'un même pays rassemblant des équipes du 3 ème niveau @fr
definition: Meisterschaft an der die 3. besten Wettkämpfer eines Landes teilnehmen. @de
note: nessuno
in scheme: Subject Code
created: 2000-10-30T12:00:00+00:00
modified: 2010-12-15T17:01:09+00:00
broader: Evento sportivo
broad match: http://cv.iptc.org/newscodes/mediatopic/20001115

Campionato nazionale di IV livello
type: Concept
preferred label: campeonato nacional de cuarto nivel @es
preferred label: campeonato nacional nível 4 @pt-pt
preferred label: Championnat national 4ème niveau @fr
preferred label: Nationale Meisterschaft 4. Stufe @de
preferred label: ナショナル選手権大会第４レベル @ja-jp
preferred label: national championship 4th level @en-gb
definition: Campeonato com participantes de 4º nível de um país. @pt-pt
definition: Un campionato cui prendono parte concorrenti di IV livello di una singola nazione
definition: Campeonato del que toman parte competidores de cuarto nivel de una nación. @es
definition: Meisterschaft an der die 4. besten Wettkämpfer eines Landes teilnehmen. @de
definition: １つの国から第４級の選手が集まる選手権 @ja-jp
definition: A championship where fourth string competitors from a single continent take part @en-gb
definition: championnat au sein d'un même pays rassemblant des équipes du 4ème niveau @fr
note: nessuno
in scheme: Subject Code
created: 2000-10-30T12:00:00+00:00
modified: 2010-12-15T17:01:09+00:00
broader: Evento sportivo
broad match: http://cv.iptc.org/newscodes/mediatopic/20001115

Campionato regionale
type: Concept
preferred label: campeonato regional @pt-br
preferred label: regional championship @en-gb
preferred label: 地域選手権大会 @ja-jp
preferred label: Championnat régional @fr
preferred label: Regionalmeisterschaft @de
definition: championnat au sein d'une même région @fr
definition: Campeonato del que toman parte competidores de una región. @es
definition: Campeonato com participantes de uma região. @pt-br
definition: Meisterschaft an der die Wettkämpfer einer Region teilnehmen. @de
definition: Un campionato cui prendono parte concorrenti di una singola regione
definition: １つの地域から選手が集まる選手権 @ja-jp
definition: A championship where competitors from a single region take part @en-gb
note: nessuno
in scheme: Subject Code
created: 2000-10-30T12:00:00+00:00
modified: 2010-12-15T17:01:09+00:00
broader: Evento sportivo

Gran Premio
type: Concept
preferred label: Grande Prémio @pt-pt
preferred label: Grande Prêmio @pt-br
preferred label: Grand Prix @de
preferred label: gran premio @es
preferred label: グランプリ @ja-jp
definition: Competizione sportiva di alto livello, molto spesso automobilismo o di ippica
definition: Competición deportiva de alto nivel, sobre todo carreras @es
definition: Sportwettbewerb auf hohem Niveau, meist im Motorsport. @de
definition: Competição desportiva de alto nível, sobretudo de desportos motorizados. @pt-pt
definition: High level sports competition, most often motor racing @en-gb
definition: 大抵はモーターレースで行われる、ハイレベルのスポーツ競技 @ja-jp
definition: Competição esportiva de alto nível, sobretudo de esportes motorizados. @pt-br
definition: Compétition de haut niveau, la plupart du temps automobile @fr
note: nessuno
in scheme: Subject Code
created: 2000-10-30T12:00:00+00:00
modified: 2010-12-15T17:01:09+00:00
broader: Evento sportivo
broad match: http://cv.iptc.org/newscodes/mediatopic/20001108

Competizione intercontinentale
type: Concept
preferred label: intercontinental tournament @en-gb
preferred label: Tournoi intercontinental @fr
preferred label: torneio intercontinental @pt-pt
preferred label: Interkontinentales Tunier @de
preferred label: インターコンチネンタル･トーナメント @ja-jp
preferred label: circuito intercontinental @es
definition: 様々な大陸から選手が集まるトーナメント大会 @ja-jp
definition: Competizione cui prendono parte atleti di diversi continenti
definition: Torneio com participantes dos 5 continentes. @pt-br
definition: Turnier an dem Wettkämpfer von verschiedenen Kontinenten teilnehmen. @de
definition: Tournament where competitors from several continents take part @en-gb
definition: Circuito del que toman parte competidores de ciertos continentes. @es
definition: tournoi entre compétiteurs de plusieurs continents @fr
note: nessuno
in scheme: Subject Code
created: 2000-10-30T12:00:00+00:00
modified: 2010-12-15T17:01:09+00:00
broader: Evento sportivo
broad match: http://cv.iptc.org/newscodes/mediatopic/20001108

Competizione continentale
type: Concept
preferred label: コンチネンタル･トーナメント @ja-jp
preferred label: Kontinentales Tunier @de
preferred label: torneio continental @pt-pt
preferred label: continental tournament @en-gb
preferred label: Tournoi continental @fr
preferred label: circuito continental @es
definition: Torneio com participantes de um continente. @pt-br
definition: Turnier an dem Wettkämpfer aus einem Kontinent teilnehmen. @de
definition: １つの大陸から選手が集まるトーナメント大会 @ja-jp
definition: Circuito del que toman parte competidores de un continente. @es
definition: Competizione cui prendono parte atleti di un singolo continente
definition: Tournament where competitors from a single continent take part @en-gb
definition: tournoi entre compétiteurs d'un même continent @fr
note: nessuno
in scheme: Subject Code
created: 2000-10-30T12:00:00+00:00
modified: 2010-12-15T17:01:09+00:00
broader: Evento sportivo
broad match: http://cv.iptc.org/newscodes/mediatopic/20001108

Competizione internazionale
type: Concept
preferred label: torneio internacional @pt-br
preferred label: Tournoi international @fr
preferred label: Internationales Turnier @de
preferred label: international tournament @en-gb
preferred label: circuito internacional @es
preferred label: インターナショナル･トーナメント @ja-jp
definition: Torneio com participantes de vários países. @pt-pt
definition: 様々な大陸から選手が集まるトーナメント大会 @ja-jp
definition: Turnier an dem Wettkämpfer aus verschiedenen Ländern teilnehmen. @de
definition: Circuito del que toman parte competidores de ciertas naciones. @es
definition: Tournament where competitors from several nations take part @en-gb
definition: Competizione alla quale partecipano concorrenti di diverse nazioni
definition: tournoi entre compétiteurs de plusieurs pays @fr
note: nessuno
in scheme: Subject Code
created: 2000-10-30T12:00:00+00:00
modified: 2010-12-15T17:01:09+00:00
broader: Evento sportivo
broad match: http://cv.iptc.org/newscodes/mediatopic/20001108

Gara nazionale
type: Concept
preferred label: Nationales Tunier @de
preferred label: torneio nacional @pt-pt
preferred label: national tournament @en-gb
preferred label: Tournoi national @fr
preferred label: circuito nacional @es
preferred label: ナショナル･トーナメント @ja-jp
definition: tournoi entre compétiteurs d'un même pays @fr
definition: １つの国から選手が集まるトーナメント大会 @ja-jp
definition: Circuito del que toman parte competidores de una nación. @es
definition: Torneio com participantes de um país. @pt-pt
definition: Turnier an dem Wettkämpfer aus einem Land teilnehmen. @de
definition: Competizione cui prendono parte concorrenti di una singola nazione
definition: Tournament where competitors from a single nation take part @en-gb
note: nessuno
in scheme: Subject Code
created: 2000-10-30T12:00:00+00:00
modified: 2010-12-15T17:01:09+00:00
broader: Evento sportivo
broad match: http://cv.iptc.org/newscodes/mediatopic/20001108

Gara tra nazioni
type: Concept
preferred label: 国際競技会 @ja-jp
preferred label: competencia inter naciones @es
preferred label: competição internações @pt-br
preferred label: inter-nations competition @en-gb
preferred label: Inter Nations Competition @de
preferred label: Compétition internationale @fr
definition: Torneio com participantes de várias nações. @pt-pt
definition: 様々な国から選手が集まるトーナメント大会 @ja-jp
definition: compétition entre athlétes de plusieurs nations @fr
definition: Wettbewerb an dem Athleten aus verschiedenen Ländern teilnehmen. @de
definition: Tournament where athletes from several nations take part @en-gb
definition: Circuito del que toman parte atletas de ciertas naciones. @es
definition: Competizione cui prendono parte atleti di diverse nazioni
note: nessuno
in scheme: Subject Code
created: 2000-10-30T12:00:00+00:00
modified: 2010-12-15T17:01:09+00:00
broader: Evento sportivo
broad match: http://cv.iptc.org/newscodes/mediatopic/20001108

Gara tra circoli
type: Concept
preferred label: competição interclubles @pt-pt
preferred label: Inter Clubs Competition @de
preferred label: クラブ間競技会 @ja-jp
preferred label: inter-clubs competition @en-gb
preferred label: Compétition inter-clubs @fr
preferred label: competencia inter clubes @es
definition: Circuito del que toman parte competidores de ciertos clubes. @es
definition: Torneio com participantes de vários clubes. @pt-pt
definition: Wettbewerb an dem Wettkämpfer aus verschiedenen Clubs teilnehmen. @de
definition: Tournament where competitors from several clubs take part @en-gb
definition: Competizione cui prendono parte concorrenti di diversi circoli
definition: compétitions entre plusieurs clubs sportifs @fr
definition: 様々なクラブから選手が集まるトーナメント大会 @ja-jp
note: nessuno
in scheme: Subject Code
created: 2000-10-30T12:00:00+00:00
modified: 2010-12-15T17:01:09+00:00
broader: Evento sportivo
broad match: http://cv.iptc.org/newscodes/mediatopic/20001108

Gara amichevole
type: Concept
preferred label: Compétition amicale @fr
preferred label: competencia amistosa @es
preferred label: 親善試合 @ja-jp
preferred label: friendly competition @en-gb
preferred label: Freundschaftsspiel @de
preferred label: competição particular @pt-pt
definition: Sports giocati ma non in competizione
definition: Sports played but not in a tournament @en-gb
definition: competencia amistosa @es
definition: Competição amistosa, fora de campeonato ou torneio. @pt-br
definition: Compétition amicale @fr
definition: トーナメント試合ではないスポーツ @ja-jp
definition: Sport der ausgeübt wird ohne Turnier. @de
note: nessuno
in scheme: Subject Code
created: 2000-10-30T12:00:00+00:00
modified: 2010-12-15T17:01:09+00:00
broader: Evento sportivo
broad match: http://cv.iptc.org/newscodes/mediatopic/20001108

Competizione all-stars
type: Concept
preferred label: competição all-stars @pt-pt
preferred label: competencia de todas las estrellas @es
preferred label: Compétition all-stars @fr
preferred label: All-stars Competition @de
preferred label: オールスター競技会 @ja-jp
preferred label: all-stars competition @en-gb
definition: Competizione tra squadre composte da stelle di una particolare disciplina
definition: 招待されたスター選手から構成されたチーム間の競技 @ja-jp
definition: Competição entre equipas compostas por estrelas convidadas. @pt-pt
definition: compétition rassemblant des équipes constituées de vedettes @fr
definition: Competition between teams made up of invited stars @en-gb
definition: Competición entre equipos de estrellas invitadas. @es
definition: Wettkampf zwischen Teams aus eingeladenen Stars. @de
definition: Competição entre equipes compostas por estrelas convidadas. @pt-br
note: nessuno
in scheme: Subject Code
created: 2000-10-30T12:00:00+00:00
modified: 2010-12-15T17:01:09+00:00
broader: Evento sportivo
broad match: http://cv.iptc.org/newscodes/mediatopic/20001108

Esibizione
type: Concept
preferred label: exhibición @es
preferred label: 公開競技 @ja-jp
preferred label: exibição @pt-pt
preferred label: Vorführung @de
preferred label: exhibition @en-gb
preferred label: Exhibition @fr
definition: Demonstration @de
definition: Dimostrazione
definition: démonstration @fr
definition: demonstration @en-gb
definition: デモンストレーション @ja-jp
definition: Demonstração @pt-pt
definition: Demonstración @es
note: nessuno
in scheme: Subject Code
created: 2000-10-30T12:00:00+00:00
modified: 2010-12-15T17:01:09+00:00
broader: Evento sportivo
broad match: http://cv.iptc.org/newscodes/mediatopic/20001108

Super Bowl
type: Concept
preferred label: スーパーボウル @ja-jp
preferred label: super tazón @es
definition: チャンピオンを決めるアメリカンフットボールファイナル @ja-jp
definition: Finale del football americano che determina il campione (della lega)
definition: finale du championnat de football américain aux Etats-Unis @fr
definition: Wettbewerb, in dem die beste Mannschaft der amerikanischen Profi-Football-Liga (NFL=National Football League) ermittelt wird. @de
definition: Final de futebol americano que determina o campeão. @pt-br
definition: The American football final that determines the champion @en-gb
definition: Final del fútbol americano que determina al campeón de liga. @es
note: nessuno
in scheme: Subject Code
created: 2003-04-05T12:00:00+00:00
modified: 2012-07-10T12:00:00+00:00
broader: Evento sportivo
broad match: http://cv.iptc.org/newscodes/mediatopic/20001108

Giochi paraolimpici
type: Concept
preferred label: Jeux paralympiques @fr
preferred label: Paralympics @de
preferred label: Jogos Paralímpicos @pt-pt
preferred label: juegos paralímpicos @es
preferred label: パラリンピック @ja-jp
preferred label: paralympic games @en-gb
preferred label: Jogos Paraolímpicos @pt-br
definition: Giochi olimpici per atleti disabili
definition: Olympische Spiele für Athleten mit Behinderungen. @de
definition: Jogos Olímpicos para atletas com deficiências físicas. @pt-pt
definition: Jeux Olympiques pour les athlètes ayant un handicap @fr
definition: Olympic style Games for athletes with a disability @en-gb
definition: Juegos Olímpicos para atletas con deficiencias físicas. @es
definition: 障害があるスポーツ選手のためのオリンピック形式の大会 @ja-jp
note: nessuno
in scheme: Subject Code
created: 2004-10-13T12:00:00+00:00
modified: 2012-07-10T12:00:00+00:00
broader: Evento sportivo
broad match: http://cv.iptc.org/newscodes/mediatopic/20001108

樽回り競走
type: Concept
preferred label: Barrel Racing @de
preferred label: Barrel racing
preferred label: barrel racing @en-gb
definition: Disciplina di rodeo
definition: Disciplina de rodeo @es
definition: discipline du rodéo @fr
definition: ロデオ分野 @ja-jp
definition: Rodeo discipline @en-gb
definition: Disciplina de rodeio @pt-br
definition: Rodeo Disziplin. @de
note: nessuno
in scheme: Subject Code
created: 2000-10-30T12:00:00+00:00
modified: 2010-12-15T17:01:09+00:00
broader: rodeio

Vitello al lazo
type: Concept
preferred label: 子牛縛り @ja-jp
preferred label: calf roping @pt-br
preferred label: Calf roping @fr
preferred label: Calf Roping @de
definition: Disciplina de rodeo @es
definition: Rodeo discipline @en-gb
definition: ロデオ分野 @ja-jp
definition: Disciplina de rodeio @pt-br
definition: discipline du rodéo @fr
definition: Disciplina di rodeo
definition: Rodeo Disziplin. @de
note: nessuno
in scheme: Subject Code
created: 2000-10-30T12:00:00+00:00
modified: 2010-12-15T17:01:09+00:00
broader: rodeio

Monta del toro
type: Concept
preferred label: rodeo de toros @es
preferred label: bull riding @en-gb
preferred label: 雄牛乗り @ja-jp
preferred label: Bullenreiten @de
preferred label: Bull riding @fr
definition: ロデオ分野 @ja-jp
definition: Rodeo discipline @en-gb
definition: Disciplina de rodeo @pt-pt
definition: Disciplina de rodeio @pt-br
definition: Disciplina di rodeo
definition: Rodeo Disziplin. @de
definition: discipline du rodéo @fr
note: nessuno
in scheme: Subject Code
created: 2000-10-30T12:00:00+00:00
modified: 2010-12-15T17:01:09+00:00
broader: rodeio

Bulldogging
type: Concept
preferred label: bulldogging @es
preferred label: 雄牛追い @ja-jp
definition: discipline du rodéo @fr
definition: Rodeo discipline @en-gb
definition: Disciplina de rodeio @pt-br
definition: ロデオ分野 @ja-jp
definition: Disciplina di rodeo
definition: Disciplina de rodeo @pt-pt
definition: Rodeo Disziplin @de
note: nessuno
in scheme: Subject Code
created: 2000-10-30T12:00:00+00:00
modified: 2010-12-15T17:01:09+00:00
broader: rodeio

saddle bronc
type: Concept
preferred label: Saddle bronc
preferred label: Saddle Bronc @de
preferred label: 鞍かけ野生馬乗り @ja-jp
definition: Disciplina di rodeo
definition: discipline du rodéo @fr
definition: Rodeo Disziplin. @de
definition: ロデオ分野 @ja-jp
definition: Disciplina de rodeo @es
definition: Rodeo discipline @en-gb
definition: Disciplina de rodeio @pt-br
note: nessuno
in scheme: Subject Code
created: 2000-10-30T12:00:00+00:00
modified: 2010-12-15T17:01:09+00:00
broader: rodeio

Senza sella
type: Concept
preferred label: bareback @en-gb
preferred label: espalda desnuda @es
preferred label: Bareback @fr
preferred label: 裸馬乗り @ja-jp
definition: Disciplina de rodeo @pt-pt
definition: discipline du rodéo @fr
definition: Disciplina de rodeio @pt-br
definition: Disciplina di rodeo
definition: ロデオ分野 @ja-jp
definition: Rodeo Disziplin. @de
definition: Rodeo discipline @en-gb
note: nessuno
in scheme: Subject Code
created: 2000-10-30T12:00:00+00:00
modified: 2010-12-15T17:01:09+00:00
broader: rodeio

Capra al lazo
type: Concept
preferred label: ヤギ縛り @ja-jp
preferred label: Goat Roping @de
preferred label: enlace de cabra @es
preferred label: goat roping @pt-br
preferred label: Goat roping @fr
definition: ロデオ分野 @ja-jp
definition: Disciplina de rodeo @pt-pt
definition: Rodeo Disziplin @de
definition: Disciplina di rodeo
definition: discipline du rodéo @fr
definition: Disciplina de rodeio @pt-br
definition: Rodeo discipline @en-gb
note: nessuno
in scheme: Subject Code
created: 2000-10-30T12:00:00+00:00
modified: 2010-12-15T17:01:09+00:00
broader: rodeio

Finale
type: Concept
preferred label: Ultimate @fr
preferred label: ultimate @en-gb
preferred label: アルティメット @ja-jp
preferred label: últimate @es
definition: Team game. Played outdoors on soccer-size field with 7 players per team and indoors with 5 players per team. Games are played to a preset number of goals. Goals are scored by passing the disc to a team-member catching it inside the goal area. @en-gb
definition: Jogo de frisbee com equipes. Joga-se ao ar livre, em campo do tamanho de um campo de futebol, com duas equipes de 7 jogadores, ou em recintos fechados, com duas equipes de 5 jogadores. @pt-br
definition: jeu de fresbee opposants deux équipes de 5 ou 7 joueurs en fonction du terrain en plein air ou couvert @fr
definition: チーム･ゲーム。屋外はサッカーサイズのフィールドに1チーム7人で、屋内では1チーム5人でプレーする。ゲームは、あらかじめセットされた数のゴールでプレーされる。ゴールは、ディスクをゴール・エリア内でそれを捕らえるチーム・メンバーへ渡すことにより得点される @ja-jp
definition: Juego en equipo. Se juega al aire libre en una cancha del tamaño de una cancha de fútbol con 7 jugadores por equipo y bajo techo con 5 jugadores por equipo. El juego se disputa hasta un número preestablecido de goles. Los goles se marcan pasando el disco. @es
definition: Mannschaftswettbewerb. Wird im Freien gespielt auf einem fußballfeldgroßen Platz mit sieben Spielern pro Mannschaft, in der Halle mit fünf Spielern pro Team. Spiele werden bis zu einem festgelegten Punktestand (manchmal auch Zeitlimit) durchgeführt. Punkte werden gemacht, indem die Wurfscheibe zu einem anderen Spieler des Teams geworfen wird und innerhalb des Torbereichs gefangen wird. @de
definition: Gioco di squadra all'aperto su un campo di dimensioni pari a quello di calcio con sette atleti per squadra, e cinque per quello al coperto. Il gioco termina al raggiungimento di un determinato numero di goal, le quali, sono segnate passando il disco ad un compagno che lo lancia nell'area avversaria di goal.
definition: Jogo de disco voador com equipas. Joga-se ao ar livre, num campo do tamanho de um campo de futebol, com duas equipas de 7 jogadores, ou em recintos fechados, com duas equipas de 5 jogadores. @pt-pt
note: Explanation shortened @en-gb
note: nessuno
in scheme: Subject Code
created: 2000-10-30T12:00:00+00:00
modified: 2010-12-15T17:01:09+00:00
broader: Frisbee
broad match: http://cv.iptc.org/newscodes/mediatopic/20000938

Guts
type: Concept
preferred label: guts @pt-pt
preferred label: ガッツ @ja-jp
definition: Jogo de disco voador disputado por duas equipas de 5 jogadores, que tentam intercetar os lançamentos dos adversários. @pt-pt
definition: Gioco di squadra in cui si sfidano due squadre di cinque atleti ciascuna. Le squadre a turno lanciano il disco verso l'altra squadra. I punti si segnano se la squadra avversaria non afferra il disco
definition: Mannschaftswettbewerb, indem sich fünf Spieler jeder Mannschaft jeweils den gegnerischen Spielern gegenüberstehen. Die Scheibe wird ins gegnerische Feld geworfen. Punkte werden erzielt , wenn das gegnerische Team die Scheibe nicht fangen kann. @de
definition: Team game where two teams of 5 players each face each other. Teams take turns to throw the disc towards the other team. Points are scored if the opposing team does not catch the disc. @en-gb
definition: jeu de frisbee opposants deux équipes de 5 essayant d'intercepter les lancers @fr
definition: Juego en equipo donde se enfrentan dos equipos de 5 jugadores cada uno. Los equipos se turnan para lanzar el disco hacia el otro equipo. Se marcan puntos si el equipo contrincante no atrapa el disco. @es
definition: 5人づつ2チームが、互いに面するチーム･ゲーム。チームが他のチームに向かってディスクを交代で投げる。対戦チームがディスクをキャッチしないとき、ポイントが得点される @ja-jp
definition: Jogo de frisbee disputado por duas equipes de 5 jogadores, que tentam interceptar os lançamentos dos adversários. @pt-br
note: nessuno
in scheme: Subject Code
created: 2000-10-30T12:00:00+00:00
modified: 2010-12-15T17:01:09+00:00
broader: Frisbee
broad match: http://cv.iptc.org/newscodes/mediatopic/20000938

Overall
type: Concept
preferred label: overall @pt-br
preferred label: オーバーオール @ja-jp
preferred label: general @es
definition: 種目ではなく、個人種目競技会。優勝者は、複数の種目で高得点を得たプレーヤーに与えられる(個人総合選手権のようなもの) @ja-jp
definition: Não constitui um evento em si mesmo, mas na maioria das competições com provas individuais, o vencedor será o jogador com a pontuação combinada mais elevada. @pt-br
definition: Non un evento in sè ma presente nella maggior parte delle competizioni individuali in cui il vincitore è l'atleta con il punteggio combinato più alto
definition: Kein eigentlicher Wettbewerb, aber in den meisten Einzeldisziplinen wird der Sieger des Wettbewerbs mit der höchsten zusammengerechneten erzielten Punktzahl gekürt. @de
definition: classement combiné de différentes épreuves @fr
definition: Not an event in itself but in most competitions with individual events the winner of the competition will be awarded to the player with the highest combined score in the events. @en-gb
definition: No un evento en sí mismo, pero en la mayoría de las competencias con eventos individuales, el ganador de la misma será premiado como el jugador con el más alto puntaje combinado en los eventos. @es
note: nessuno
in scheme: Subject Code
created: 2000-10-30T12:00:00+00:00
modified: 2010-12-15T17:01:09+00:00
broader: Frisbee
broad match: http://cv.iptc.org/newscodes/mediatopic/20000938

Distanza
type: Concept
preferred label: Distance @fr
preferred label: distância @pt-pt
preferred label: ディスタンス @ja-jp
preferred label: distancia @es
preferred label: distance @en-gb
definition: jeu de frisbee consistant à lancer le plus loin possible l'engin @fr
definition: The object is to throw the disc as far as possible. Each player get five throws per turn. Throws are made downwind. World record is over 200 meters. @en-gb
definition: Lo scopo è lanciare il disco il più lontano possibile. Ogni giocatore ha a disposizione cinque tiri per turno
definition: 目的は可能な限り、遠くにディスクを投げること。各プレーヤーがターン毎に5回投げる。風下に投げる。世界記録は200メートルを越えている @ja-jp
definition: Ziel ist es die Wurfscheibe so weit wie möglich zu werfen. Jeder Spieler hat fünf Versuche pro Durchgang in Windrichtung. Jeder Spieler hat 5 Würfe pro Runde. Weltrekord liegt bei über 200 Metern. @de
definition: O objetivo é lançar o disco o mais longe possível. Cada jogador tem direito a 5 lançamentos, que são feitos na direção do vento. O recorde mundial é de mais de 200 metros. @pt-pt
definition: El objetivo es lanzar el disco lo más lejos posible. Cada jugador tiene cinco lanzamientos por turno. Los lanzamientos se hacen en la dirección del viento. El récord mundial es de más de 200 metros. @es
note: nessuno
in scheme: Subject Code
created: 2000-10-30T12:00:00+00:00
modified: 2010-12-15T17:01:09+00:00
broader: Frisbee
broad match: http://cv.iptc.org/newscodes/mediatopic/20000938

ディスカソン
type: Concept
preferred label: discathon @en-gb
preferred label: discatón @es
preferred label: Discathon
definition: Variante de frisbee cujo objetivo é lançar o disco e correr através de um parque de aproximadamente 1km. Quatro jogadores competem em cada eliminatória. Têm dois discos cada um, podendo levar um terceiro de reserva. O segundo disco é lançado a partir do ponto onde o primeiro disco parou. @pt-br
definition: variante du jeu de frisbee @fr
definition: Aufgabe ist es einen ein km langen Kurs durch Werfen der Scheibe und Laufen zu bewältigen. Vier Spieler bestreiten ein Rennen. Sie haben jeder zwei Wurfscheiben. Sie können auch eine dritte Wurfscheibe in Reserve mitführen. Die zweite Scheibe muss geworfen werden. @de
definition: Lo scopo è lanciare il disco e correre lungo un percorso di circa 1 chilometro. In ciascuna eliminatoria competono quattro atleti con due dischi ciascuno, che possono portare un terzo disco di riserva. Il secondo disco viene lanciato dal punto esatto in cui è caduto il primo disco lanciato.
definition: The object is to throw and run a park course of about 1 kilometre. Four players compete in each heat. They have two discs each. They may also carry a third disc in reserve. Where one thrown disc stops the second disc must be thrown. @en-gb
definition: El objetivo es lanzar y correr a través de una cancha parque de aproximadamente 1 kilómetro. Cuatro jugadores compiten en cada eliminatoria. Estos tienen dos discos cada uno, y también pueden llevar un tercero de reserva. @es
definition: 目的は約1キロのパークコースを投げて走ること。1回に4人のプレーヤーが競う。彼らはそれぞれ2枚のディスクを持っている。さらに予備として3枚目のディスクを携帯しても構わない。投げられたディスクが停止したところで第2のディスクが投げられなければならない @ja-jp
note: Explanation shortened @en-gb
note: nessuno
in scheme: Subject Code
created: 2000-10-30T12:00:00+00:00
modified: 2010-12-15T17:01:09+00:00
broader: Frisbee
broad match: http://cv.iptc.org/newscodes/mediatopic/20000938

ddc
type: Concept
preferred label: DDC
preferred label: ダブルディスクコート @ja-jp
definition: Abkürzung für Double Disc Court. Zwei Spieler pro Mannschaft stehen sich in je einem 13x13 m großen quadratischen Spielfeld gegenüber. Die Mannschaften werfen jeweils einer Wurfscheibe ins gegnerische Feld. Die Scheiben werden hin- und hergeworfen, bis eine den Boden berührt. Punkte werden gemacht indem die Scheibe gestoppt wird. @de
definition: Abbreviation for Double Disc Court. Two players per team in a square 13x13 metre. The teams start with one disc per team and throw at each other. Discs are thrown back and forth until one or both hit the ground. @en-gb
definition: Abbreviazione per *Double Disc Court* (Campo per il Disco Doppio). Due atleti per squadra in un campo 13 m x 13. Le squadre iniziano con un disco a testa che si lanciano a vicenda. I dischi sono lanciati avanti e dietro finchè uno o entrambi non cadono a terra.
definition: *Abreviatura de **Double Disc Court** (Campo de Disco Duplo), variante de frisbee com 2 jogadores por equipa num quadrado de 13x13 metros. As equipas atiram os disco uma à outra até que um ou ambos caiam no solo.* @pt-pt
definition: variante du jeu de frisbee @fr
definition: Abreviación de Double Disc Court (Cancha de Doble Disco). Dos jugadores por equipo en un cuadrado de 13x13 metros. Los equipos comienzan con un disco por equipo y lo lanzan uno al otro. Los discos son lanzados de ida y de vuelta. @es
definition: *Abreviatura de **Double Disc Court** (Campo de Disco Duplo), variante de frisbee com 2 jogadores por equipe num quadrado de 13x13 metros. As equipes atiram os disco uma à outra até que um ou ambos caiam no solo.* @pt-br
definition: ダブルディスクコートの略語。13メートル四方で、1チームあたり2人のプレーヤー。チームは1つのチームあたり1枚のディスクで始まり、お互いに投げる。ディスクは1つまたは両方が地面にぶつかるまで前後に投げられる @ja-jp
note: nessuno
note: Explanation shortened @en-gb
in scheme: Subject Code
created: 2000-10-30T12:00:00+00:00
modified: 2010-12-15T17:01:09+00:00
broader: Frisbee
broad match: http://cv.iptc.org/newscodes/mediatopic/20000938

SCF
type: Concept
preferred label: scf @es
preferred label: セルフコートフライト @ja-jp
definition: セルフコートフライトの略語。MTA(Maximum Time Aloft)とTRC(Throw Run Catch)の2つのサブイベントに分けられる。両方のサブイベントとも、プレーヤーがディスクを投げ、それが地面を打つ前に、片手で見事にそれをつかむために走る @ja-jp
definition: Abbreviation for Self Caught Flights. Divided into two sub events called MTA (Maximum Time Aloft) and TRC (Throw Run Catch). In both sub events the player throws a disc and then runs to catch it with one hand before it hits the ground. @en-gb
definition: *Abreviatura de **Self Caught Flights** (Voos Auto Apanhados), variante de frisbee dividida em dois subeventos. Em ambos, o jogador lança o disco e corre para o apanhar com uma mão antes de ele bater no solo.* @pt-br
definition: variante du jeu de frisbee @fr
definition: Abbreviazione per *Self Caught Flights* (Voli Auto Afferrati). Diviso in due sotto-gare chiamate MTA - Maximum Time Aloft (Massimo Tempo in Alto) e TRC - Throw Run Catch (Lanciare Correre Afferrare). In entrambe le sotto-gare i giocatori lanciano un disco che poi afferrano con una mano senza farlo cadere a terra
definition: Abreviación de *Self Caught Flights* (Vuelos Auto Atrapados). Dividido en dos sub-eventos llamados MTA (Maximum Time Aloft) (Tiempo Máximo En el Aire) y TRC (Throw Run Catch) (Lanzar Correr Atrapar). @es
definition: Abkürzung für Self Caught Flights. Unterteilt in zwei Dsziplinen MTA (Maximum Time Aloft) und TRC (Throw Run Catch) genannt. In beiden Einzeldisziplinen kommt es darauf an, die Scheibe zu werfen, hinterherzulaufen und sie mit einer Hand zu fangen bevor sie den Boden berührt. @de
note: Explanation shortened @en-gb
note: nessuno
in scheme: Subject Code
created: 2000-10-30T12:00:00+00:00
modified: 2010-12-15T17:01:09+00:00
broader: Frisbee
broad match: http://cv.iptc.org/newscodes/mediatopic/20000938

Stile libero
type: Concept
preferred label: freestyle @en-gb
preferred label: フリースタイル @ja-jp
preferred label: Freestyle @fr
preferred label: estilo livre @pt-br
preferred label: estilo libre @es
preferred label: Freistil @de
definition: Un evento con participación de un juez, donde grupos de dos o tres jugadores realizan la mayor cantidad posible de trucos. En las competencias, los jueces pueden usar un sistema de calificación o establecer puntajes para la presentación y ejecución. @es
definition: Variante do frisbee quem que grupos de 2 ou 3 jogadores executam vários truques e são avaliados por juízes, de acordo com a apresentação, execução e grau de dificuldade. @pt-br
definition: 2人または3人のグループが、可能な限り多くのトリックを行って審査される競技。競技で審判は実行と難しさに、ランキング･システムか、またはプレゼンテーションのセットスコアを使うことができる @ja-jp
definition: A judged event where groups of two or three players perform as many tricks as possible. In competitions the judges can use either a ranking system or set scores on presentation, execution and difficulty. @en-gb
definition: Wettbewerb in dem zwei oder drei Spieler ihre Wurf- und Bewegungsakrobatik vorführen, die von einem Wertungsgericht beurteilt werden. Die Bewertung kann durch das Kampfgericht entweder über ein Stufensystem oder durch Punktzahlen für die Präsentation, die Ausführung und den Schwierigkeitsgrad vorgenommen werden. @de
definition: variante du jeu de frisbee @fr
definition: Un evento con la presenza di giudici in cui gruppi di due o tre atleti ciascuno realizzano il maggior numero possibile di lanci acrobatici. Nelle competizioni i giudici possono usare il sistema di classificazione o quello di assegnazione dei punti in base a presentazione, esecuzione e difficoltà
note: nessuno
in scheme: Subject Code
created: 2000-10-30T12:00:00+00:00
modified: 2010-12-15T17:01:09+00:00
broader: Frisbee
broad match: http://cv.iptc.org/newscodes/mediatopic/20000938

Precisione
type: Concept
preferred label: accuracy @en-gb
preferred label: Accuracy @fr
preferred label: precisión @es
preferred label: アキュラシー @ja-jp
definition: variante du jeu de frisbee @fr
definition: Ciascun atleta ha a disposizione 28 lanci da varie distanze e angoli per lanciare il disco attraverso una porta di 1,5 metri x 1,5
definition: Variante do frisbee em que cada jogador tem 28 lançamentos de várias distâncias e ângulos para arremessar o disco por um arco de 1,5 x 1,5 metros. @pt-pt
definition: 各プレーヤーは1.5ｍ四方のゴールを通過させるために、様々な距離や角度から28投する。世界記録は28のうちの25 @ja-jp
definition: Cada jugador tiene 28 lanzamientos desde diversas distancias y ángulos para lanzar el disco a través de un arco de 1,5 x 1,5 metros. El récord mundial es de 25 de 28 posibles. @es
definition: Each player has 28 throws from various distances and angles to throw the disc through a goal 1.5 x 1.5 meters. World record is 25 of 28 possible. @en-gb
definition: Jeder Spieler hat 28 Versuche aus verschiedenen Distanzen und Winkeln durch ein Tor von 1,5 m x 1,5 m zu werfen. Weltrekord ist 25 von 28 möglichen. @de
note: nessuno
in scheme: Subject Code
created: 2000-10-30T12:00:00+00:00
modified: 2010-12-15T17:01:09+00:00
broader: Frisbee
broad match: http://cv.iptc.org/newscodes/mediatopic/20000938

Golf con il disco
type: Concept
preferred label: disc golf @pt-pt
preferred label: Disc-golf @de
preferred label: Disc golf @fr
preferred label: ディスクゴルフ @ja-jp
preferred label: golf de disco @es
definition: ボールゴルフによく似ているが、ボールとクラブの代わりにディスクが使われる。グラウンドのホールの代わりに、ディスクを投げ入れるための軽金属のチェーンがついた金属のバスケットがある。プレイヤーはしばしば長距離投げ用や、右または左カーブ用といったディスクを幾つか携帯する @ja-jp
definition: Much like golf but played with discs instead of balls and clubs. Instead of a hole in the ground there is a metal basket with light metal chains to throw the disc at. Players often carry discs specialized for long throws, right or left bends. @en-gb
definition: Variante de frisbee, semelhante ao golfe, mas jogado com discos em vez de bolas e tacos, que devem ser introduzidos num cesto metálico. @pt-pt
definition: Molto simile al golf con la palla ma al posto delle mazze e delle palle si usano i dischi. E invece di una buca nel terreno c'è un cesto in metallo (fissato su un'asta) con leggere catene in metallo in cui lanciare il disco. Gli atleti spesso portano con sè¨ diversi dischi specifici per lanci lunghi, curvatura a destra o a sinistra, ecc...
definition: Muy similar al golf, pero en lugar de pelotas y palos se usan discos. Y en lugar de un hoyo en el suelo hay un canasto metálico con cadenas metálicas livianas al cual se lanza el disco. Los jugadores llevan varios discos especializados para lanzar. @es
definition: Ähnlich dem Golfsport, aber statt Bällen und Golfschlägern werden Wurfscheiben verwendet. Statt einem Golfloch dient ein Metallkorb aus Leichtmetall als Ziel, in der die Wurfscheibe plaziert werden muss. Die Spieler benutzen häufig verschiedene Wurfscheiben, die spezialisiert sind für lange Würfe, links oder rechts gebogen. @de
definition: Variante de frisbee, semelhante ao golfe, mas jogado com discos em vez de bolas e tacos, que devem ser introduzidos em um cesto metálico. @pt-br
definition: variante du jeu de frisbee @fr
note: nessuno
note: Explanation shortened @en-gb
in scheme: Subject Code
created: 2000-10-30T12:00:00+00:00
modified: 2010-12-15T17:01:09+00:00
broader: Frisbee
broad match: http://cv.iptc.org/newscodes/mediatopic/20000938

Slitta
type: Concept
preferred label: corrida de trenó com cães @pt-pt
preferred label: Schlittenhunderennen @de
preferred label: Sled @fr
preferred label: sled @en-gb
preferred label: 犬ぞり競技 @ja-jp
preferred label: trineo @es
definition: Vor einen Schlitten gespannt. @de
definition: Harnessed to a sled @en-gb
definition: Carrera con perros enganchados a un trineo. @es
definition: Corrida de cães atrelados a um trenó. @pt-br
definition: そりに利用 @ja-jp
definition: course de chiens @fr
definition: Corsa di cani imbrigliati ad una slitta
note: nessuno
in scheme: Subject Code
created: 2000-10-30T12:00:00+00:00
modified: 2010-12-15T17:01:09+00:00
broader: Corsa di cani

Pista ovale
type: Concept
preferred label: Oval track @fr
preferred label: pista oval @pt-br
preferred label: oval track @en-gb
preferred label: Track @de
preferred label: ハイアライ（トラック） @ja-jp
definition: トラックの回りで人工のウサギを追いかける @ja-jp
definition: Pursuing an artificial rabbit around an oval track @en-gb
definition: Inseguimento di un coniglio artificiale su una pista ovale
definition: course de chiens @fr
definition: Corrida de cães perseguindo uma lebre artificial à volta de uma pista oval. @pt-pt
definition: Verfolgungsrennen hinter einem falschen Hasen auf einem ovalen Rundkurs. @de
definition: Persecución de un conejo artificial alrededor de una pista oval. @es
note: nessuno
in scheme: Subject Code
created: 2000-10-30T12:00:00+00:00
modified: 2010-12-15T17:01:09+00:00
broader: Corsa di cani

Agitazioni,Conflitti, Guerre
type: Concept
preferred label: distúrbios, guerras e conflitos @pt-br
preferred label: Guerres et conflits @fr
preferred label: Krise, Krieg, Konflikt @de
preferred label: unrest, conflicts and war @en-gb
preferred label: 戦争・紛争 @ja-jp
preferred label: disturbios, conflictos y guerra @es
definition: Atos de protesto e/ou violência social ou politicamente motivados. @pt-br
definition: Actos de protesta y/o violencia motivados por conflictos sociales o políticos. @es
definition: Atti di protesta e/ o violenza motivati da conflitti sociali o politici
definition: Actes violents ou non de protestation à caractère politique ou social @fr
definition: Acts of socially or politically motivated protest and/or violence. @en-gb
definition: 社会的または政治的な動機による抗議と暴力、またはどちらか一方の行為 @ja-jp
definition: Protest- und/oder Gewaltaktionen, die sozial oder politisch motiviert sind. @de
note: nessuno
in scheme: Subject Code
created: 2000-10-30T12:00:00+00:00
modified: 2010-12-15T17:01:09+00:00
narrower: Terrorismo
narrower: Conflitto armato
narrower: Disordini
narrower: Colpo Stato
narrower: Guerriglia
narrower: Massacro
narrower: Sommossa
narrower: Manifestazione
narrower: Guerra
narrower: Conflitti (generico)
narrower: Crisi
narrower: Armamenti

Terrorismo
type: Concept
preferred label: テロ @ja-jp
preferred label: terrorismo @pt-pt
preferred label: act of terror @en-gb
preferred label: Actes de terrorisme @fr
preferred label: Terrorismus @de
definition: 住民に恐れや心配を引き起こすために企てられた行為で、多くの場合が致命的である暴力行為 @ja-jp
definition: Atti o minacce per suscitare paura e ansia tra la popolazione
definition: Ato de violência, por vezes mortal, para fazer crescer o medo e a ansiedade de uma população. @pt-br
definition: Actes de violence et/ou de terreur @fr
definition: Acto de violencia, a menudo mortal, destinado a causar temor y anciedad en la población. @es
definition: Meist tödliche Gewalttat, um Angst und Schrecken in der Bevölkerung auzulösen. @de
definition: Act of violence, often deadly, designed to raise fear and anxiety in a population @en-gb
note: nessuno
in scheme: Subject Code
created: 2000-10-30T12:00:00+00:00
modified: 2010-12-15T17:01:09+00:00
broader: Agitazioni,Conflitti, Guerre

Conflitto armato
type: Concept
preferred label: 武力紛争 @ja-jp
preferred label: armed conflict @en-gb
preferred label: conflicto armado @es
preferred label: conflito armado @pt-br
preferred label: Bewaffneter Konflikt @de
preferred label: Conflits armés @fr
definition: Disputes between opposing groups involving the use of weaponry, but not formally declared a war @en-gb
definition: Lutte armée entre groupes opposés @fr
definition: Lotta armata messa in atto da gruppi o fazioni opposte con l'uso di mezzi e armi da fuoco, pur non essendo una guerra formalmente dichiarata
definition: Disputas entre grupos opostos, envolvendo o uso de armas, mas não sendo guerra declarada. @pt-br
definition: Disputas entre grupos opositores que envuelven el uso de armas de fuego, pero noconsiderado una guerra declarada. @es
definition: 武器を使用することを含めた敵対集団同士の争い。しかし正式に戦争を宣言していない @ja-jp
definition: Auseinandersetzungen zwischen gegensätzlichen Gruppen, mit dem Einsatz von Waffen aber ohne Kriegserklärung. @de
note: nessuno
in scheme: Subject Code
created: 2000-10-30T12:00:00+00:00
modified: 2010-12-15T17:01:09+00:00
broader: Agitazioni,Conflitti, Guerre

Disordini
type: Concept
preferred label: Unruhen @de
preferred label: civil unrest @en-gb
preferred label: Désordres civils @fr
preferred label: agitação civil @pt-br
preferred label: agitación civil @es
preferred label: 社会不安 @ja-jp
definition: 集会、ストライキ、デモ、妨害行為によって証拠付けられるような一般住民の不安 @ja-jp
definition: Unzufriedenheit innerhalb der Bevölkerung, die sich in Versammlungen, Streiks, Demonstrationen oder Sabotagen ausdrückt. @de
definition: Actividades tales como protestas, marchas, demostraciones públicas o sabotaje que muestran el descontento de la poblacion. @es
definition: Dissatisfaction among the general population as evidenced by rallies, strikes, demonstrations or sabotage @en-gb
definition: Troubles civils, mécontentement de la population se traduisant par la multiplication de grèves, manifestations, voire des sabotages @fr
definition: Insatisfação entre a população geral, conforme comprovado por comícios, greves, manifestações ou sabotagens. @pt-br
definition: Agitazioni civili attuate per es. attraverso adunate, scioperi, dimostrazioni ma anche sabotaggi
definition: Insatisfação entre a população manifestada por comícios, greves, manifestações ou sabotagens. @pt-pt
note: nessuno
in scheme: Subject Code
created: 2000-10-30T12:00:00+00:00
modified: 2010-12-15T17:01:09+00:00
broader: Agitazioni,Conflitti, Guerre
narrower: Rivoluzione
narrower: Ribellione
narrower: Dissenso
narrower: Conflitti religiosi
narrower: Conflitti sociali

Colpo Stato
type: Concept
preferred label: Staatsstreich @de
preferred label: golpe de estado @es
preferred label: クーデター @ja-jp
preferred label: Coup d'état @fr
preferred label: coup d'etat @en-gb
definition: Derrube de um governo estabelecido, feito por um grupo organizado, geralmente militar ou político. @pt-br
definition: 多くの場合軍あるいは政党などの組織された集団により、既に確立している政府が転覆させられること @ja-jp
definition: Derrube de um governo, feito por um grupo organizado, geralmente militar ou político. @pt-pt
definition: El derrocamiento de un gobierno establecido mediante un grupo organizado, frecuentemente militar o partido político. @es
definition: The overthrow of an established government by an organized group, often the military or a political party @en-gb
definition: Coup d'Etat, renversement violent ou non des autorités en place par un groupe organisé @fr
definition: Der Sturz einer etablierten Regierung durch eine organisierte Gruppe, meist das Militär oder eine politische Partei. @de
definition: Rovesciamento di un governo da parte di un gruppo organizzato, spesso un partito politico o la classe militare; Golpe
note: nessuno
in scheme: Subject Code
created: 2000-10-30T12:00:00+00:00
modified: 2010-12-15T17:01:09+00:00
broader: Agitazioni,Conflitti, Guerre

Guerriglia
type: Concept
preferred label: guerrilla @es
preferred label: guerrilha @pt-pt
preferred label: Guerilla @de
preferred label: Guérilla @fr
preferred label: ゲリラ @ja-jp
preferred label: guerrilla activity @en-gb
definition: Ações antigovernamentais de grupos clandestinos armados, mediante ataques súbitos, sabotagem, sequestro, etc. @pt-pt
definition: Actions armées de groupes clandestins, y compris contre des civils, dans le but de déstabiliser un gouvernement @fr
definition: Aktionen von Untergrundgruppen gegen die Regierung, die *hit-and-run*-Techniken oder Sabotage, Entführung oder Geiselnahme und ähnliches einsetzen. @de
definition: Anti-government actions by clandestine groups using hit-and-run techniques or sabotage, kidnapping and the like @en-gb
definition: 秘密組織が電撃的な手法や破壊工作、誘拐およびそれと類似した行為を使って行う反政府行動 @ja-jp
definition: Grupos clandestinos que promueven acciones anti gobierno mediante técnicas de ataques arteros o súbitos, sabotaje, secuestro u otros similares. @es
definition: Azioni contro il potere compiute da gruppi clandestini mediante l'utilizzo di tecniche di colpisci e scappa o di sabotaggio, sequestro, ecc.
note: nessuno
in scheme: Subject Code
created: 2000-10-30T12:00:00+00:00
modified: 2010-12-15T17:01:09+00:00
broader: Agitazioni,Conflitti, Guerre
narrower: Bioterrorismo
narrower: Attentato dinamitardo

Massacro
type: Concept
preferred label: Massacre @fr
preferred label: matanza @es
preferred label: massacre @pt-br
preferred label: Massaker @de
preferred label: 虐殺 @ja-jp
definition: Das Töten einer großen Menschengruppe über einen kurzen Zeitraum. @de
definition: Morte de um grande grupo de pessoas num curto período de tempo. @pt-pt
definition: Morte violenta di un vasto gruppo di persone nell'arco di un breve periodo di tempo
definition: Morte de um grande grupo de pessoas em um curto período de tempo. @pt-br
definition: The death of a large group of people over a brief period of time @en-gb
definition: Massacre, tuerie d'un grand nombre de personnes sur une période brève @fr
definition: La muerte de un grupo grande de personas sobre un breve periodo de tiempo. @es
definition: 短期間に多数の人間を殺害すること @ja-jp
note: nessuno
in scheme: Subject Code
created: 2000-10-30T12:00:00+00:00
modified: 2010-12-15T17:01:09+00:00
broader: Agitazioni,Conflitti, Guerre
narrower: Genocidio

Sommossa
type: Concept
preferred label: émeutes @fr
preferred label: Aufruhr @de
preferred label: motins @pt-br
preferred label: disturbios @es
preferred label: 暴動 @ja-jp
preferred label: riots @en-gb
definition: 暴力、たいてい個人に危害を加えたり、財産を破壊することを含む破壊的なデモ活動 @ja-jp
definition: Emeute, manifestation violente impliquant souvent blessés et destruction de biens publics ou d'autrui @fr
definition: Dimostrazione violenta e distruttiva che spesso implica feriti e distruzioni di proprietà
definition: Manifestações violentas, frequentemente envolvendo feridos e destruição de propriedade. @pt-pt
definition: Desmostraciones violentas y destructivas que normalmente generan heridos y la destrucción de propiedades. @es
definition: Violent, destructive demonstrations often involving injury to individuals and destruction of property @en-gb
definition: Gewaltätige und zerstörerische Demonstration, meist mit Verletzungen von Personen und der Zerstörung von Eigentum verbunden. @de
note: nessuno
in scheme: Subject Code
created: 2000-10-30T12:00:00+00:00
modified: 2010-12-15T17:01:09+00:00
broader: Agitazioni,Conflitti, Guerre

Manifestazione
type: Concept
preferred label: Manifestations @fr
preferred label: デモ @ja-jp
preferred label: manifestaciones violentas @es
preferred label: Demonstration @de
preferred label: manifestação @pt-pt
preferred label: demonstration @en-gb
definition: La muestra pública violenta de sentimientos u opinones mediante grandes concentraciones o marchas. @es
definition: Demonstração pública de sentimentos ou opiniões através de concentrações ou marchas de caráter político e/ou social. @pt-br
definition: A public show of feeling or opinion, as by a mass meeting or parade @en-gb
definition: Manifestation organisée à caractère politique et/ou social @fr
definition: Pubblica dimostrazione organizzata in piazza di carattere politico o sociale, ma anche una riunione di massa o una parata
definition: Öffentliche Meinungsäußerung in Form einer Massenveranstaltung oder Parade. @de
definition: 大規模集会や行進によって感情や意見を公に表現すること @ja-jp
note: name changed from: violent demonstration @en-gb
note: alla versione 9: dimostrazione violenta
note: up to version 9: violent demonstration @es
in scheme: Subject Code
created: 2003-11-26T12:00:00+00:00
modified: 2012-07-10T12:00:00+00:00
broader: Agitazioni,Conflitti, Guerre

Guerra
type: Concept
preferred label: guerra @es
preferred label: war @en-gb
preferred label: Guerre @fr
preferred label: 戦争 @ja-jp
preferred label: Krieg @de
definition: A formal declaration of hostilities by one country against another @en-gb
definition: Declaração formal de hostilidades de um país a outro. @pt-pt
definition: Eine formale Feindschaftserklärung des einen Landes gegen ein anderes. @de
definition: La declaracionformal de hostilidades de un país hacia otro. @es
definition: 一つの国が別の国に対して行う交戦状態の正式な宣言 @ja-jp
definition: Formale dichiarazione di ostilità di un paese nei confronti di un altro
definition: Guerre entre pays @fr
note: nessuno
in scheme: Subject Code
created: 2000-10-30T12:00:00+00:00
modified: 2010-12-15T17:01:09+00:00
broader: Agitazioni,Conflitti, Guerre
narrower: Guerra civile
narrower: Intervento militare internazionale
narrower: Prigionieri Guerra

Conflitti (generico)
type: Concept
preferred label: conflict (general) @en-gb
preferred label: Conflits @fr
preferred label: conflitos (geral) @pt-pt
preferred label: conflicto (general) @es
preferred label: 紛争（一般） @ja-jp
preferred label: Konflikt @de
definition: いくつかのレベルにあることができる論争 @ja-jp
definition: Auseinandersetzung, die auf verschiedenen Ebenen stattfinden kann. @de
definition: Una disputa que puede generarse en distintos niveles. @es
definition: Les différents niveaux d'un conflit @fr
definition: Disputa que pode ocorrer a vários níveis. @pt-pt
definition: Disputa a diversi livelli
definition: A dispute which can be at several levels, @en-gb
note: nessuno
in scheme: Subject Code
created: 2000-10-30T12:00:00+00:00
modified: 2010-12-15T17:01:09+00:00
broader: Agitazioni,Conflitti, Guerre
narrower: Peacekeeping
broad match: http://cv.iptc.org/newscodes/mediatopic/16000000

Crisi
type: Concept
preferred label: crisis @es
preferred label: crises @pt-br
preferred label: 危機 @ja-jp
preferred label: Crise @fr
preferred label: Krise @de
definition: 政府が陥落する、戦争が起きる、株式市場が崩壊するなどの事象が起きうるレベルまでに高まったあらゆる摩擦 @ja-jp
definition: Konflikte aller Art, die sich zu einer Stufe entwickeln können, abhängig von Ereignissen, bei denen Regierungen gestürzt werden können, Kriege erklärt werden können, Börsenmärkte zusammenbrechen können, oder auch nicht. @de
definition: Stato di crisi politica, economica, finanziaria a vari livelli
definition: L'état de crise politique, économique et financière @fr
definition: Conflitos de todos os tipos que, dependendo dos eventos, podem gerar queda de governos, declaração de guerra ou queda de mercados bolsistas. @pt-pt
definition: Conflictos de toda clase que pueden generar , dependiendo de los eventos, la caida de gobiernos, declaración de guerra o la caida de los mercados bursatiles. @es
definition: Conflitos de todo tipo que, dependendo dos eventos, podem gerar queda de governos, declaração de guerra ou queda de mercados bolsistas. @pt-br
definition: Conflict of all kinds that rises to a level where, depending on events, governments can fall, war be declared or stock markets crash, or not @en-gb
note: nessuno
in scheme: Subject Code
created: 2000-10-30T12:00:00+00:00
modified: 2010-12-15T17:01:09+00:00
broader: Agitazioni,Conflitti, Guerre

Armamenti
type: Concept
preferred label: armas @es
preferred label: weaponry @en-gb
preferred label: armamento @pt-br
preferred label: 軍備 @ja-jp
preferred label: Waffen @de
preferred label: Armement @fr
definition: Armamento de todo tipo utilizado en la conducción de la guerra. @es
definition: Waffen aller Art, die während des Krieges genutzt werden. @de
definition: Armaments of all types used to conduct war @en-gb
definition: 戦争に使用されるあらゆる種類の軍備 @ja-jp
definition: Armamento de todo tipo usado em uma guerra. @pt-br
definition: Armamento de todos os tipos usado numa guerra. @pt-pt
definition: Armamenti di tutti i tipi usati per condurre una guerra
definition: armement utilisé pour la guerre @fr
note: nessuno
in scheme: Subject Code
created: 2000-10-30T12:00:00+00:00
modified: 2010-12-15T17:01:09+00:00
broader: Agitazioni,Conflitti, Guerre

Rivoluzione
type: Concept
preferred label: revoluções @pt-pt
preferred label: Revolution @de
preferred label: 革命 @ja-jp
preferred label: revoluciones @es
preferred label: revolutions @en-gb
preferred label: Révolutions @fr
definition: Cambiamento spesso attuato in forma violenta del sistema di governo di una nazione realizzato da forze interne, con cambiamenti anche del sistema sociale
definition: Révolution, changement généralement violent de système politique et social dans un pays @fr
definition: An often violent change in a nation's system of government by internal forces that results in systematic social change. @en-gb
definition: Ein meist gewaltätiger Wechsel der Regierung eines Landes durch interne Kräfte, die in systematische soziale Veränderungen mündet. @de
definition: A menudo es un violento cambio en el sistema de gobierno de un país hecho por fuerzas internas dando resultado un cambio social sistemático. @es
definition: Alteração por vezes violenta do sistema governativo de um país, feita por forças internas que provocam mudanças sociais sistemáticas. @pt-br
definition: 政府が確立した国内体制に対しての内部勢力による劇的な変化であり、結果的に組織的な社会変動をもたらす @ja-jp
note: nessuno
in scheme: Subject Code
created: 2003-04-05T12:00:00+00:00
modified: 2012-07-10T12:00:00+00:00
broader: Disordini

Ribellione
type: Concept
preferred label: Rebellion @de
preferred label: rebeliões @pt-br
preferred label: rebellions @en-gb
preferred label: 反乱 @ja-jp
preferred label: Rébellions @fr
preferred label: rebeliones @es
definition: 必ずしも社会変動の達成を目的としているわけではない、政府を打倒することを意図とした、国民による武装蜂起 @ja-jp
definition: Rivolta contro il potere precostituito, insurrezione con l'intento di rovesciare il governo, senza necessariamente attuare dei cambiamenti sociali
definition: Armed uprising by citizens of a nation with the intent to overthrow the government, without necessarily achieving social change @en-gb
definition: Insurreição armada de cidadãos de um país com intuito de derrubar o governo, sem necessariamente alcançar mudanças sociais. @pt-br
definition: Insurreição armada de cidadãos de um país com intuito de derrubar o governo, para tentar mudanças sociais. @pt-pt
definition: Bewaffneter Aufruhr der Bevölkerung einer Nation, mit dem Ziel die Regierung zu stürzen ohne zwingend soziale Veränderungen erreichen zu wollen. @de
definition: Rébellion, révolte contre le pouvoir en place @fr
definition: Insurrección armada hecha por ciudadanos de un país con la intención de derrocar al gobierno, sin necesariamente alcanzar un cambio social. @es
note: nessuno
in scheme: Subject Code
created: 2003-04-05T12:00:00+00:00
modified: 2012-07-10T12:00:00+00:00
broader: Disordini

Dissenso
type: Concept
preferred label: dissidência política @pt-br
preferred label: Dissidence @fr
preferred label: 政治対立 @ja-jp
preferred label: Politische Unruhen @de
preferred label: political dissent @en-gb
preferred label: disenso político @es
definition: Desacuerdo entre grupos políticos, generalmente organizados y algunas veces dando en resultado en encarcelamiento de los disidentes @es
definition: Disobbedienza politica rispetto all'ordine precostituito, che a volte porta a persecuzioni dei dissidenti
definition: Disagreement between political groups, usually organized and sometimes resulting in imprisonment of the dissenters @en-gb
definition: Desacordo entre indivíduos e grupos políticos, podendo daí resultar a prisão de quem manifesta divergências. @pt-pt
definition: 通常、組織化されて、時折、反対者の投獄をもたらす政治団体間の意見の相違 @ja-jp
definition: Acte de désobéissance à l'ordre établi de la part d'individus ou de groupes politiques @fr
definition: Desacordo entre indivíduos e grupos políticos, podendo daí resultar a prisão de dissidentes. @pt-br
definition: Missverständniss zwischen politischen Gruppen, in der Regel organisiert, die manchmal in Verhaftungen münden. @de
note: nessuno
in scheme: Subject Code
created: 2003-04-05T12:00:00+00:00
modified: 2012-07-10T12:00:00+00:00
broader: Disordini

Conflitti religiosi
type: Concept
preferred label: Religiöser Konflikt @de
preferred label: Conflit religieux @fr
preferred label: religious conflict @en-gb
preferred label: conflictos religiosos @es
preferred label: 宗教紛争 @ja-jp
preferred label: conflito religioso @pt-br
definition: Konflikte, die religiöse Unterschiede miteinbeziehen. @de
definition: 宗教的相違から生じる衝突 @ja-jp
definition: Conflictos que incluyen diferencias religiosas. @es
definition: Lutte, opposition entre les tenants de croyances différentes @fr
definition: Conflicts involving religious differences @en-gb
definition: Conflitos envolvendo diferenças religiosas. @pt-br
definition: Scontri e lotte fra i fedeli di diverse religioni
note: nessuno
in scheme: Subject Code
created: 2003-04-05T12:00:00+00:00
modified: 2012-07-10T12:00:00+00:00
broader: Disordini

Conflitti sociali
type: Concept
preferred label: 社会紛争 @ja-jp
preferred label: Sozialer Konflikt @de
preferred label: Conflit social @fr
preferred label: conflito social @pt-pt
preferred label: social conflict @en-gb
preferred label: conflictos sociales @es
definition: Lotte e opposizioni fra gruppi di diversa estrazione sociale
definition: Conflicts involving social differences @en-gb
definition: Conflitos envolvendo diferenças sociais. @pt-pt
definition: Conflictos que incluyen diferencias sociales. @es
definition: Konflikte, die soziale Unterschiede miteinbeziehen. @de
definition: 社会的相違から生じる衝突 @ja-jp
definition: Lutte, opposition entre deux groupes sociaux tels que le patronat et les syndicats @fr
note: nessuno
in scheme: Subject Code
created: 2003-04-05T12:00:00+00:00
modified: 2012-07-10T12:00:00+00:00
broader: Disordini
broad match: http://cv.iptc.org/newscodes/mediatopic/16000000

Bioterrorismo
type: Concept
preferred label: Bioterrorisme @fr
preferred label: bioterrorismo @pt-pt
preferred label: Bioterrorismus @de
preferred label: 生物テロ @ja-jp
preferred label: bioterrorism @en-gb
definition: Utilisation de substances biologiques ou chimiques dans le but de provoquer la terreur des populations @fr
definition: Utilização de substâncias biológicas ou químicas para aumentar o nível de medo da população, com ou sem mortes. @pt-br
definition: Uso offensivo di agenti biologici o chimici per aumentare il livello di panico all'interno di una popolazione
definition: 生死に関わらず、人々の恐怖心を増長させる生物製剤の使用 @ja-jp
definition: Einsatz von biologischen Kampfstoffen, um die Angst innerhalb der Bevölkerung zu steigern, ob tödlich oder nicht. @de
definition: Use of biological agent to raise the level of fear within a population, whether deaths occur or not. @en-gb
definition: Uso de un agente biológico para aumentar el nivel de temor dentro de una población, haya o no muerte. @es
note: nessuno
in scheme: Subject Code
created: 2003-04-05T12:00:00+00:00
modified: 2012-07-10T12:00:00+00:00
broader: Guerriglia

Attentato dinamitardo
type: Concept
preferred label: 爆弾テロ @ja-jp
preferred label: atentados à bomba @pt-pt
preferred label: bombardeo @es
preferred label: Bombenattentat @de
preferred label: Explosion de bombes @fr
preferred label: bombings @en-gb
definition: Action d'attaquer par bombes ou obus une cible matérielle @fr
definition: Uso de dispositivos explosivos contras pessoas, edifícios ou estruturas. @pt-br
definition: Einsatz von explosiven Materialien gegen Menschen, Gebäude oder Bauwerke. @de
definition: Uso de aparatos explosivos contra las personas, edificios o estructuras. @es
definition: Use of explosive devices against people, buildings or structures @en-gb
definition: Uso di dispositivi esplosivi contro persone, edifici o strutture
definition: 人々、建物あるいは構造物に対する爆発装置の使用 @ja-jp
note: nessuno
in scheme: Subject Code
created: 2003-04-05T12:00:00+00:00
modified: 2012-07-10T12:00:00+00:00
broader: Guerriglia

Genocidio
type: Concept
preferred label: genocidio @es
preferred label: genocídio @pt-pt
preferred label: genocide @en-gb
preferred label: Génocide @fr
preferred label: 大量虐殺 @ja-jp
preferred label: Völkermord @de
definition: Sterminio di un clan, tribù, etnia o popolo
definition: 一族、部族、または少数民族に対する、他者による組織的な殺害 @ja-jp
definition: Systematic killing of one clan, tribe or ethnic type by another @en-gb
definition: Elimination ethnique massive @fr
definition: Sistemática matanza de un clan, tribu o clase étnica por otra. @es
definition: Systematisches Töten einer Glaubensgemeinschaft, eines Volkstammes oder einer ethnischen Gruppe durch eine andere. @de
definition: Morte sistemática de clã, tribo ou grupo étnico por outro. @pt-pt
note: nessuno
in scheme: Subject Code
created: 2003-04-05T12:00:00+00:00
modified: 2012-07-10T12:00:00+00:00
broader: Massacro

Guerra civile
type: Concept
preferred label: Bürgerkrieg @de
preferred label: guerra civil @es
preferred label: Guerre civile @fr
preferred label: 内戦 @ja-jp
preferred label: civil war @en-gb
definition: Conflito armado entre membros de um país ou de uma região geográfica, em alguns casos com intenção de causar a divisão do país ou da região. @pt-pt
definition: Armed conflict between members of the same nation or geographical region, in some cases with a desire to divide the nation or region. @en-gb
definition: Conflitto armato tra membri di una stessa nazione o regione geografica, in alcuni casi finalizzato a dividere la nazione/regione
definition: Affrontement violent et armé entre groupes organisés d'un même pays @fr
definition: Conflicto armado entre miembros de un mismo país o región geográfica, en algunos casos con la intención de dividir a un país o región.. @es
definition: 同国または地理的に同一地区の人々の紛争、時に国または地域を分割しようとする紛争 @ja-jp
definition: Bewaffneter Konflikt zwischen Mitgliedern einer Nation oder geografischen Region, manchmal mit dem Wunsch, diese zu teilen. @de
note: nessuno
in scheme: Subject Code
created: 2003-04-05T12:00:00+00:00
modified: 2012-07-10T12:00:00+00:00
broader: Guerra

Intervento militare internazionale
type: Concept
preferred label: Internationale militärische Intervention @de
preferred label: intervenciones militares internacionales @es
preferred label: 武力介入 @ja-jp
preferred label: intervenção militar internacional @pt-pt
preferred label: international military intervention @en-gb
preferred label: Interventions militaires @fr
definition: Uso temporário de forças internacionais, seja por convite ou por decisão de órgão estrangeiro, num país ou numa região com intenção de resolver uma crise. @pt-pt
definition: Temporäre Nutzung von Internationalen Streitkräften durch Aufforderung oder Entscheidung von Außenstehenden eines anderen Landes oder Region mit der Absicht eine Krise aufzulösen. @de
definition: Uso di forze militari internazionali in una nazione/regione su invito o decisione di una istituzione esterna con lo scopo di risolvere una crisi
definition: Empleo temporal de fuerzas internacionales por medio de una invitación o decisión de un cuerpo extranjero en otro país región con el propósito de resolver una crisis. @es
definition: 危機を解決する目的で、他国や地域における内部からの要請、または外部からの決定による一時的な国際軍事力の使用 @ja-jp
definition: Temporary use of international forces by invitation or by a decision of an outside body in another country or region for the purpose of resolving a crisis. @en-gb
definition: Force armée internationale s'interposant temporairement entre des bélligérants dans un processus de paix @fr
note: nessuno
in scheme: Subject Code
created: 2003-04-05T12:00:00+00:00
modified: 2012-07-10T12:00:00+00:00
broader: Guerra

Prigionieri Guerra
type: Concept
preferred label: 捕虜・抑留者 @ja-jp
preferred label: prisoners and detainees @en-gb
preferred label: Kriegsgefangene @de
preferred label: prisioneiros e detidos @pt-br
preferred label: Prisonniers et détenus @fr
preferred label: prisioneros y detenidos @es
definition: Prisonniers et détenus pendant une guerre ou un conflit armé @fr
definition: Personas capturadas y retenidas por sus enemigos durante una guerra o conflicto armado. @es
definition: 戦争や武力紛争の期間に敵に捕虜にされたり、投獄された人々 @ja-jp
definition: People captured and imprisoned by their enemy during war or armed conflict @en-gb
definition: As pessoas capturadas e presas pelo inimigo durante guerras e conflitos armados. @pt-br
definition: Menschen, die während eines Krieges oder eines bewaffneten Konflikts von den Gegnern gefangengehalten werden. @de
definition: Persone catturate e imprigionate durante una guerra o un conflitto armato
note: nessuno
in scheme: Subject Code
created: 2003-11-26T12:00:00+00:00
modified: 2012-07-10T12:00:00+00:00
broader: Guerra

Peacekeeping
type: Concept
preferred label: 平和維持軍 @ja-jp
preferred label: Forces de maintien de la paix @fr
preferred label: força de paz @pt-pt
preferred label: fuerza de paz @es
preferred label: Friedenstruppe @de
preferred label: peacekeeping force @en-gb
definition: Forças militares de diferentes nacionalidade agrupadas sob comando internacional para manter a ordem em áreas de conflito. @pt-pt
definition: Fuerzas militares de distinta nacionalidad unificadas bajo un comando Internacional para mantener el orden de áreas en disputa. @es
definition: Varied national military forces under unified international command to maintain order in disputed areas. @en-gb
definition: Forces armées de plusieurs pays destinées, sous un commandement international unique, à maintenir l'ordre dans des zones en conflit @fr
definition: 紛争が起きている地域で秩序を維持する、国際的な指揮の下で一体になった様々な国立軍事力 @ja-jp
definition: Verschiedene militärische Truppen unter einem internationalen Kommando, um die Stabilität in Konfliktregionen zu sichern. @de
definition: Forze militari di varie nazioni sotto un comando unificato internazionale incaricate di mantenere l'ordine e la pace in aree in conflitto tra loro
note: to version 9: violent demonstration @fr
note: nessuno
in scheme: Subject Code
created: 2004-10-13T12:00:00+00:00
modified: 2012-07-10T12:00:00+00:00
broader: Conflitti (generico)

Meteo
type: Concept
preferred label: weather @en-gb
preferred label: Météo @fr
preferred label: meteorologia @pt-br
preferred label: Wetter @de
preferred label: 気象 @ja-jp
preferred label: meteorología @es
definition: Estudo, relatório e previsão de fenómenos meteorológicos. @pt-pt
definition: Etude et prévision des phénomènes météo @fr
definition: Studio, previsione e bollettini riguardanti i fenomeni meteorologici
definition: The study, reporting and prediction of meteorological phenomena. @en-gb
definition: Studien, Berichte und Vorhersagen meteorologischer Phänomene. @de
definition: El estudio, informe y predicción de fenómenos meteorológicos. @es
definition: 気象現象の研究、リポートおよび予測 @ja-jp
definition: Estudo, relatório e previsão de fenômenos meteorológicos. @pt-br
note: nessuno
in scheme: Subject Code
created: 2000-10-30T12:00:00+00:00
modified: 2010-12-15T17:01:09+00:00
narrower: Previsioni
narrower: Cambiamenti climatici
narrower: Bollettini meteo
narrower: Statistiche
narrower: Allerta meteo

Previsioni
type: Concept
preferred label: previsão meteorológica @pt-br
preferred label: Prévisions @fr
preferred label: forecast @en-gb
preferred label: Vorhersage @de
preferred label: 天気予報 @ja-jp
preferred label: pronósticos @es
definition: Prévisions météo @fr
definition: Previsão do tempo meteorológico a curto e a longo prazo. @pt-br
definition: Prediction of the course of the weather in the future either near term or long term @en-gb
definition: Previsioni sullo stato del tempo a breve o lungo termine
definition: 短期間か長期間のどちらかにおける、将来の天気の推移予測 @ja-jp
definition: Vorhersage über den Verlauf des Wetters sowohl für einen kürzeren als auch längeren zukünftigen Zeitraum. @de
definition: Predicción del curso del clima en el futuro cercano o a largo plazo. @es
note: nessuno
in scheme: Subject Code
created: 2000-10-30T12:00:00+00:00
modified: 2010-12-15T17:01:09+00:00
broader: Meteo

Cambiamenti climatici
type: Concept
preferred label: alterações climáticas @pt-pt
preferred label: évolutions climatiques @fr
preferred label: Klimaveränderung @de
preferred label: cambios climáticos @es
preferred label: global change @en-gb
preferred label: 気候変動 @ja-jp
definition: Determinazione delle condizioni globali del pianeta e dei cambiamenti globali del clima
definition: Tout ce qui concerne le changement climatique @fr
definition: Situación generada por el calentamiento o enfriamiento de la Tierra, o el cambio en los niveles del océano. @es
definition: Identificação de situações geradas por aquecimento ou arrefecimento da Terra, mudanças dos níveis da água do mar, etc. @pt-br
definition: 地球全体がだんだん暖かくなっているか寒くなっているかどうかや海面がだんだん上昇しているのか低下しているのかなどの変化 @ja-jp
definition: The determination whether the Earth is getting warm, or colder, whether seas are rising or falling and the like @en-gb
definition: Ermittlung ob die Erde wärmer oder kälter wird, der Meeresspiegel steigt oder fällt und Ähnliches. @de
note: nessuno
in scheme: Subject Code
created: 2000-10-30T12:00:00+00:00
modified: 2010-12-15T17:01:09+00:00
broader: Meteo

Bollettini meteo
type: Concept
preferred label: boletim meteorológico @pt-br
preferred label: report @en-gb
preferred label: boletines @es
preferred label: 気象報告 @ja-jp
preferred label: Wetterbericht @de
preferred label: Bulletins @fr
definition: bulletin météo @fr
definition: 気象に関するあらゆる配布資料 @ja-jp
definition: Annunci che vengono diffusi in vario modo sulle condizioni meteo
definition: Difusão de qualquer anúncio relacionado com a previsão do tempo. @pt-br
definition: Difusão de qualquer anúncio relacionado com a previsão do tempo atmosférico. @pt-pt
definition: Any distributed announcement about the weather @en-gb
definition: Cualquier anuncio relacionado a pronosticos del tiempo. @es
definition: Jede verbreitete Ankündigung über das Wetter. @de
note: nessuno
in scheme: Subject Code
created: 2000-10-30T12:00:00+00:00
modified: 2010-12-15T17:01:09+00:00
broader: Meteo
narrower: Notizie meteo
broad match: http://cv.iptc.org/newscodes/mediatopic/17000000

Statistiche
type: Concept
preferred label: Statistiques @fr
preferred label: 気象統計 @ja-jp
preferred label: statistic @en-gb
preferred label: estatísticas (Meteo) @pt-br
preferred label: Wetterdaten @de
preferred label: estadísticas @es
definition: Numerical facts about the weather such as temperature, barometric pressure, river levels, humidity, high and low tides and the like @en-gb
definition: Información numerica acerca datos climatologicos tales como temperaturas, presión barométrica, nivel de los rios, humedad, mareas altas o bajas u otros similares. @es
definition: 温度、気圧、川の水位、湿度、干満潮のような気象に関する数値的事実 @ja-jp
definition: Fatos numéricos sobre o tempo, como temperatura, pressão atmosférica, níveis dos rios, umidade, marés altas e marés baixas, etc. @pt-br
definition: Factos numéricos sobre o tempo, como temperatura, pressão atmosférica, níveis dos rios, humidade, marés altas e marés baixas, etc. @pt-pt
definition: Daten über das Wetter, wie Temperatur, Luftdruck, Flusspegel, Luftfeuchtigkeit, Ebbe und Flut und Ähnliches. @de
definition: Statistiche con dati meteorologici come temperatura, pressione barometrica, livello dei fiumi, alta e bassa marea, ecc.
definition: Informations chiffrées sur la température, la pression barométrique, le niveau des rivières, de l'hydrométrie, des marées @fr
note: nessuno
in scheme: Subject Code
created: 2000-10-30T12:00:00+00:00
modified: 2010-12-15T17:01:09+00:00
broader: Meteo

Allerta meteo
type: Concept
preferred label: warning @en-gb
preferred label: alertas @pt-br
preferred label: Unwetterwarnung @de
preferred label: Alertes @fr
preferred label: advertencia @es
preferred label: 気象警報 @ja-jp
definition: Alertas gerais à população sobre a aproximação de mau tempo. @pt-br
definition: Warnungen an die gesamte Bevölkerung vor heranziehendem Unwetter. @de
definition: Alerts to the general populace about severe weather coming their way @en-gb
definition: alertes météorologiques @fr
definition: Alertas a la población general sobre severas condiciones meteorológicas que se aproximan @es
definition: 来るべき厳しい気候に関する一般大衆への警告 @ja-jp
definition: Allarmi generali per avvertire la popolazione sull'arrivo di gravi condizioni meteorologiche
note: nessuno
in scheme: Subject Code
created: 2000-10-30T12:00:00+00:00
modified: 2010-12-15T17:01:09+00:00
broader: Meteo

Notizie meteo
type: Concept
preferred label: weather news @en-gb
preferred label: Wetternachrichten @de
preferred label: informação meteorológica @pt-pt
preferred label: Informations météorologiques @fr
preferred label: 気象情報 @ja-jp
preferred label: informações meteorológicas @pt-br
preferred label: información general sobre el eventos climatológicos @es
definition: Informação geral sobre fenômenos meteorológicos. @pt-br
definition: Generelle Informationen über Ereignisse das Wetter betreffend. @de
definition: Información general acerca eventos climatologicos. @es
definition: relevé des données climatiques @fr
definition: Informação geral sobre fenómenos meteorológicos. @pt-pt
definition: 気象に関する一般的な情報 @ja-jp
definition: Informazioni generali sugli eventi meteo
definition: General information about weather events @en-gb
note: nessuno
in scheme: Subject Code
created: 2004-04-22T12:00:00+00:00
modified: 2012-07-10T12:00:00+00:00
broader: Bollettini meteo
broad match: http://cv.iptc.org/newscodes/mediatopic/17000000