corrects resource
type: Concept
definition: Indicates that this news item corrects the referenced news item
note: This vocabulary was created through IPTC's adoption of The Trust Project's Trust Indicators® and collaboration with the Journalism Trust Initiative
in scheme: trustindicator
created: 2019-12-19T12:00:00+00:00
modified: 2019-12-19T12:00:00+00:00
broader: pieceOfWorkInfo
broad match: CorrectionComment