diversity staffing report
type: Concept
definition: A report on staffing diversity issues. In a news context this might be for example ASNE or RTDNA (US) reports, or self-reported.
note: This vocabulary was created through IPTC's adoption of The Trust Project's Trust Indicators® and collaboration with the Journalism Trust Initiative
in scheme: trustindicator
created: 2019-12-19T12:00:00+00:00
modified: 2019-12-19T12:00:00+00:00
broader: organisationInfo