Facebook Likes
type: Concept
definition: Indicates that the user interaction was measured by Facebook likes.
in scheme: useractiontype
created: 2013-02-14T12:00:00+00:00
modified: 2013-02-14T12:00:00+00:00
retired: 2024-02-13T12:00:00+00:00