Value was derived by look-up
type: Concept
definition: Property value was derived by look-up in a taxonomy/database
in scheme: whypresent
created: 2008-01-29T01:00:00+00:00
modified: 2010-12-15T22:09:42+00:00